<svg width="390" height="844" viewBox="0 0 390 844" fill="none" xmlns="http://www.w3.org/2000/svg">
<g clip-path="url(#clip0_14_78)">
<rect width="390" height="844" fill="#171616"/>
<rect x="-2" width="392" height="75" fill="#171616" fill-opacity="0.96"/>
<path d="M15.728 49.888H19.312V52H12.992V40.768H15.728V49.888ZM24.633 49.44L26.569 43.072H29.481L26.313 52H22.937L19.769 43.072H22.697L24.633 49.44ZM33.3686 40.16V52H30.6326V40.16H33.3686ZM46.694 42.704H41.702V44.912C41.9153 44.6773 42.214 44.4853 42.598 44.336C42.982 44.1867 43.398 44.112 43.846 44.112C44.646 44.112 45.3073 44.2933 45.83 44.656C46.3633 45.0187 46.7527 45.488 46.998 46.064C47.2433 46.64 47.366 47.264 47.366 47.936C47.366 49.184 47.014 50.176 46.31 50.912C45.606 51.6373 44.614 52 43.334 52C42.4807 52 41.7393 51.856 41.11 51.568C40.4807 51.2693 39.9953 50.8587 39.654 50.336C39.3127 49.8133 39.126 49.2107 39.094 48.528H41.766C41.83 48.8587 41.9847 49.136 42.23 49.36C42.4753 49.5733 42.8113 49.68 43.238 49.68C43.7393 49.68 44.1127 49.52 44.358 49.2C44.6033 48.88 44.726 48.4533 44.726 47.92C44.726 47.3973 44.598 46.9973 44.342 46.72C44.086 46.4427 43.7127 46.304 43.222 46.304C42.8593 46.304 42.5607 46.3947 42.326 46.576C42.0913 46.7467 41.9367 46.976 41.862 47.264H39.222V40.304H46.694V42.704Z" fill="white"/>
<path d="M15.728 24.888H19.312V27H12.992V15.768H15.728V24.888ZM24.681 27.128C23.8063 27.128 23.017 26.9413 22.313 26.568C21.6197 26.1947 21.0703 25.6613 20.665 24.968C20.2703 24.2747 20.073 23.464 20.073 22.536C20.073 21.6187 20.2757 20.8133 20.681 20.12C21.0863 19.416 21.641 18.8773 22.345 18.504C23.049 18.1307 23.8383 17.944 24.713 17.944C25.5877 17.944 26.377 18.1307 27.081 18.504C27.785 18.8773 28.3397 19.416 28.745 20.12C29.1503 20.8133 29.353 21.6187 29.353 22.536C29.353 23.4533 29.145 24.264 28.729 24.968C28.3237 25.6613 27.7637 26.1947 27.049 26.568C26.345 26.9413 25.5557 27.128 24.681 27.128ZM24.681 24.76C25.2037 24.76 25.6463 24.568 26.009 24.184C26.3823 23.8 26.569 23.2507 26.569 22.536C26.569 21.8213 26.3877 21.272 26.025 20.888C25.673 20.504 25.2357 20.312 24.713 20.312C24.1797 20.312 23.737 20.504 23.385 20.888C23.033 21.2613 22.857 21.8107 22.857 22.536C22.857 23.2507 23.0277 23.8 23.369 24.184C23.721 24.568 24.1583 24.76 24.681 24.76ZM33.5405 19.56C33.8605 19.0693 34.2605 18.6853 34.7405 18.408C35.2205 18.12 35.7538 17.976 36.3405 17.976V20.872H35.5885C34.9058 20.872 34.3938 21.0213 34.0525 21.32C33.7112 21.608 33.5405 22.12 33.5405 22.856V27H30.8045V18.072H33.5405V19.56ZM37.1043 22.52C37.1043 21.6027 37.2749 20.7973 37.6163 20.104C37.9683 19.4107 38.4429 18.8773 39.0403 18.504C39.6376 18.1307 40.3043 17.944 41.0403 17.944C41.6269 17.944 42.1603 18.0667 42.6403 18.312C43.1309 18.5573 43.5149 18.888 43.7923 19.304V15.16H46.5283V27H43.7923V25.72C43.5363 26.1467 43.1683 26.488 42.6883 26.744C42.2189 27 41.6696 27.128 41.0403 27.128C40.3043 27.128 39.6376 26.9413 39.0403 26.568C38.4429 26.184 37.9683 25.6453 37.6163 24.952C37.2749 24.248 37.1043 23.4373 37.1043 22.52ZM43.7923 22.536C43.7923 21.8533 43.6003 21.3147 43.2163 20.92C42.8429 20.5253 42.3843 20.328 41.8403 20.328C41.2963 20.328 40.8323 20.5253 40.4483 20.92C40.0749 21.304 39.8883 21.8373 39.8883 22.52C39.8883 23.2027 40.0749 23.7467 40.4483 24.152C40.8323 24.5467 41.2963 24.744 41.8403 24.744C42.3843 24.744 42.8429 24.5467 43.2163 24.152C43.6003 23.7573 43.7923 23.2187 43.7923 22.536ZM58.7956 27.656V30.28H48.8756V27.656H58.7956ZM69.072 15.768V17.96H66.096V27H63.36V17.96H60.384V15.768H69.072ZM73.1811 19.56C73.5011 19.0693 73.9011 18.6853 74.3811 18.408C74.8611 18.12 75.3945 17.976 75.9811 17.976V20.872H75.2291C74.5465 20.872 74.0345 21.0213 73.6931 21.32C73.3518 21.608 73.1811 22.12 73.1811 22.856V27H70.4451V18.072H73.1811V19.56ZM76.7449 22.52C76.7449 21.6027 76.9155 20.7973 77.2569 20.104C77.6089 19.4107 78.0835 18.8773 78.6809 18.504C79.2782 18.1307 79.9449 17.944 80.6809 17.944C81.3102 17.944 81.8595 18.072 82.3289 18.328C82.8089 18.584 83.1769 18.92 83.4329 19.336V18.072H86.1689V27H83.4329V25.736C83.1662 26.152 82.7929 26.488 82.3129 26.744C81.8435 27 81.2942 27.128 80.6649 27.128C79.9395 27.128 79.2782 26.9413 78.6809 26.568C78.0835 26.184 77.6089 25.6453 77.2569 24.952C76.9155 24.248 76.7449 23.4373 76.7449 22.52ZM83.4329 22.536C83.4329 21.8533 83.2409 21.3147 82.8569 20.92C82.4835 20.5253 82.0249 20.328 81.4809 20.328C80.9369 20.328 80.4729 20.5253 80.0889 20.92C79.7155 21.304 79.5289 21.8373 79.5289 22.52C79.5289 23.2027 79.7155 23.7467 80.0889 24.152C80.4729 24.5467 80.9369 24.744 81.4809 24.744C82.0249 24.744 82.4835 24.5467 82.8569 24.152C83.2409 23.7573 83.4329 23.2187 83.4329 22.536ZM91.7803 27.128C91.0016 27.128 90.3083 26.9947 89.7003 26.728C89.0923 26.4613 88.6123 26.0987 88.2603 25.64C87.9083 25.1707 87.7109 24.648 87.6683 24.072H90.3723C90.4043 24.3813 90.5483 24.632 90.8043 24.824C91.0603 25.016 91.3749 25.112 91.7483 25.112C92.0896 25.112 92.3509 25.048 92.5323 24.92C92.7243 24.7813 92.8203 24.6053 92.8203 24.392C92.8203 24.136 92.6869 23.9493 92.4203 23.832C92.1536 23.704 91.7216 23.5653 91.1243 23.416C90.4843 23.2667 89.9509 23.112 89.5243 22.952C89.0976 22.7813 88.7296 22.52 88.4203 22.168C88.1109 21.8053 87.9563 21.32 87.9563 20.712C87.9563 20.2 88.0949 19.736 88.3723 19.32C88.6603 18.8933 89.0763 18.5573 89.6203 18.312C90.1749 18.0667 90.8309 17.944 91.5883 17.944C92.7083 17.944 93.5883 18.2213 94.2283 18.776C94.8789 19.3307 95.2523 20.0667 95.3483 20.984H92.8203C92.7776 20.6747 92.6389 20.4293 92.4043 20.248C92.1803 20.0667 91.8816 19.976 91.5083 19.976C91.1883 19.976 90.9429 20.04 90.7723 20.168C90.6016 20.2853 90.5163 20.4507 90.5163 20.664C90.5163 20.92 90.6496 21.112 90.9163 21.24C91.1936 21.368 91.6203 21.496 92.1963 21.624C92.8576 21.7947 93.3963 21.9653 93.8123 22.136C94.2283 22.296 94.5909 22.5627 94.9003 22.936C95.2203 23.2987 95.3856 23.7893 95.3963 24.408C95.3963 24.9307 95.2469 25.4 94.9483 25.816C94.6603 26.2213 94.2389 26.5413 93.6843 26.776C93.1403 27.0107 92.5056 27.128 91.7803 27.128ZM102.558 17.976C103.582 17.976 104.403 18.3173 105.022 19C105.641 19.672 105.95 20.6 105.95 21.784V27H103.23V22.152C103.23 21.5547 103.075 21.0907 102.766 20.76C102.457 20.4293 102.041 20.264 101.518 20.264C100.995 20.264 100.579 20.4293 100.27 20.76C99.9608 21.0907 99.8061 21.5547 99.8061 22.152V27H97.0701V15.16H99.8061V19.272C100.083 18.8773 100.462 18.5627 100.942 18.328C101.422 18.0933 101.961 17.976 102.558 17.976Z" fill="white"/>
<path d="M173.976 116.024H167.688L166.68 119H162.384L168.48 102.152H173.232L179.328 119H174.984L173.976 116.024ZM172.92 112.856L170.832 106.688L168.768 112.856H172.92ZM198.271 105.464C199.935 105.464 201.255 105.968 202.231 106.976C203.223 107.984 203.719 109.384 203.719 111.176V119H199.639V111.728C199.639 110.864 199.407 110.2 198.943 109.736C198.495 109.256 197.871 109.016 197.071 109.016C196.271 109.016 195.639 109.256 195.175 109.736C194.727 110.2 194.503 110.864 194.503 111.728V119H190.423V111.728C190.423 110.864 190.191 110.2 189.727 109.736C189.279 109.256 188.655 109.016 187.855 109.016C187.055 109.016 186.423 109.256 185.959 109.736C185.511 110.2 185.287 110.864 185.287 111.728V119H181.183V105.608H185.287V107.288C185.703 106.728 186.247 106.288 186.919 105.968C187.591 105.632 188.351 105.464 189.199 105.464C190.207 105.464 191.103 105.68 191.887 106.112C192.687 106.544 193.311 107.16 193.759 107.96C194.223 107.224 194.855 106.624 195.655 106.16C196.455 105.696 197.327 105.464 198.271 105.464ZM208.654 104.216C207.934 104.216 207.342 104.008 206.878 103.592C206.43 103.16 206.206 102.632 206.206 102.008C206.206 101.368 206.43 100.84 206.878 100.424C207.342 99.992 207.934 99.776 208.654 99.776C209.358 99.776 209.934 99.992 210.382 100.424C210.846 100.84 211.078 101.368 211.078 102.008C211.078 102.632 210.846 103.16 210.382 103.592C209.934 104.008 209.358 104.216 208.654 104.216ZM210.694 105.608V119H206.59V105.608H210.694ZM219.116 119.192C217.948 119.192 216.908 118.992 215.996 118.592C215.084 118.192 214.364 117.648 213.836 116.96C213.308 116.256 213.012 115.472 212.948 114.608H217.004C217.052 115.072 217.268 115.448 217.652 115.736C218.036 116.024 218.508 116.168 219.068 116.168C219.58 116.168 219.972 116.072 220.244 115.88C220.532 115.672 220.676 115.408 220.676 115.088C220.676 114.704 220.476 114.424 220.076 114.248C219.676 114.056 219.028 113.848 218.132 113.624C217.172 113.4 216.372 113.168 215.732 112.928C215.092 112.672 214.54 112.28 214.076 111.752C213.612 111.208 213.38 110.48 213.38 109.568C213.38 108.8 213.588 108.104 214.004 107.48C214.436 106.84 215.06 106.336 215.876 105.968C216.708 105.6 217.692 105.416 218.828 105.416C220.508 105.416 221.828 105.832 222.788 106.664C223.764 107.496 224.324 108.6 224.468 109.976H220.676C220.612 109.512 220.404 109.144 220.052 108.872C219.716 108.6 219.268 108.464 218.708 108.464C218.228 108.464 217.86 108.56 217.604 108.752C217.348 108.928 217.22 109.176 217.22 109.496C217.22 109.88 217.42 110.168 217.82 110.36C218.236 110.552 218.876 110.744 219.74 110.936C220.732 111.192 221.54 111.448 222.164 111.704C222.788 111.944 223.332 112.344 223.796 112.904C224.276 113.448 224.524 114.184 224.54 115.112C224.54 115.896 224.316 116.6 223.868 117.224C223.436 117.832 222.804 118.312 221.972 118.664C221.156 119.016 220.204 119.192 219.116 119.192Z" fill="white"/>
<rect x="12" y="162" width="363" height="80" rx="5" fill="#2E2323"/>
<path d="M286.988 199.877C287.092 200.977 286.505 201.931 285.685 201.997C284.865 202.062 284.115 201.224 284.012 200.124C283.908 199.023 284.495 198.07 285.315 198.004C286.135 197.931 286.885 198.768 286.988 199.877ZM291.685 211.996C292.505 211.931 293.092 210.978 292.988 209.877C292.885 208.768 292.134 207.931 291.315 208.005C290.495 208.07 289.908 209.023 290.012 210.124C290.115 211.224 290.866 212.062 291.685 211.996ZM304.686 198.004C305.506 198.069 306.092 199.022 305.988 200.123C305.885 201.232 305.134 202.069 304.314 201.996C303.494 201.93 302.908 200.977 303.012 199.876C303.115 198.776 303.866 197.938 304.686 198.004ZM302.988 205.123C303.092 204.023 302.505 203.069 301.686 203.003C300.866 202.938 300.116 203.776 300.012 204.876C299.908 205.977 300.495 206.93 301.314 206.996C302.134 207.069 302.884 206.232 302.988 205.123ZM298.686 208.004C299.506 208.069 300.092 209.022 299.988 210.123C299.885 211.232 299.134 212.069 298.314 211.995C297.494 211.93 296.908 210.977 297.012 209.876C297.115 208.776 297.866 207.938 298.686 208.004Z" fill="#F8F8F8"/>
<path d="M292.883 188.451L283.494 192.504C283.275 192.602 283.078 192.734 282.904 192.894C282.36 193.027 281.877 193.339 281.532 193.78C281.186 194.221 280.999 194.764 281 195.324V209.494C281 210.077 281.17 210.647 281.489 211.135C281.807 211.623 282.261 212.007 282.795 212.241L292.496 216.494C292.793 216.624 293.096 216.692 293.396 216.704C294.43 217.098 295.571 217.098 296.605 216.704C296.903 216.692 297.207 216.624 297.504 216.494L307.204 212.241C307.738 212.007 308.192 211.623 308.511 211.135C308.83 210.647 309 210.076 309 209.493V195.323C309.001 194.785 308.828 194.261 308.507 193.829C308.186 193.398 307.734 193.081 307.218 192.927C307.043 192.75 306.836 192.606 306.608 192.504L297.118 188.451C296.452 188.154 295.73 188 295.001 188C294.271 188 293.549 188.154 292.883 188.451V188.451ZM294 200.81V214.206C294 214.289 293.979 214.371 293.939 214.444C293.9 214.516 293.843 214.578 293.773 214.624C293.704 214.669 293.624 214.696 293.542 214.703C293.459 214.71 293.376 214.696 293.3 214.663L283.597 210.41C283.419 210.332 283.268 210.203 283.162 210.041C283.056 209.878 283 209.688 283 209.493V195.323C283 195.24 283.021 195.158 283.061 195.084C283.101 195.011 283.159 194.949 283.229 194.904C283.299 194.858 283.38 194.831 283.463 194.825C283.546 194.819 283.63 194.834 283.706 194.868L292.823 198.986C293.174 199.145 293.472 199.401 293.681 199.725C293.889 200.048 294 200.425 294 200.81ZM296 214.206V200.808C296 200.423 296.111 200.047 296.32 199.723C296.529 199.4 296.826 199.144 297.177 198.985L306.294 194.867C306.37 194.833 306.454 194.818 306.537 194.824C306.621 194.83 306.701 194.857 306.771 194.903C306.842 194.948 306.899 195.01 306.939 195.084C306.979 195.157 307 195.24 307 195.323V209.493C307 209.687 306.943 209.877 306.837 210.04C306.731 210.202 306.58 210.33 306.402 210.408L296.7 214.662C296.624 214.696 296.541 214.71 296.458 214.703C296.375 214.696 296.296 214.669 296.226 214.623C296.156 214.578 296.099 214.516 296.06 214.443C296.02 214.37 295.999 214.288 295.999 214.205L296 214.206ZM295 193.5C293.343 193.5 292 193.052 292 192.5C292 191.948 293.343 191.5 295 191.5C296.657 191.5 298 191.948 298 192.5C298 193.052 296.657 193.5 295 193.5Z" fill="#F8F8F8"/>
<path d="M48.672 198.48C48.368 197.92 47.928 197.496 47.352 197.208C46.792 196.904 46.128 196.752 45.36 196.752C44.032 196.752 42.968 197.192 42.168 198.072C41.368 198.936 40.968 200.096 40.968 201.552C40.968 203.104 41.384 204.32 42.216 205.2C43.064 206.064 44.224 206.496 45.696 206.496C46.704 206.496 47.552 206.24 48.24 205.728C48.944 205.216 49.456 204.48 49.776 203.52H44.568V200.496H53.496V204.312C53.192 205.336 52.672 206.288 51.936 207.168C51.216 208.048 50.296 208.76 49.176 209.304C48.056 209.848 46.792 210.12 45.384 210.12C43.72 210.12 42.232 209.76 40.92 209.04C39.624 208.304 38.608 207.288 37.872 205.992C37.152 204.696 36.792 203.216 36.792 201.552C36.792 199.888 37.152 198.408 37.872 197.112C38.608 195.8 39.624 194.784 40.92 194.064C42.216 193.328 43.696 192.96 45.36 192.96C47.376 192.96 49.072 193.448 50.448 194.424C51.84 195.4 52.76 196.752 53.208 198.48H48.672ZM64.0013 196.464C65.5373 196.464 66.7693 196.976 67.6973 198C68.6253 199.008 69.0893 200.4 69.0893 202.176V210H65.0093V202.728C65.0093 201.832 64.7773 201.136 64.3133 200.64C63.8493 200.144 63.2253 199.896 62.4413 199.896C61.6573 199.896 61.0333 200.144 60.5693 200.64C60.1053 201.136 59.8733 201.832 59.8733 202.728V210H55.7693V192.24H59.8733V198.408C60.2893 197.816 60.8573 197.344 61.5773 196.992C62.2973 196.64 63.1053 196.464 64.0013 196.464ZM78.0371 210.192C76.7251 210.192 75.5411 209.912 74.4851 209.352C73.4451 208.792 72.6211 207.992 72.0131 206.952C71.4211 205.912 71.1251 204.696 71.1251 203.304C71.1251 201.928 71.4291 200.72 72.0371 199.68C72.6451 198.624 73.4771 197.816 74.5331 197.256C75.5891 196.696 76.7731 196.416 78.0851 196.416C79.3971 196.416 80.5811 196.696 81.6371 197.256C82.6931 197.816 83.5251 198.624 84.1331 199.68C84.7411 200.72 85.0451 201.928 85.0451 203.304C85.0451 204.68 84.7331 205.896 84.1091 206.952C83.5011 207.992 82.6611 208.792 81.5891 209.352C80.5331 209.912 79.3491 210.192 78.0371 210.192ZM78.0371 206.64C78.8211 206.64 79.4851 206.352 80.0291 205.776C80.5891 205.2 80.8691 204.376 80.8691 203.304C80.8691 202.232 80.5971 201.408 80.0531 200.832C79.5251 200.256 78.8691 199.968 78.0851 199.968C77.2851 199.968 76.6211 200.256 76.0931 200.832C75.5651 201.392 75.3011 202.216 75.3011 203.304C75.3011 204.376 75.5571 205.2 76.0691 205.776C76.5971 206.352 77.2531 206.64 78.0371 206.64ZM92.6704 210.192C91.5024 210.192 90.4624 209.992 89.5504 209.592C88.6384 209.192 87.9184 208.648 87.3904 207.96C86.8624 207.256 86.5664 206.472 86.5024 205.608H90.5584C90.6064 206.072 90.8224 206.448 91.2064 206.736C91.5904 207.024 92.0624 207.168 92.6224 207.168C93.1344 207.168 93.5264 207.072 93.7984 206.88C94.0864 206.672 94.2304 206.408 94.2304 206.088C94.2304 205.704 94.0304 205.424 93.6304 205.248C93.2304 205.056 92.5824 204.848 91.6864 204.624C90.7264 204.4 89.9264 204.168 89.2864 203.928C88.6464 203.672 88.0944 203.28 87.6304 202.752C87.1664 202.208 86.9344 201.48 86.9344 200.568C86.9344 199.8 87.1424 199.104 87.5584 198.48C87.9904 197.84 88.6144 197.336 89.4304 196.968C90.2624 196.6 91.2464 196.416 92.3824 196.416C94.0624 196.416 95.3824 196.832 96.3424 197.664C97.3184 198.496 97.8784 199.6 98.0224 200.976H94.2304C94.1664 200.512 93.9584 200.144 93.6064 199.872C93.2704 199.6 92.8224 199.464 92.2624 199.464C91.7824 199.464 91.4144 199.56 91.1584 199.752C90.9024 199.928 90.7744 200.176 90.7744 200.496C90.7744 200.88 90.9744 201.168 91.3744 201.36C91.7904 201.552 92.4304 201.744 93.2944 201.936C94.2864 202.192 95.0944 202.448 95.7184 202.704C96.3424 202.944 96.8864 203.344 97.3504 203.904C97.8304 204.448 98.0784 205.184 98.0944 206.112C98.0944 206.896 97.8704 207.6 97.4224 208.224C96.9904 208.832 96.3584 209.312 95.5264 209.664C94.7104 210.016 93.7584 210.192 92.6704 210.192ZM108.069 206.52V210H105.981C104.493 210 103.333 209.64 102.501 208.92C101.669 208.184 101.253 206.992 101.253 205.344V200.016H99.6212V196.608H101.253V193.344H105.357V196.608H108.045V200.016H105.357V205.392C105.357 205.792 105.453 206.08 105.645 206.256C105.837 206.432 106.157 206.52 106.605 206.52H108.069Z" fill="white"/>
<path d="M335.5 214.5V192C335.5 191.312 335.745 190.724 336.235 190.234C336.724 189.745 337.312 189.5 338 189.5H358C358.688 189.5 359.276 189.745 359.766 190.234C360.255 190.724 360.5 191.312 360.5 192V207C360.5 207.688 360.255 208.276 359.766 208.766C359.276 209.255 358.688 209.5 358 209.5H340.5L335.5 214.5Z" fill="#F8F8F8"/>
<rect x="13" y="249" width="363" height="80" rx="5" fill="#2E2323"/>
<path d="M287.988 286.877C288.092 287.977 287.505 288.931 286.685 288.997C285.865 289.062 285.115 288.224 285.012 287.124C284.908 286.023 285.495 285.07 286.315 285.004C287.135 284.931 287.885 285.768 287.988 286.877ZM292.685 298.996C293.505 298.931 294.092 297.978 293.988 296.877C293.885 295.768 293.134 294.931 292.315 295.005C291.495 295.07 290.908 296.023 291.012 297.124C291.115 298.224 291.866 299.062 292.685 298.996ZM305.686 285.004C306.506 285.069 307.092 286.022 306.988 287.123C306.885 288.232 306.134 289.069 305.314 288.996C304.494 288.93 303.908 287.977 304.012 286.876C304.115 285.776 304.866 284.938 305.686 285.004ZM303.988 292.123C304.092 291.023 303.505 290.069 302.686 290.003C301.866 289.938 301.116 290.776 301.012 291.876C300.908 292.977 301.495 293.93 302.314 293.996C303.134 294.069 303.884 293.232 303.988 292.123ZM299.686 295.004C300.506 295.069 301.092 296.022 300.988 297.123C300.885 298.232 300.134 299.069 299.314 298.995C298.494 298.93 297.908 297.977 298.012 296.876C298.115 295.776 298.866 294.938 299.686 295.004Z" fill="#F8F8F8"/>
<path d="M293.883 275.451L284.494 279.504C284.275 279.602 284.078 279.734 283.904 279.894C283.36 280.027 282.877 280.339 282.532 280.78C282.186 281.221 281.999 281.764 282 282.324V296.494C282 297.077 282.17 297.647 282.489 298.135C282.807 298.623 283.261 299.007 283.795 299.241L293.496 303.494C293.793 303.624 294.096 303.692 294.396 303.704C295.43 304.098 296.571 304.098 297.605 303.704C297.903 303.692 298.207 303.624 298.504 303.494L308.204 299.241C308.738 299.007 309.192 298.623 309.511 298.135C309.83 297.647 310 297.076 310 296.493V282.323C310.001 281.785 309.828 281.261 309.507 280.829C309.186 280.398 308.734 280.081 308.218 279.927C308.043 279.75 307.836 279.606 307.608 279.504L298.118 275.451C297.452 275.154 296.73 275 296.001 275C295.271 275 294.549 275.154 293.883 275.451V275.451ZM295 287.81V301.206C295 301.289 294.979 301.371 294.939 301.444C294.9 301.516 294.843 301.578 294.773 301.624C294.704 301.669 294.624 301.696 294.542 301.703C294.459 301.71 294.376 301.696 294.3 301.663L284.597 297.41C284.419 297.332 284.268 297.203 284.162 297.041C284.056 296.878 284 296.688 284 296.493V282.323C284 282.24 284.021 282.158 284.061 282.084C284.101 282.011 284.159 281.949 284.229 281.904C284.299 281.858 284.38 281.831 284.463 281.825C284.546 281.819 284.63 281.834 284.706 281.868L293.823 285.986C294.174 286.145 294.472 286.401 294.681 286.725C294.889 287.048 295 287.425 295 287.81ZM297 301.206V287.808C297 287.423 297.111 287.047 297.32 286.723C297.529 286.4 297.826 286.144 298.177 285.985L307.294 281.867C307.37 281.833 307.454 281.818 307.537 281.824C307.621 281.83 307.701 281.857 307.771 281.903C307.842 281.948 307.899 282.01 307.939 282.084C307.979 282.157 308 282.24 308 282.323V296.493C308 296.687 307.943 296.877 307.837 297.04C307.731 297.202 307.58 297.33 307.402 297.408L297.7 301.662C297.624 301.696 297.541 301.71 297.458 301.703C297.375 301.696 297.296 301.669 297.226 301.623C297.156 301.578 297.099 301.516 297.06 301.443C297.02 301.37 296.999 301.288 296.999 301.205L297 301.206ZM296 280.5C294.343 280.5 293 280.052 293 279.5C293 278.948 294.343 278.5 296 278.5C297.657 278.5 299 278.948 299 279.5C299 280.052 297.657 280.5 296 280.5Z" fill="#F8F8F8"/>
<path d="M49.672 285.48C49.368 284.92 48.928 284.496 48.352 284.208C47.792 283.904 47.128 283.752 46.36 283.752C45.032 283.752 43.968 284.192 43.168 285.072C42.368 285.936 41.968 287.096 41.968 288.552C41.968 290.104 42.384 291.32 43.216 292.2C44.064 293.064 45.224 293.496 46.696 293.496C47.704 293.496 48.552 293.24 49.24 292.728C49.944 292.216 50.456 291.48 50.776 290.52H45.568V287.496H54.496V291.312C54.192 292.336 53.672 293.288 52.936 294.168C52.216 295.048 51.296 295.76 50.176 296.304C49.056 296.848 47.792 297.12 46.384 297.12C44.72 297.12 43.232 296.76 41.92 296.04C40.624 295.304 39.608 294.288 38.872 292.992C38.152 291.696 37.792 290.216 37.792 288.552C37.792 286.888 38.152 285.408 38.872 284.112C39.608 282.8 40.624 281.784 41.92 281.064C43.216 280.328 44.696 279.96 46.36 279.96C48.376 279.96 50.072 280.448 51.448 281.424C52.84 282.4 53.76 283.752 54.208 285.48H49.672ZM69.9933 283.608V297H65.8893V295.176C65.4733 295.768 64.9053 296.248 64.1853 296.616C63.4813 296.968 62.6973 297.144 61.8333 297.144C60.8093 297.144 59.9053 296.92 59.1213 296.472C58.3373 296.008 57.7293 295.344 57.2973 294.48C56.8653 293.616 56.6493 292.6 56.6493 291.432V283.608H60.7293V290.88C60.7293 291.776 60.9613 292.472 61.4253 292.968C61.8893 293.464 62.5133 293.712 63.2973 293.712C64.0973 293.712 64.7293 293.464 65.1933 292.968C65.6573 292.472 65.8893 291.776 65.8893 290.88V283.608H69.9933ZM80.4051 293.52V297H78.3171C76.8291 297 75.6691 296.64 74.8371 295.92C74.0051 295.184 73.5891 293.992 73.5891 292.344V287.016H71.9571V283.608H73.5891V280.344H77.6931V283.608H80.3811V287.016H77.6931V292.392C77.6931 292.792 77.7891 293.08 77.9811 293.256C78.1731 293.432 78.4931 293.52 78.9411 293.52H80.4051ZM88.1391 297.192C86.9711 297.192 85.9311 296.992 85.0191 296.592C84.1071 296.192 83.3871 295.648 82.8591 294.96C82.3311 294.256 82.0351 293.472 81.9711 292.608H86.0271C86.0751 293.072 86.2911 293.448 86.6751 293.736C87.0591 294.024 87.5311 294.168 88.0911 294.168C88.6031 294.168 88.9951 294.072 89.2671 293.88C89.5551 293.672 89.6991 293.408 89.6991 293.088C89.6991 292.704 89.4991 292.424 89.0991 292.248C88.6991 292.056 88.0511 291.848 87.1551 291.624C86.1951 291.4 85.3951 291.168 84.7551 290.928C84.1151 290.672 83.5631 290.28 83.0991 289.752C82.6351 289.208 82.4031 288.48 82.4031 287.568C82.4031 286.8 82.6111 286.104 83.0271 285.48C83.4591 284.84 84.0831 284.336 84.8991 283.968C85.7311 283.6 86.7151 283.416 87.8511 283.416C89.5311 283.416 90.8511 283.832 91.8111 284.664C92.7871 285.496 93.3471 286.6 93.4911 287.976H89.6991C89.6351 287.512 89.4271 287.144 89.0751 286.872C88.7391 286.6 88.2911 286.464 87.7311 286.464C87.2511 286.464 86.8831 286.56 86.6271 286.752C86.3711 286.928 86.2431 287.176 86.2431 287.496C86.2431 287.88 86.4431 288.168 86.8431 288.36C87.2591 288.552 87.8991 288.744 88.7631 288.936C89.7551 289.192 90.5631 289.448 91.1871 289.704C91.8111 289.944 92.3551 290.344 92.8191 290.904C93.2991 291.448 93.5471 292.184 93.5631 293.112C93.5631 293.896 93.3391 294.6 92.8911 295.224C92.4591 295.832 91.8271 296.312 90.9951 296.664C90.1791 297.016 89.2271 297.192 88.1391 297.192Z" fill="white"/>
<path d="M336.5 301.5V279C336.5 278.312 336.745 277.724 337.235 277.234C337.724 276.745 338.312 276.5 339 276.5H359C359.688 276.5 360.276 276.745 360.766 277.234C361.255 277.724 361.5 278.312 361.5 279V294C361.5 294.688 361.255 295.276 360.766 295.766C360.276 296.255 359.688 296.5 359 296.5H341.5L336.5 301.5Z" fill="#F8F8F8"/>
<rect x="14" y="336" width="363" height="80" rx="5" fill="#2E2323"/>
<path d="M288.988 373.877C289.092 374.977 288.505 375.931 287.685 375.997C286.865 376.062 286.115 375.224 286.012 374.124C285.908 373.023 286.495 372.07 287.315 372.004C288.135 371.931 288.885 372.768 288.988 373.877ZM293.685 385.996C294.505 385.931 295.092 384.978 294.988 383.877C294.885 382.768 294.134 381.931 293.315 382.005C292.495 382.07 291.908 383.023 292.012 384.124C292.115 385.224 292.866 386.062 293.685 385.996ZM306.686 372.004C307.506 372.069 308.092 373.022 307.988 374.123C307.885 375.232 307.134 376.069 306.314 375.996C305.494 375.93 304.908 374.977 305.012 373.876C305.115 372.776 305.866 371.938 306.686 372.004ZM304.988 379.123C305.092 378.023 304.505 377.069 303.686 377.003C302.866 376.938 302.116 377.776 302.012 378.876C301.908 379.977 302.495 380.93 303.314 380.996C304.134 381.069 304.884 380.232 304.988 379.123ZM300.686 382.004C301.506 382.069 302.092 383.022 301.988 384.123C301.885 385.232 301.134 386.069 300.314 385.995C299.494 385.93 298.908 384.977 299.012 383.876C299.115 382.776 299.866 381.938 300.686 382.004Z" fill="#F8F8F8"/>
<path d="M294.883 362.451L285.494 366.504C285.275 366.602 285.078 366.734 284.904 366.894C284.36 367.027 283.877 367.339 283.532 367.78C283.186 368.221 282.999 368.764 283 369.324V383.494C283 384.077 283.17 384.647 283.489 385.135C283.807 385.623 284.261 386.007 284.795 386.241L294.496 390.494C294.793 390.624 295.096 390.692 295.396 390.704C296.43 391.098 297.571 391.098 298.605 390.704C298.903 390.692 299.207 390.624 299.504 390.494L309.204 386.241C309.738 386.007 310.192 385.623 310.511 385.135C310.83 384.647 311 384.076 311 383.493V369.323C311.001 368.785 310.828 368.261 310.507 367.829C310.186 367.398 309.734 367.081 309.218 366.927C309.043 366.75 308.836 366.606 308.608 366.504L299.118 362.451C298.452 362.154 297.73 362 297.001 362C296.271 362 295.549 362.154 294.883 362.451V362.451ZM296 374.81V388.206C296 388.289 295.979 388.371 295.939 388.444C295.9 388.516 295.843 388.578 295.773 388.624C295.704 388.669 295.624 388.696 295.542 388.703C295.459 388.71 295.376 388.696 295.3 388.663L285.597 384.41C285.419 384.332 285.268 384.203 285.162 384.041C285.056 383.878 285 383.688 285 383.493V369.323C285 369.24 285.021 369.158 285.061 369.084C285.101 369.011 285.159 368.949 285.229 368.904C285.299 368.858 285.38 368.831 285.463 368.825C285.546 368.819 285.63 368.834 285.706 368.868L294.823 372.986C295.174 373.145 295.472 373.401 295.681 373.725C295.889 374.048 296 374.425 296 374.81ZM298 388.206V374.808C298 374.423 298.111 374.047 298.32 373.723C298.529 373.4 298.826 373.144 299.177 372.985L308.294 368.867C308.37 368.833 308.454 368.818 308.537 368.824C308.621 368.83 308.701 368.857 308.771 368.903C308.842 368.948 308.899 369.01 308.939 369.084C308.979 369.157 309 369.24 309 369.323V383.493C309 383.687 308.943 383.877 308.837 384.04C308.731 384.202 308.58 384.33 308.402 384.408L298.7 388.662C298.624 388.696 298.541 388.71 298.458 388.703C298.375 388.696 298.296 388.669 298.226 388.623C298.156 388.578 298.099 388.516 298.06 388.443C298.02 388.37 297.999 388.288 297.999 388.205L298 388.206ZM297 367.5C295.343 367.5 294 367.052 294 366.5C294 365.948 295.343 365.5 297 365.5C298.657 365.5 300 365.948 300 366.5C300 367.052 298.657 367.5 297 367.5Z" fill="#F8F8F8"/>
<path d="M49.256 384L43.592 376.56V384H39.488V367.152H43.592V374.544L49.208 367.152H54.032L47.504 375.408L54.272 384H49.256ZM55.4064 377.28C55.4064 375.904 55.6624 374.696 56.1744 373.656C56.7024 372.616 57.4144 371.816 58.3104 371.256C59.2064 370.696 60.2064 370.416 61.3104 370.416C62.2544 370.416 63.0784 370.608 63.7824 370.992C64.5024 371.376 65.0544 371.88 65.4384 372.504V370.608H69.5424V384H65.4384V382.104C65.0384 382.728 64.4784 383.232 63.7584 383.616C63.0544 384 62.2304 384.192 61.2864 384.192C60.1984 384.192 59.2064 383.912 58.3104 383.352C57.4144 382.776 56.7024 381.968 56.1744 380.928C55.6624 379.872 55.4064 378.656 55.4064 377.28ZM65.4384 377.304C65.4384 376.28 65.1504 375.472 64.5744 374.88C64.0144 374.288 63.3264 373.992 62.5104 373.992C61.6944 373.992 60.9984 374.288 60.4224 374.88C59.8624 375.456 59.5824 376.256 59.5824 377.28C59.5824 378.304 59.8624 379.12 60.4224 379.728C60.9984 380.32 61.6944 380.616 62.5104 380.616C63.3264 380.616 64.0144 380.32 64.5744 379.728C65.1504 379.136 65.4384 378.328 65.4384 377.304ZM80.6714 370.464C82.2394 370.464 83.4874 370.976 84.4154 372C85.3594 373.008 85.8314 374.4 85.8314 376.176V384H81.7514V376.728C81.7514 375.832 81.5194 375.136 81.0554 374.64C80.5914 374.144 79.9674 373.896 79.1834 373.896C78.3994 373.896 77.7754 374.144 77.3114 374.64C76.8474 375.136 76.6154 375.832 76.6154 376.728V384H72.5114V370.608H76.6154V372.384C77.0314 371.792 77.5914 371.328 78.2954 370.992C78.9994 370.64 79.7914 370.464 80.6714 370.464ZM101.307 377.088C101.307 377.472 101.283 377.872 101.235 378.288H91.9473C92.0113 379.12 92.2753 379.76 92.7393 380.208C93.2193 380.64 93.8033 380.856 94.4913 380.856C95.5153 380.856 96.2273 380.424 96.6273 379.56H100.995C100.771 380.44 100.363 381.232 99.7713 381.936C99.1953 382.64 98.4673 383.192 97.5873 383.592C96.7073 383.992 95.7233 384.192 94.6353 384.192C93.3233 384.192 92.1553 383.912 91.1313 383.352C90.1073 382.792 89.3073 381.992 88.7313 380.952C88.1553 379.912 87.8673 378.696 87.8673 377.304C87.8673 375.912 88.1473 374.696 88.7073 373.656C89.2833 372.616 90.0833 371.816 91.1073 371.256C92.1313 370.696 93.3073 370.416 94.6353 370.416C95.9313 370.416 97.0833 370.688 98.0913 371.232C99.0993 371.776 99.8833 372.552 100.443 373.56C101.019 374.568 101.307 375.744 101.307 377.088ZM97.1073 376.008C97.1073 375.304 96.8673 374.744 96.3873 374.328C95.9073 373.912 95.3073 373.704 94.5873 373.704C93.8993 373.704 93.3153 373.904 92.8353 374.304C92.3713 374.704 92.0833 375.272 91.9713 376.008H97.1073ZM102.656 377.28C102.656 375.904 102.912 374.696 103.424 373.656C103.952 372.616 104.664 371.816 105.56 371.256C106.456 370.696 107.456 370.416 108.56 370.416C109.44 370.416 110.24 370.6 110.96 370.968C111.696 371.336 112.272 371.832 112.688 372.456V366.24H116.792V384H112.688V382.08C112.304 382.72 111.752 383.232 111.032 383.616C110.328 384 109.504 384.192 108.56 384.192C107.456 384.192 106.456 383.912 105.56 383.352C104.664 382.776 103.952 381.968 103.424 380.928C102.912 379.872 102.656 378.656 102.656 377.28ZM112.688 377.304C112.688 376.28 112.4 375.472 111.824 374.88C111.264 374.288 110.576 373.992 109.76 373.992C108.944 373.992 108.248 374.288 107.672 374.88C107.112 375.456 106.832 376.256 106.832 377.28C106.832 378.304 107.112 379.12 107.672 379.728C108.248 380.32 108.944 380.616 109.76 380.616C110.576 380.616 111.264 380.32 111.824 379.728C112.4 379.136 112.688 378.328 112.688 377.304ZM118.945 377.28C118.945 375.904 119.201 374.696 119.713 373.656C120.241 372.616 120.953 371.816 121.849 371.256C122.745 370.696 123.745 370.416 124.849 370.416C125.793 370.416 126.617 370.608 127.321 370.992C128.041 371.376 128.593 371.88 128.977 372.504V370.608H133.081V384H128.977V382.104C128.577 382.728 128.017 383.232 127.297 383.616C126.593 384 125.769 384.192 124.825 384.192C123.737 384.192 122.745 383.912 121.849 383.352C120.953 382.776 120.241 381.968 119.713 380.928C119.201 379.872 118.945 378.656 118.945 377.28ZM128.977 377.304C128.977 376.28 128.689 375.472 128.113 374.88C127.553 374.288 126.865 373.992 126.049 373.992C125.233 373.992 124.537 374.288 123.961 374.88C123.401 375.456 123.121 376.256 123.121 377.28C123.121 378.304 123.401 379.12 123.961 379.728C124.537 380.32 125.233 380.616 126.049 380.616C126.865 380.616 127.553 380.32 128.113 379.728C128.689 379.136 128.977 378.328 128.977 377.304Z" fill="white"/>
<path d="M337.5 388.5V366C337.5 365.312 337.745 364.724 338.235 364.234C338.724 363.745 339.312 363.5 340 363.5H360C360.688 363.5 361.276 363.745 361.766 364.234C362.255 364.724 362.5 365.312 362.5 366V381C362.5 381.688 362.255 382.276 361.766 382.766C361.276 383.255 360.688 383.5 360 383.5H342.5L337.5 388.5Z" fill="#F8F8F8"/>
<rect x="14" y="423" width="363" height="80" rx="5" fill="#2E2323"/>
<rect x="14" y="423" width="363" height="80" rx="5" fill="#2E2323"/>
<path d="M288.988 460.877C289.092 461.977 288.505 462.931 287.685 462.997C286.865 463.062 286.115 462.224 286.012 461.124C285.908 460.023 286.495 459.07 287.315 459.004C288.135 458.931 288.885 459.768 288.988 460.877ZM293.685 472.996C294.505 472.931 295.092 471.978 294.988 470.877C294.885 469.768 294.134 468.931 293.315 469.005C292.495 469.07 291.908 470.023 292.012 471.124C292.115 472.224 292.866 473.062 293.685 472.996ZM306.686 459.004C307.506 459.069 308.092 460.022 307.988 461.123C307.885 462.232 307.134 463.069 306.314 462.996C305.494 462.93 304.908 461.977 305.012 460.876C305.115 459.776 305.866 458.938 306.686 459.004ZM304.988 466.123C305.092 465.023 304.505 464.069 303.686 464.003C302.866 463.938 302.116 464.776 302.012 465.876C301.908 466.977 302.495 467.93 303.314 467.996C304.134 468.069 304.884 467.232 304.988 466.123ZM300.686 469.004C301.506 469.069 302.092 470.022 301.988 471.123C301.885 472.232 301.134 473.069 300.314 472.995C299.494 472.93 298.908 471.977 299.012 470.876C299.115 469.776 299.866 468.938 300.686 469.004Z" fill="#F8F8F8"/>
<path d="M294.883 449.451L285.494 453.504C285.275 453.602 285.078 453.734 284.904 453.894C284.36 454.027 283.877 454.339 283.532 454.78C283.186 455.221 282.999 455.764 283 456.324V470.494C283 471.077 283.17 471.647 283.489 472.135C283.807 472.623 284.261 473.007 284.795 473.241L294.496 477.494C294.793 477.624 295.096 477.692 295.396 477.704C296.43 478.098 297.571 478.098 298.605 477.704C298.903 477.692 299.207 477.624 299.504 477.494L309.204 473.241C309.738 473.007 310.192 472.623 310.511 472.135C310.83 471.647 311 471.076 311 470.493V456.323C311.001 455.785 310.828 455.261 310.507 454.829C310.186 454.398 309.734 454.081 309.218 453.927C309.043 453.75 308.836 453.606 308.608 453.504L299.118 449.451C298.452 449.154 297.73 449 297.001 449C296.271 449 295.549 449.154 294.883 449.451V449.451ZM296 461.81V475.206C296 475.289 295.979 475.371 295.939 475.444C295.9 475.516 295.843 475.578 295.773 475.624C295.704 475.669 295.624 475.696 295.542 475.703C295.459 475.71 295.376 475.696 295.3 475.663L285.597 471.41C285.419 471.332 285.268 471.203 285.162 471.041C285.056 470.878 285 470.688 285 470.493V456.323C285 456.24 285.021 456.158 285.061 456.084C285.101 456.011 285.159 455.949 285.229 455.904C285.299 455.858 285.38 455.831 285.463 455.825C285.546 455.819 285.63 455.834 285.706 455.868L294.823 459.986C295.174 460.145 295.472 460.401 295.681 460.725C295.889 461.048 296 461.425 296 461.81ZM298 475.206V461.808C298 461.423 298.111 461.047 298.32 460.723C298.529 460.4 298.826 460.144 299.177 459.985L308.294 455.867C308.37 455.833 308.454 455.818 308.537 455.824C308.621 455.83 308.701 455.857 308.771 455.903C308.842 455.948 308.899 456.01 308.939 456.084C308.979 456.157 309 456.24 309 456.323V470.493C309 470.687 308.943 470.877 308.837 471.04C308.731 471.202 308.58 471.33 308.402 471.408L298.7 475.662C298.624 475.696 298.541 475.71 298.458 475.703C298.375 475.696 298.296 475.669 298.226 475.623C298.156 475.578 298.099 475.516 298.06 475.443C298.02 475.37 297.999 475.288 297.999 475.205L298 475.206ZM297 454.5C295.343 454.5 294 454.052 294 453.5C294 452.948 295.343 452.5 297 452.5C298.657 452.5 300 452.948 300 453.5C300 454.052 298.657 454.5 297 454.5Z" fill="#F8F8F8"/>
<path d="M54.56 471H50.456L43.592 460.608V471H39.488V454.152H43.592L50.456 464.592V454.152H54.56V471ZM70.1589 464.088C70.1589 464.472 70.1349 464.872 70.0869 465.288H60.7989C60.8629 466.12 61.1269 466.76 61.5909 467.208C62.0709 467.64 62.6549 467.856 63.3429 467.856C64.3669 467.856 65.0789 467.424 65.4789 466.56H69.8469C69.6229 467.44 69.2149 468.232 68.6229 468.936C68.0469 469.64 67.3189 470.192 66.4389 470.592C65.5589 470.992 64.5749 471.192 63.4869 471.192C62.1749 471.192 61.0069 470.912 59.9829 470.352C58.9589 469.792 58.1589 468.992 57.5829 467.952C57.0069 466.912 56.7189 465.696 56.7189 464.304C56.7189 462.912 56.9989 461.696 57.5589 460.656C58.1349 459.616 58.9349 458.816 59.9589 458.256C60.9829 457.696 62.1589 457.416 63.4869 457.416C64.7829 457.416 65.9349 457.688 66.9429 458.232C67.9509 458.776 68.7349 459.552 69.2949 460.56C69.8709 461.568 70.1589 462.744 70.1589 464.088ZM65.9589 463.008C65.9589 462.304 65.7189 461.744 65.2389 461.328C64.7589 460.912 64.1589 460.704 63.4389 460.704C62.7509 460.704 62.1669 460.904 61.6869 461.304C61.2229 461.704 60.9349 462.272 60.8229 463.008H65.9589ZM78.4199 471.192C77.1079 471.192 75.9239 470.912 74.8679 470.352C73.8279 469.792 73.0039 468.992 72.3959 467.952C71.8039 466.912 71.5079 465.696 71.5079 464.304C71.5079 462.928 71.8119 461.72 72.4199 460.68C73.0279 459.624 73.8599 458.816 74.9159 458.256C75.9719 457.696 77.1559 457.416 78.4679 457.416C79.7799 457.416 80.9639 457.696 82.0199 458.256C83.0759 458.816 83.9079 459.624 84.5159 460.68C85.1239 461.72 85.4279 462.928 85.4279 464.304C85.4279 465.68 85.1159 466.896 84.4919 467.952C83.8839 468.992 83.0439 469.792 81.9719 470.352C80.9159 470.912 79.7319 471.192 78.4199 471.192ZM78.4199 467.64C79.2039 467.64 79.8679 467.352 80.4119 466.776C80.9719 466.2 81.2519 465.376 81.2519 464.304C81.2519 463.232 80.9799 462.408 80.4359 461.832C79.9079 461.256 79.2519 460.968 78.4679 460.968C77.6679 460.968 77.0039 461.256 76.4759 461.832C75.9479 462.392 75.6839 463.216 75.6839 464.304C75.6839 465.376 75.9399 466.2 76.4519 466.776C76.9799 467.352 77.6359 467.64 78.4199 467.64Z" fill="white"/>
<path d="M337.5 475.5V453C337.5 452.312 337.745 451.724 338.235 451.234C338.724 450.745 339.312 450.5 340 450.5H360C360.688 450.5 361.276 450.745 361.766 451.234C362.255 451.724 362.5 452.312 362.5 453V468C362.5 468.688 362.255 469.276 361.766 469.766C361.276 470.255 360.688 470.5 360 470.5H342.5L337.5 475.5Z" fill="#F8F8F8"/>
<rect x="13" y="510" width="363" height="80" rx="5" fill="#2E2323"/>
<rect x="13" y="510" width="363" height="80" rx="5" fill="#2E2323"/>
<path d="M287.988 547.877C288.092 548.977 287.505 549.931 286.685 549.997C285.865 550.062 285.115 549.224 285.012 548.124C284.908 547.023 285.495 546.07 286.315 546.004C287.135 545.931 287.885 546.768 287.988 547.877ZM292.685 559.996C293.505 559.931 294.092 558.978 293.988 557.877C293.885 556.768 293.134 555.931 292.315 556.005C291.495 556.07 290.908 557.023 291.012 558.124C291.115 559.224 291.866 560.062 292.685 559.996ZM305.686 546.004C306.506 546.069 307.092 547.022 306.988 548.123C306.885 549.232 306.134 550.069 305.314 549.996C304.494 549.93 303.908 548.977 304.012 547.876C304.115 546.776 304.866 545.938 305.686 546.004ZM303.988 553.123C304.092 552.023 303.505 551.069 302.686 551.003C301.866 550.938 301.116 551.776 301.012 552.876C300.908 553.977 301.495 554.93 302.314 554.996C303.134 555.069 303.884 554.232 303.988 553.123ZM299.686 556.004C300.506 556.069 301.092 557.022 300.988 558.123C300.885 559.232 300.134 560.069 299.314 559.995C298.494 559.93 297.908 558.977 298.012 557.876C298.115 556.776 298.866 555.938 299.686 556.004Z" fill="#F8F8F8"/>
<path d="M293.883 536.451L284.494 540.504C284.275 540.602 284.078 540.734 283.904 540.894C283.36 541.027 282.877 541.339 282.532 541.78C282.186 542.221 281.999 542.764 282 543.324V557.494C282 558.077 282.17 558.647 282.489 559.135C282.807 559.623 283.261 560.007 283.795 560.241L293.496 564.494C293.793 564.624 294.096 564.692 294.396 564.704C295.43 565.098 296.571 565.098 297.605 564.704C297.903 564.692 298.207 564.624 298.504 564.494L308.204 560.241C308.738 560.007 309.192 559.623 309.511 559.135C309.83 558.647 310 558.076 310 557.493V543.323C310.001 542.785 309.828 542.261 309.507 541.829C309.186 541.398 308.734 541.081 308.218 540.927C308.043 540.75 307.836 540.606 307.608 540.504L298.118 536.451C297.452 536.154 296.73 536 296.001 536C295.271 536 294.549 536.154 293.883 536.451V536.451ZM295 548.81V562.206C295 562.289 294.979 562.371 294.939 562.444C294.9 562.516 294.843 562.578 294.773 562.624C294.704 562.669 294.624 562.696 294.542 562.703C294.459 562.71 294.376 562.696 294.3 562.663L284.597 558.41C284.419 558.332 284.268 558.203 284.162 558.041C284.056 557.878 284 557.688 284 557.493V543.323C284 543.24 284.021 543.158 284.061 543.084C284.101 543.011 284.159 542.949 284.229 542.904C284.299 542.858 284.38 542.831 284.463 542.825C284.546 542.819 284.63 542.834 284.706 542.868L293.823 546.986C294.174 547.145 294.472 547.401 294.681 547.725C294.889 548.048 295 548.425 295 548.81ZM297 562.206V548.808C297 548.423 297.111 548.047 297.32 547.723C297.529 547.4 297.826 547.144 298.177 546.985L307.294 542.867C307.37 542.833 307.454 542.818 307.537 542.824C307.621 542.83 307.701 542.857 307.771 542.903C307.842 542.948 307.899 543.01 307.939 543.084C307.979 543.157 308 543.24 308 543.323V557.493C308 557.687 307.943 557.877 307.837 558.04C307.731 558.202 307.58 558.33 307.402 558.408L297.7 562.662C297.624 562.696 297.541 562.71 297.458 562.703C297.375 562.696 297.296 562.669 297.226 562.623C297.156 562.578 297.099 562.516 297.06 562.443C297.02 562.37 296.999 562.288 296.999 562.205L297 562.206ZM296 541.5C294.343 541.5 293 541.052 293 540.5C293 539.948 294.343 539.5 296 539.5C297.657 539.5 299 539.948 299 540.5C299 541.052 297.657 541.5 296 541.5Z" fill="#F8F8F8"/>
<path d="M53.08 541.152V558H48.976V551.064H42.592V558H38.488V541.152H42.592V547.752H48.976V541.152H53.08ZM68.6667 551.088C68.6667 551.472 68.6427 551.872 68.5947 552.288H59.3067C59.3707 553.12 59.6347 553.76 60.0987 554.208C60.5787 554.64 61.1627 554.856 61.8507 554.856C62.8747 554.856 63.5867 554.424 63.9867 553.56H68.3547C68.1307 554.44 67.7227 555.232 67.1307 555.936C66.5547 556.64 65.8267 557.192 64.9467 557.592C64.0667 557.992 63.0827 558.192 61.9947 558.192C60.6827 558.192 59.5147 557.912 58.4907 557.352C57.4667 556.792 56.6667 555.992 56.0907 554.952C55.5147 553.912 55.2267 552.696 55.2267 551.304C55.2267 549.912 55.5067 548.696 56.0667 547.656C56.6427 546.616 57.4427 545.816 58.4667 545.256C59.4907 544.696 60.6667 544.416 61.9947 544.416C63.2907 544.416 64.4427 544.688 65.4507 545.232C66.4587 545.776 67.2427 546.552 67.8027 547.56C68.3787 548.568 68.6667 549.744 68.6667 551.088ZM64.4667 550.008C64.4667 549.304 64.2267 548.744 63.7467 548.328C63.2667 547.912 62.6667 547.704 61.9467 547.704C61.2587 547.704 60.6747 547.904 60.1947 548.304C59.7307 548.704 59.4427 549.272 59.3307 550.008H64.4667ZM72.8958 543.216C72.1758 543.216 71.5838 543.008 71.1198 542.592C70.6718 542.16 70.4478 541.632 70.4478 541.008C70.4478 540.368 70.6718 539.84 71.1198 539.424C71.5838 538.992 72.1758 538.776 72.8958 538.776C73.5998 538.776 74.1758 538.992 74.6238 539.424C75.0878 539.84 75.3198 540.368 75.3198 541.008C75.3198 541.632 75.0878 542.16 74.6238 542.592C74.1758 543.008 73.5998 543.216 72.8958 543.216ZM74.9358 544.608V558H70.8318V544.608H74.9358ZM83.3579 558.192C82.1899 558.192 81.1499 557.992 80.2379 557.592C79.3259 557.192 78.6059 556.648 78.0779 555.96C77.5499 555.256 77.2539 554.472 77.1899 553.608H81.2459C81.2939 554.072 81.5099 554.448 81.8939 554.736C82.2779 555.024 82.7499 555.168 83.3099 555.168C83.8219 555.168 84.2139 555.072 84.4859 554.88C84.7739 554.672 84.9179 554.408 84.9179 554.088C84.9179 553.704 84.7179 553.424 84.3179 553.248C83.9179 553.056 83.2699 552.848 82.3739 552.624C81.4139 552.4 80.6139 552.168 79.9739 551.928C79.3339 551.672 78.7819 551.28 78.3179 550.752C77.8539 550.208 77.6219 549.48 77.6219 548.568C77.6219 547.8 77.8299 547.104 78.2459 546.48C78.6779 545.84 79.3019 545.336 80.1179 544.968C80.9499 544.6 81.9339 544.416 83.0699 544.416C84.7499 544.416 86.0699 544.832 87.0299 545.664C88.0059 546.496 88.5659 547.6 88.7099 548.976H84.9179C84.8539 548.512 84.6459 548.144 84.2939 547.872C83.9579 547.6 83.5099 547.464 82.9499 547.464C82.4699 547.464 82.1019 547.56 81.8459 547.752C81.5899 547.928 81.4619 548.176 81.4619 548.496C81.4619 548.88 81.6619 549.168 82.0619 549.36C82.4779 549.552 83.1179 549.744 83.9819 549.936C84.9739 550.192 85.7819 550.448 86.4059 550.704C87.0299 550.944 87.5739 551.344 88.0379 551.904C88.5179 552.448 88.7659 553.184 88.7819 554.112C88.7819 554.896 88.5579 555.6 88.1099 556.224C87.6779 556.832 87.0459 557.312 86.2139 557.664C85.3979 558.016 84.4459 558.192 83.3579 558.192ZM103.917 551.088C103.917 551.472 103.893 551.872 103.845 552.288H94.5567C94.6207 553.12 94.8847 553.76 95.3487 554.208C95.8287 554.64 96.4127 554.856 97.1007 554.856C98.1247 554.856 98.8367 554.424 99.2367 553.56H103.605C103.381 554.44 102.973 555.232 102.381 555.936C101.805 556.64 101.077 557.192 100.197 557.592C99.3167 557.992 98.3327 558.192 97.2447 558.192C95.9327 558.192 94.7647 557.912 93.7407 557.352C92.7167 556.792 91.9167 555.992 91.3407 554.952C90.7647 553.912 90.4767 552.696 90.4767 551.304C90.4767 549.912 90.7567 548.696 91.3167 547.656C91.8927 546.616 92.6927 545.816 93.7167 545.256C94.7407 544.696 95.9167 544.416 97.2447 544.416C98.5407 544.416 99.6927 544.688 100.701 545.232C101.709 545.776 102.493 546.552 103.053 547.56C103.629 548.568 103.917 549.744 103.917 551.088ZM99.7167 550.008C99.7167 549.304 99.4767 548.744 98.9967 548.328C98.5167 547.912 97.9167 547.704 97.1967 547.704C96.5087 547.704 95.9247 547.904 95.4447 548.304C94.9807 548.704 94.6927 549.272 94.5807 550.008H99.7167ZM114.242 544.464C115.81 544.464 117.058 544.976 117.986 546C118.93 547.008 119.402 548.4 119.402 550.176V558H115.322V550.728C115.322 549.832 115.09 549.136 114.626 548.64C114.162 548.144 113.538 547.896 112.754 547.896C111.97 547.896 111.346 548.144 110.882 548.64C110.418 549.136 110.186 549.832 110.186 550.728V558H106.082V544.608H110.186V546.384C110.602 545.792 111.162 545.328 111.866 544.992C112.57 544.64 113.362 544.464 114.242 544.464ZM126.358 546.504C126.742 545.88 127.294 545.376 128.014 544.992C128.734 544.608 129.558 544.416 130.486 544.416C131.59 544.416 132.59 544.696 133.486 545.256C134.382 545.816 135.086 546.616 135.598 547.656C136.126 548.696 136.39 549.904 136.39 551.28C136.39 552.656 136.126 553.872 135.598 554.928C135.086 555.968 134.382 556.776 133.486 557.352C132.59 557.912 131.59 558.192 130.486 558.192C129.542 558.192 128.718 558.008 128.014 557.64C127.31 557.256 126.758 556.752 126.358 556.128V558H122.254V540.24H126.358V546.504ZM132.214 551.28C132.214 550.256 131.926 549.456 131.35 548.88C130.79 548.288 130.094 547.992 129.262 547.992C128.446 547.992 127.75 548.288 127.174 548.88C126.614 549.472 126.334 550.28 126.334 551.304C126.334 552.328 126.614 553.136 127.174 553.728C127.75 554.32 128.446 554.616 129.262 554.616C130.078 554.616 130.774 554.32 131.35 553.728C131.926 553.12 132.214 552.304 132.214 551.28ZM151.167 551.088C151.167 551.472 151.143 551.872 151.095 552.288H141.807C141.871 553.12 142.135 553.76 142.599 554.208C143.079 554.64 143.663 554.856 144.351 554.856C145.375 554.856 146.087 554.424 146.487 553.56H150.855C150.631 554.44 150.223 555.232 149.631 555.936C149.055 556.64 148.327 557.192 147.447 557.592C146.567 557.992 145.583 558.192 144.495 558.192C143.183 558.192 142.015 557.912 140.991 557.352C139.967 556.792 139.167 555.992 138.591 554.952C138.015 553.912 137.727 552.696 137.727 551.304C137.727 549.912 138.007 548.696 138.567 547.656C139.143 546.616 139.943 545.816 140.967 545.256C141.991 544.696 143.167 544.416 144.495 544.416C145.791 544.416 146.943 544.688 147.951 545.232C148.959 545.776 149.743 546.552 150.303 547.56C150.879 548.568 151.167 549.744 151.167 551.088ZM146.967 550.008C146.967 549.304 146.727 548.744 146.247 548.328C145.767 547.912 145.167 547.704 144.447 547.704C143.759 547.704 143.175 547.904 142.695 548.304C142.231 548.704 141.943 549.272 141.831 550.008H146.967ZM157.436 546.84C157.916 546.104 158.516 545.528 159.236 545.112C159.956 544.68 160.756 544.464 161.636 544.464V548.808H160.508C159.484 548.808 158.716 549.032 158.204 549.48C157.692 549.912 157.436 550.68 157.436 551.784V558H153.332V544.608H157.436V546.84ZM168.685 544.416C169.629 544.416 170.453 544.608 171.157 544.992C171.877 545.376 172.429 545.88 172.813 546.504V544.608H176.917V557.976C176.917 559.208 176.669 560.32 176.173 561.312C175.693 562.32 174.949 563.12 173.941 563.712C172.949 564.304 171.709 564.6 170.221 564.6C168.237 564.6 166.629 564.128 165.397 563.184C164.165 562.256 163.461 560.992 163.285 559.392H167.341C167.469 559.904 167.773 560.304 168.253 560.592C168.733 560.896 169.325 561.048 170.029 561.048C170.877 561.048 171.549 560.8 172.045 560.304C172.557 559.824 172.813 559.048 172.813 557.976V556.08C172.413 556.704 171.861 557.216 171.157 557.616C170.453 558 169.629 558.192 168.685 558.192C167.581 558.192 166.581 557.912 165.685 557.352C164.789 556.776 164.077 555.968 163.549 554.928C163.037 553.872 162.781 552.656 162.781 551.28C162.781 549.904 163.037 548.696 163.549 547.656C164.077 546.616 164.789 545.816 165.685 545.256C166.581 544.696 167.581 544.416 168.685 544.416ZM172.813 551.304C172.813 550.28 172.525 549.472 171.949 548.88C171.389 548.288 170.701 547.992 169.885 547.992C169.069 547.992 168.373 548.288 167.797 548.88C167.237 549.456 166.957 550.256 166.957 551.28C166.957 552.304 167.237 553.12 167.797 553.728C168.373 554.32 169.069 554.616 169.885 554.616C170.701 554.616 171.389 554.32 171.949 553.728C172.525 553.136 172.813 552.328 172.813 551.304Z" fill="white"/>
<path d="M336.5 562.5V540C336.5 539.312 336.745 538.724 337.235 538.234C337.724 537.745 338.312 537.5 339 537.5H359C359.688 537.5 360.276 537.745 360.766 538.234C361.255 538.724 361.5 539.312 361.5 540V555C361.5 555.688 361.255 556.276 360.766 556.766C360.276 557.255 359.688 557.5 359 557.5H341.5L336.5 562.5Z" fill="#F8F8F8"/>
<rect x="13" y="597" width="363" height="80" rx="5" fill="#2E2323"/>
<rect x="13" y="597" width="363" height="80" rx="5" fill="#2E2323"/>
<path d="M287.988 634.877C288.092 635.977 287.505 636.931 286.685 636.997C285.865 637.062 285.115 636.224 285.012 635.124C284.908 634.023 285.495 633.07 286.315 633.004C287.135 632.931 287.885 633.768 287.988 634.877ZM292.685 646.996C293.505 646.931 294.092 645.978 293.988 644.877C293.885 643.768 293.134 642.931 292.315 643.005C291.495 643.07 290.908 644.023 291.012 645.124C291.115 646.224 291.866 647.062 292.685 646.996ZM305.686 633.004C306.506 633.069 307.092 634.022 306.988 635.123C306.885 636.232 306.134 637.069 305.314 636.996C304.494 636.93 303.908 635.977 304.012 634.876C304.115 633.776 304.866 632.938 305.686 633.004ZM303.988 640.123C304.092 639.023 303.505 638.069 302.686 638.003C301.866 637.938 301.116 638.776 301.012 639.876C300.908 640.977 301.495 641.93 302.314 641.996C303.134 642.069 303.884 641.232 303.988 640.123ZM299.686 643.004C300.506 643.069 301.092 644.022 300.988 645.123C300.885 646.232 300.134 647.069 299.314 646.995C298.494 646.93 297.908 645.977 298.012 644.876C298.115 643.776 298.866 642.938 299.686 643.004Z" fill="#F8F8F8"/>
<path d="M293.883 623.451L284.494 627.504C284.275 627.602 284.078 627.734 283.904 627.894C283.36 628.027 282.877 628.339 282.532 628.78C282.186 629.221 281.999 629.764 282 630.324V644.494C282 645.077 282.17 645.647 282.489 646.135C282.807 646.623 283.261 647.007 283.795 647.241L293.496 651.494C293.793 651.624 294.096 651.692 294.396 651.704C295.43 652.098 296.571 652.098 297.605 651.704C297.903 651.692 298.207 651.624 298.504 651.494L308.204 647.241C308.738 647.007 309.192 646.623 309.511 646.135C309.83 645.647 310 645.076 310 644.493V630.323C310.001 629.785 309.828 629.261 309.507 628.829C309.186 628.398 308.734 628.081 308.218 627.927C308.043 627.75 307.836 627.606 307.608 627.504L298.118 623.451C297.452 623.154 296.73 623 296.001 623C295.271 623 294.549 623.154 293.883 623.451V623.451ZM295 635.81V649.206C295 649.289 294.979 649.371 294.939 649.444C294.9 649.516 294.843 649.578 294.773 649.624C294.704 649.669 294.624 649.696 294.542 649.703C294.459 649.71 294.376 649.696 294.3 649.663L284.597 645.41C284.419 645.332 284.268 645.203 284.162 645.041C284.056 644.878 284 644.688 284 644.493V630.323C284 630.24 284.021 630.158 284.061 630.084C284.101 630.011 284.159 629.949 284.229 629.904C284.299 629.858 284.38 629.831 284.463 629.825C284.546 629.819 284.63 629.834 284.706 629.868L293.823 633.986C294.174 634.145 294.472 634.401 294.681 634.725C294.889 635.048 295 635.425 295 635.81ZM297 649.206V635.808C297 635.423 297.111 635.047 297.32 634.723C297.529 634.4 297.826 634.144 298.177 633.985L307.294 629.867C307.37 629.833 307.454 629.818 307.537 629.824C307.621 629.83 307.701 629.857 307.771 629.903C307.842 629.948 307.899 630.01 307.939 630.084C307.979 630.157 308 630.24 308 630.323V644.493C308 644.687 307.943 644.877 307.837 645.04C307.731 645.202 307.58 645.33 307.402 645.408L297.7 649.662C297.624 649.696 297.541 649.71 297.458 649.703C297.375 649.696 297.296 649.669 297.226 649.623C297.156 649.578 297.099 649.516 297.06 649.443C297.02 649.37 296.999 649.288 296.999 649.205L297 649.206ZM296 628.5C294.343 628.5 293 628.052 293 627.5C293 626.948 294.343 626.5 296 626.5C297.657 626.5 299 626.948 299 627.5C299 628.052 297.657 628.5 296 628.5Z" fill="#F8F8F8"/>
<path d="M50.608 628.152V631.44H46.144V645H42.04V631.44H37.576V628.152H50.608ZM65.2917 638.088C65.2917 638.472 65.2677 638.872 65.2197 639.288H55.9317C55.9957 640.12 56.2597 640.76 56.7237 641.208C57.2037 641.64 57.7877 641.856 58.4757 641.856C59.4997 641.856 60.2117 641.424 60.6117 640.56H64.9797C64.7557 641.44 64.3477 642.232 63.7557 642.936C63.1797 643.64 62.4517 644.192 61.5717 644.592C60.6917 644.992 59.7077 645.192 58.6197 645.192C57.3077 645.192 56.1397 644.912 55.1157 644.352C54.0917 643.792 53.2917 642.992 52.7157 641.952C52.1397 640.912 51.8517 639.696 51.8517 638.304C51.8517 636.912 52.1317 635.696 52.6917 634.656C53.2677 633.616 54.0677 632.816 55.0917 632.256C56.1157 631.696 57.2917 631.416 58.6197 631.416C59.9157 631.416 61.0677 631.688 62.0757 632.232C63.0837 632.776 63.8677 633.552 64.4277 634.56C65.0037 635.568 65.2917 636.744 65.2917 638.088ZM61.0917 637.008C61.0917 636.304 60.8517 635.744 60.3717 635.328C59.8917 634.912 59.2917 634.704 58.5717 634.704C57.8837 634.704 57.2997 634.904 56.8197 635.304C56.3557 635.704 56.0677 636.272 55.9557 637.008H61.0917ZM71.5608 627.24V645H67.4568V627.24H71.5608ZM73.7189 638.28C73.7189 636.904 73.9749 635.696 74.4869 634.656C75.0149 633.616 75.7269 632.816 76.6229 632.256C77.5189 631.696 78.5189 631.416 79.6229 631.416C80.5669 631.416 81.3909 631.608 82.0949 631.992C82.8149 632.376 83.3669 632.88 83.7509 633.504V631.608H87.8549V645H83.7509V643.104C83.3509 643.728 82.7909 644.232 82.0709 644.616C81.3669 645 80.5429 645.192 79.5989 645.192C78.5109 645.192 77.5189 644.912 76.6229 644.352C75.7269 643.776 75.0149 642.968 74.4869 641.928C73.9749 640.872 73.7189 639.656 73.7189 638.28ZM83.7509 638.304C83.7509 637.28 83.4629 636.472 82.8869 635.88C82.3269 635.288 81.6389 634.992 80.8229 634.992C80.0069 634.992 79.3109 635.288 78.7349 635.88C78.1749 636.456 77.8949 637.256 77.8949 638.28C77.8949 639.304 78.1749 640.12 78.7349 640.728C79.3109 641.32 80.0069 641.616 80.8229 641.616C81.6389 641.616 82.3269 641.32 82.8869 640.728C83.4629 640.136 83.7509 639.328 83.7509 638.304ZM90.0079 638.28C90.0079 636.904 90.2639 635.696 90.7759 634.656C91.3039 633.616 92.0159 632.816 92.9119 632.256C93.8079 631.696 94.8079 631.416 95.9119 631.416C96.8559 631.416 97.6799 631.608 98.3839 631.992C99.1039 632.376 99.6559 632.88 100.04 633.504V631.608H104.144V645H100.04V643.104C99.6399 643.728 99.0799 644.232 98.3599 644.616C97.6559 645 96.8319 645.192 95.8879 645.192C94.7999 645.192 93.8079 644.912 92.9119 644.352C92.0159 643.776 91.3039 642.968 90.7759 641.928C90.2639 640.872 90.0079 639.656 90.0079 638.28ZM100.04 638.304C100.04 637.28 99.7519 636.472 99.1759 635.88C98.6159 635.288 97.9279 634.992 97.1119 634.992C96.2959 634.992 95.5999 635.288 95.0239 635.88C94.4639 636.456 94.1839 637.256 94.1839 638.28C94.1839 639.304 94.4639 640.12 95.0239 640.728C95.5999 641.32 96.2959 641.616 97.1119 641.616C97.9279 641.616 98.6159 641.32 99.1759 640.728C99.7519 640.136 100.04 639.328 100.04 638.304Z" fill="white"/>
<path d="M336.5 649.5V627C336.5 626.312 336.745 625.724 337.235 625.234C337.724 624.745 338.312 624.5 339 624.5H359C359.688 624.5 360.276 624.745 360.766 625.234C361.255 625.724 361.5 626.312 361.5 627V642C361.5 642.688 361.255 643.276 360.766 643.766C360.276 644.255 359.688 644.5 359 644.5H341.5L336.5 649.5Z" fill="#F8F8F8"/>
<rect x="14" y="684" width="363" height="80" rx="5" fill="#2E2323"/>
<rect x="14" y="684" width="363" height="80" rx="5" fill="#2E2323"/>
<path d="M288.988 721.877C289.092 722.977 288.505 723.931 287.685 723.997C286.865 724.062 286.115 723.224 286.012 722.124C285.908 721.023 286.495 720.07 287.315 720.004C288.135 719.931 288.885 720.768 288.988 721.877ZM293.685 733.996C294.505 733.931 295.092 732.978 294.988 731.877C294.885 730.768 294.134 729.931 293.315 730.005C292.495 730.07 291.908 731.023 292.012 732.124C292.115 733.224 292.866 734.062 293.685 733.996ZM306.686 720.004C307.506 720.069 308.092 721.022 307.988 722.123C307.885 723.232 307.134 724.069 306.314 723.996C305.494 723.93 304.908 722.977 305.012 721.876C305.115 720.776 305.866 719.938 306.686 720.004ZM304.988 727.123C305.092 726.023 304.505 725.069 303.686 725.003C302.866 724.938 302.116 725.776 302.012 726.876C301.908 727.977 302.495 728.93 303.314 728.996C304.134 729.069 304.884 728.232 304.988 727.123ZM300.686 730.004C301.506 730.069 302.092 731.022 301.988 732.123C301.885 733.232 301.134 734.069 300.314 733.995C299.494 733.93 298.908 732.977 299.012 731.876C299.115 730.776 299.866 729.938 300.686 730.004Z" fill="#F8F8F8"/>
<path d="M294.883 710.451L285.494 714.504C285.275 714.602 285.078 714.734 284.904 714.894C284.36 715.027 283.877 715.339 283.532 715.78C283.186 716.221 282.999 716.764 283 717.324V731.494C283 732.077 283.17 732.647 283.489 733.135C283.807 733.623 284.261 734.007 284.795 734.241L294.496 738.494C294.793 738.624 295.096 738.692 295.396 738.704C296.43 739.098 297.571 739.098 298.605 738.704C298.903 738.692 299.207 738.624 299.504 738.494L309.204 734.241C309.738 734.007 310.192 733.623 310.511 733.135C310.83 732.647 311 732.076 311 731.493V717.323C311.001 716.785 310.828 716.261 310.507 715.829C310.186 715.398 309.734 715.081 309.218 714.927C309.043 714.75 308.836 714.606 308.608 714.504L299.118 710.451C298.452 710.154 297.73 710 297.001 710C296.271 710 295.549 710.154 294.883 710.451V710.451ZM296 722.81V736.206C296 736.289 295.979 736.371 295.939 736.444C295.9 736.516 295.843 736.578 295.773 736.624C295.704 736.669 295.624 736.696 295.542 736.703C295.459 736.71 295.376 736.696 295.3 736.663L285.597 732.41C285.419 732.332 285.268 732.203 285.162 732.041C285.056 731.878 285 731.688 285 731.493V717.323C285 717.24 285.021 717.158 285.061 717.084C285.101 717.011 285.159 716.949 285.229 716.904C285.299 716.858 285.38 716.831 285.463 716.825C285.546 716.819 285.63 716.834 285.706 716.868L294.823 720.986C295.174 721.145 295.472 721.401 295.681 721.725C295.889 722.048 296 722.425 296 722.81ZM298 736.206V722.808C298 722.423 298.111 722.047 298.32 721.723C298.529 721.4 298.826 721.144 299.177 720.985L308.294 716.867C308.37 716.833 308.454 716.818 308.537 716.824C308.621 716.83 308.701 716.857 308.771 716.903C308.842 716.948 308.899 717.01 308.939 717.084C308.979 717.157 309 717.24 309 717.323V731.493C309 731.687 308.943 731.877 308.837 732.04C308.731 732.202 308.58 732.33 308.402 732.408L298.7 736.662C298.624 736.696 298.541 736.71 298.458 736.703C298.375 736.696 298.296 736.669 298.226 736.623C298.156 736.578 298.099 736.516 298.06 736.443C298.02 736.37 297.999 736.288 297.999 736.205L298 736.206ZM297 715.5C295.343 715.5 294 715.052 294 714.5C294 713.948 295.343 713.5 297 713.5C298.657 713.5 300 713.948 300 714.5C300 715.052 298.657 715.5 297 715.5Z" fill="#F8F8F8"/>
<path d="M43.592 718.44V721.848H49.088V725.016H43.592V728.712H49.808V732H39.488V715.152H49.808V718.44H43.592ZM69.5604 718.464C71.2244 718.464 72.5444 718.968 73.5204 719.976C74.5124 720.984 75.0084 722.384 75.0084 724.176V732H70.9284V724.728C70.9284 723.864 70.6964 723.2 70.2324 722.736C69.7844 722.256 69.1604 722.016 68.3604 722.016C67.5604 722.016 66.9284 722.256 66.4644 722.736C66.0164 723.2 65.7924 723.864 65.7924 724.728V732H61.7124V724.728C61.7124 723.864 61.4804 723.2 61.0164 722.736C60.5684 722.256 59.9444 722.016 59.1444 722.016C58.3444 722.016 57.7124 722.256 57.2484 722.736C56.8004 723.2 56.5764 723.864 56.5764 724.728V732H52.4724V718.608H56.5764V720.288C56.9924 719.728 57.5364 719.288 58.2084 718.968C58.8804 718.632 59.6404 718.464 60.4884 718.464C61.4964 718.464 62.3924 718.68 63.1764 719.112C63.9764 719.544 64.6004 720.16 65.0484 720.96C65.5124 720.224 66.1444 719.624 66.9444 719.16C67.7444 718.696 68.6164 718.464 69.5604 718.464ZM90.5026 725.088C90.5026 725.472 90.4786 725.872 90.4306 726.288H81.1426C81.2066 727.12 81.4706 727.76 81.9346 728.208C82.4146 728.64 82.9986 728.856 83.6866 728.856C84.7106 728.856 85.4226 728.424 85.8226 727.56H90.1906C89.9666 728.44 89.5586 729.232 88.9666 729.936C88.3906 730.64 87.6626 731.192 86.7826 731.592C85.9026 731.992 84.9186 732.192 83.8306 732.192C82.5186 732.192 81.3506 731.912 80.3266 731.352C79.3026 730.792 78.5026 729.992 77.9266 728.952C77.3506 727.912 77.0626 726.696 77.0626 725.304C77.0626 723.912 77.3426 722.696 77.9026 721.656C78.4786 720.616 79.2786 719.816 80.3026 719.256C81.3266 718.696 82.5026 718.416 83.8306 718.416C85.1266 718.416 86.2786 718.688 87.2866 719.232C88.2946 719.776 89.0786 720.552 89.6386 721.56C90.2146 722.568 90.5026 723.744 90.5026 725.088ZM86.3026 724.008C86.3026 723.304 86.0626 722.744 85.5826 722.328C85.1026 721.912 84.5026 721.704 83.7826 721.704C83.0946 721.704 82.5106 721.904 82.0306 722.304C81.5666 722.704 81.2786 723.272 81.1666 724.008H86.3026ZM100.132 728.52V732H98.0437C96.5557 732 95.3957 731.64 94.5637 730.92C93.7317 730.184 93.3157 728.992 93.3157 727.344V722.016H91.6837V718.608H93.3157V715.344H97.4197V718.608H100.108V722.016H97.4197V727.392C97.4197 727.792 97.5157 728.08 97.7077 728.256C97.8997 728.432 98.2197 728.52 98.6677 728.52H100.132ZM113.6 732.168C112.368 732.168 111.264 731.968 110.288 731.568C109.312 731.168 108.528 730.576 107.936 729.792C107.36 729.008 107.056 728.064 107.024 726.96H111.392C111.456 727.584 111.672 728.064 112.04 728.4C112.408 728.72 112.888 728.88 113.48 728.88C114.088 728.88 114.568 728.744 114.92 728.472C115.272 728.184 115.448 727.792 115.448 727.296C115.448 726.88 115.304 726.536 115.016 726.264C114.744 725.992 114.4 725.768 113.984 725.592C113.584 725.416 113.008 725.216 112.256 724.992C111.168 724.656 110.28 724.32 109.592 723.984C108.904 723.648 108.312 723.152 107.816 722.496C107.32 721.84 107.072 720.984 107.072 719.928C107.072 718.36 107.64 717.136 108.776 716.256C109.912 715.36 111.392 714.912 113.216 714.912C115.072 714.912 116.568 715.36 117.704 716.256C118.84 717.136 119.448 718.368 119.528 719.952H115.088C115.056 719.408 114.856 718.984 114.488 718.68C114.12 718.36 113.648 718.2 113.072 718.2C112.576 718.2 112.176 718.336 111.872 718.608C111.568 718.864 111.416 719.24 111.416 719.736C111.416 720.28 111.672 720.704 112.184 721.008C112.696 721.312 113.496 721.64 114.584 721.992C115.672 722.36 116.552 722.712 117.224 723.048C117.912 723.384 118.504 723.872 119 724.512C119.496 725.152 119.744 725.976 119.744 726.984C119.744 727.944 119.496 728.816 119 729.6C118.52 730.384 117.816 731.008 116.888 731.472C115.96 731.936 114.864 732.168 113.6 732.168ZM134.893 725.088C134.893 725.472 134.869 725.872 134.821 726.288H125.533C125.597 727.12 125.861 727.76 126.325 728.208C126.805 728.64 127.389 728.856 128.077 728.856C129.101 728.856 129.813 728.424 130.213 727.56H134.581C134.357 728.44 133.949 729.232 133.357 729.936C132.781 730.64 132.053 731.192 131.173 731.592C130.293 731.992 129.309 732.192 128.221 732.192C126.909 732.192 125.741 731.912 124.717 731.352C123.693 730.792 122.893 729.992 122.317 728.952C121.741 727.912 121.453 726.696 121.453 725.304C121.453 723.912 121.733 722.696 122.293 721.656C122.869 720.616 123.669 719.816 124.693 719.256C125.717 718.696 126.893 718.416 128.221 718.416C129.517 718.416 130.669 718.688 131.677 719.232C132.685 719.776 133.469 720.552 134.029 721.56C134.605 722.568 134.893 723.744 134.893 725.088ZM130.693 724.008C130.693 723.304 130.453 722.744 129.973 722.328C129.493 721.912 128.893 721.704 128.173 721.704C127.485 721.704 126.901 721.904 126.421 722.304C125.957 722.704 125.669 723.272 125.557 724.008H130.693ZM141.162 714.24V732H137.058V714.24H141.162ZM143.32 725.304C143.32 723.912 143.6 722.696 144.16 721.656C144.736 720.616 145.528 719.816 146.536 719.256C147.56 718.696 148.728 718.416 150.04 718.416C151.72 718.416 153.12 718.856 154.24 719.736C155.376 720.616 156.12 721.856 156.472 723.456H152.104C151.736 722.432 151.024 721.92 149.968 721.92C149.216 721.92 148.616 722.216 148.168 722.808C147.72 723.384 147.496 724.216 147.496 725.304C147.496 726.392 147.72 727.232 148.168 727.824C148.616 728.4 149.216 728.688 149.968 728.688C151.024 728.688 151.736 728.176 152.104 727.152H156.472C156.12 728.72 155.376 729.952 154.24 730.848C153.104 731.744 151.704 732.192 150.04 732.192C148.728 732.192 147.56 731.912 146.536 731.352C145.528 730.792 144.736 729.992 144.16 728.952C143.6 727.912 143.32 726.696 143.32 725.304ZM166.9 718.464C168.436 718.464 169.668 718.976 170.596 720C171.524 721.008 171.988 722.4 171.988 724.176V732H167.908V724.728C167.908 723.832 167.676 723.136 167.212 722.64C166.748 722.144 166.124 721.896 165.34 721.896C164.556 721.896 163.932 722.144 163.468 722.64C163.004 723.136 162.772 723.832 162.772 724.728V732H158.668V714.24H162.772V720.408C163.188 719.816 163.756 719.344 164.476 718.992C165.196 718.64 166.004 718.464 166.9 718.464Z" fill="white"/>
<path d="M337.5 736.5V714C337.5 713.312 337.745 712.724 338.235 712.234C338.724 711.745 339.312 711.5 340 711.5H360C360.688 711.5 361.276 711.745 361.766 712.234C362.255 712.724 362.5 713.312 362.5 714V729C362.5 729.688 362.255 730.276 361.766 730.766C361.276 731.255 360.688 731.5 360 731.5H342.5L337.5 736.5Z" fill="#F8F8F8"/>
<rect x="13" y="771" width="363" height="80" rx="5" fill="#2E2323"/>
<rect x="13" y="771" width="363" height="80" rx="5" fill="#2E2323"/>
<path d="M287.988 808.877C288.092 809.977 287.505 810.931 286.685 810.997C285.865 811.062 285.115 810.224 285.012 809.124C284.908 808.023 285.495 807.07 286.315 807.004C287.135 806.931 287.885 807.768 287.988 808.877ZM292.685 820.996C293.505 820.931 294.092 819.978 293.988 818.877C293.885 817.768 293.134 816.931 292.315 817.005C291.495 817.07 290.908 818.023 291.012 819.124C291.115 820.224 291.866 821.062 292.685 820.996ZM305.686 807.004C306.506 807.069 307.092 808.022 306.988 809.123C306.885 810.232 306.134 811.069 305.314 810.996C304.494 810.93 303.908 809.977 304.012 808.876C304.115 807.776 304.866 806.938 305.686 807.004ZM303.988 814.123C304.092 813.023 303.505 812.069 302.686 812.003C301.866 811.938 301.116 812.776 301.012 813.876C300.908 814.977 301.495 815.93 302.314 815.996C303.134 816.069 303.884 815.232 303.988 814.123ZM299.686 817.004C300.506 817.069 301.092 818.022 300.988 819.123C300.885 820.232 300.134 821.069 299.314 820.995C298.494 820.93 297.908 819.977 298.012 818.876C298.115 817.776 298.866 816.938 299.686 817.004Z" fill="#F8F8F8"/>
<path d="M293.883 797.451L284.494 801.504C284.275 801.602 284.078 801.734 283.904 801.894C283.36 802.027 282.877 802.339 282.532 802.78C282.186 803.221 281.999 803.764 282 804.324V818.494C282 819.077 282.17 819.647 282.489 820.135C282.807 820.623 283.261 821.007 283.795 821.241L293.496 825.494C293.793 825.624 294.096 825.692 294.396 825.704C295.43 826.098 296.571 826.098 297.605 825.704C297.903 825.692 298.207 825.624 298.504 825.494L308.204 821.241C308.738 821.007 309.192 820.623 309.511 820.135C309.83 819.647 310 819.076 310 818.493V804.323C310.001 803.785 309.828 803.261 309.507 802.829C309.186 802.398 308.734 802.081 308.218 801.927C308.043 801.75 307.836 801.606 307.608 801.504L298.118 797.451C297.452 797.154 296.73 797 296.001 797C295.271 797 294.549 797.154 293.883 797.451V797.451ZM295 809.81V823.206C295 823.289 294.979 823.371 294.939 823.444C294.9 823.516 294.843 823.578 294.773 823.624C294.704 823.669 294.624 823.696 294.542 823.703C294.459 823.71 294.376 823.696 294.3 823.663L284.597 819.41C284.419 819.332 284.268 819.203 284.162 819.041C284.056 818.878 284 818.688 284 818.493V804.323C284 804.24 284.021 804.158 284.061 804.084C284.101 804.011 284.159 803.949 284.229 803.904C284.299 803.858 284.38 803.831 284.463 803.825C284.546 803.819 284.63 803.834 284.706 803.868L293.823 807.986C294.174 808.145 294.472 808.401 294.681 808.725C294.889 809.048 295 809.425 295 809.81ZM297 823.206V809.808C297 809.423 297.111 809.047 297.32 808.723C297.529 808.4 297.826 808.144 298.177 807.985L307.294 803.867C307.37 803.833 307.454 803.818 307.537 803.824C307.621 803.83 307.701 803.857 307.771 803.903C307.842 803.948 307.899 804.01 307.939 804.084C307.979 804.157 308 804.24 308 804.323V818.493C308 818.687 307.943 818.877 307.837 819.04C307.731 819.202 307.58 819.33 307.402 819.408L297.7 823.662C297.624 823.696 297.541 823.71 297.458 823.703C297.375 823.696 297.296 823.669 297.226 823.623C297.156 823.578 297.099 823.516 297.06 823.443C297.02 823.37 296.999 823.288 296.999 823.205L297 823.206ZM296 802.5C294.343 802.5 293 802.052 293 801.5C293 800.948 294.343 800.5 296 800.5C297.657 800.5 299 800.948 299 801.5C299 802.052 297.657 802.5 296 802.5Z" fill="#F8F8F8"/>
<path d="M37.936 815.712C38.48 815.28 38.728 815.08 38.68 815.112C40.248 813.816 41.48 812.752 42.376 811.92C43.288 811.088 44.056 810.216 44.68 809.304C45.304 808.392 45.616 807.504 45.616 806.64C45.616 805.984 45.464 805.472 45.16 805.104C44.856 804.736 44.4 804.552 43.792 804.552C43.184 804.552 42.704 804.784 42.352 805.248C42.016 805.696 41.848 806.336 41.848 807.168H37.888C37.92 805.808 38.208 804.672 38.752 803.76C39.312 802.848 40.04 802.176 40.936 801.744C41.848 801.312 42.856 801.096 43.96 801.096C45.864 801.096 47.296 801.584 48.256 802.56C49.232 803.536 49.72 804.808 49.72 806.376C49.72 808.088 49.136 809.68 47.968 811.152C46.8 812.608 45.312 814.032 43.504 815.424H49.984V818.76H37.936V815.712ZM56.3029 807.504C56.6869 806.88 57.2389 806.376 57.9589 805.992C58.6789 805.608 59.5029 805.416 60.4309 805.416C61.5349 805.416 62.5349 805.696 63.4309 806.256C64.3269 806.816 65.0309 807.616 65.5429 808.656C66.0709 809.696 66.3349 810.904 66.3349 812.28C66.3349 813.656 66.0709 814.872 65.5429 815.928C65.0309 816.968 64.3269 817.776 63.4309 818.352C62.5349 818.912 61.5349 819.192 60.4309 819.192C59.4869 819.192 58.6629 819.008 57.9589 818.64C57.2549 818.256 56.7029 817.752 56.3029 817.128V819H52.1989V801.24H56.3029V807.504ZM62.1589 812.28C62.1589 811.256 61.8709 810.456 61.2949 809.88C60.7349 809.288 60.0389 808.992 59.2069 808.992C58.3909 808.992 57.6949 809.288 57.1189 809.88C56.5589 810.472 56.2789 811.28 56.2789 812.304C56.2789 813.328 56.5589 814.136 57.1189 814.728C57.6949 815.32 58.3909 815.616 59.2069 815.616C60.0229 815.616 60.7189 815.32 61.2949 814.728C61.8709 814.12 62.1589 813.304 62.1589 812.28Z" fill="white"/>
<path d="M336.5 823.5V801C336.5 800.312 336.745 799.724 337.235 799.234C337.724 798.745 338.312 798.5 339 798.5H359C359.688 798.5 360.276 798.745 360.766 799.234C361.255 799.724 361.5 800.312 361.5 801V816C361.5 816.688 361.255 817.276 360.766 817.766C360.276 818.255 359.688 818.5 359 818.5H341.5L336.5 823.5Z" fill="#F8F8F8"/>
<path d="M44.0582 93H21.9947C20.9798 93 20.1855 93.5833 19.656 94.4667L12.2427 107.083C11.9191 107.65 11.9191 108.367 12.2427 108.933L19.656 121.533C20.1855 122.4 20.9798 123 21.9947 123H44.0582C45.6762 123 47 121.5 47 119.667V96.3333C47 94.5 45.6762 93 44.0582 93ZM38.6159 115.167C38.4798 115.321 38.3182 115.444 38.1402 115.527C37.9623 115.611 37.7715 115.654 37.5789 115.654C37.3863 115.654 37.1955 115.611 37.0176 115.527C36.8396 115.444 36.678 115.321 36.5419 115.167L32.291 110.35L28.0401 115.167C27.7651 115.478 27.3921 115.653 27.0032 115.653C26.6142 115.653 26.2412 115.478 25.9662 115.167C25.6911 114.855 25.5366 114.432 25.5366 113.992C25.5366 113.551 25.6911 113.128 25.9662 112.817L30.2171 108L25.9662 103.183C25.6911 102.872 25.5366 102.449 25.5366 102.008C25.5366 101.79 25.5746 101.574 25.6483 101.372C25.722 101.171 25.83 100.988 25.9662 100.833C26.1023 100.679 26.264 100.557 26.4419 100.473C26.6199 100.39 26.8106 100.347 27.0032 100.347C27.3921 100.347 27.7651 100.522 28.0401 100.833L32.291 105.65L36.5419 100.833C36.6781 100.679 36.8398 100.557 37.0177 100.473C37.1956 100.39 37.3863 100.347 37.5789 100.347C37.7715 100.347 37.9622 100.39 38.1401 100.473C38.318 100.557 38.4797 100.679 38.6159 100.833C38.7521 100.988 38.8601 101.171 38.9338 101.372C39.0075 101.574 39.0454 101.79 39.0454 102.008C39.0454 102.227 39.0075 102.443 38.9338 102.644C38.8601 102.846 38.7521 103.029 38.6159 103.183L34.365 108L38.6159 112.817C39.1748 113.45 39.1748 114.517 38.6159 115.167Z" fill="#F8F8F8"/>
<rect x="346" y="23" width="29" height="4" rx="2" fill="#D9D9D9"/>
<rect x="346" y="32" width="29" height="4" rx="2" fill="#D9D9D9"/>
<rect x="346" y="41" width="29" height="4" rx="2" fill="#D9D9D9"/>
</g>
<defs>
<clipPath id="clip0_14_78">
<rect width="390" height="844" fill="white"/>
</clipPath>
</defs>
</svg>
