<?xml version="1.0" encoding="UTF-8"?>
<svg xmlns="http://www.w3.org/2000/svg" xmlns:xlink="http://www.w3.org/1999/xlink" width="25px" height="21px" viewBox="0 0 25 21" version="1.1">
<g id="surface1">
<path style=" stroke:none;fill-rule:nonzero;fill:rgb(0%,0%,0%);fill-opacity:1;" d="M 21.339844 2.226562 L 21.695312 1.792969 Z M 13.3125 2.847656 L 12.921875 2.449219 L 12.917969 2.453125 Z M 12.5 3.734375 L 12.113281 4.132812 L 12.511719 4.546875 L 12.898438 4.125 Z M 11.640625 2.847656 L 11.246094 3.238281 L 11.25 3.246094 L 11.253906 3.25 Z M 3.617188 2.226562 L 3.261719 1.792969 Z M 3.191406 11.449219 L 2.792969 11.84375 Z M 11.511719 20.316406 L 11.917969 19.933594 L 11.90625 19.921875 Z M 13.445312 20.316406 L 13.050781 19.921875 L 13.042969 19.925781 L 13.039062 19.933594 Z M 21.769531 11.449219 L 22.160156 11.84375 L 22.164062 11.84375 Z M 21.695312 1.792969 C 19.085938 -0.511719 15.285156 -0.0390625 12.921875 2.449219 L 13.707031 3.246094 C 15.722656 1.117188 18.875 0.792969 20.984375 2.65625 Z M 12.917969 2.453125 L 12.101562 3.34375 L 12.898438 4.125 L 13.714844 3.238281 Z M 12.886719 3.332031 L 12.03125 2.445312 L 11.253906 3.25 L 12.113281 4.132812 Z M 12.039062 2.453125 C 9.714844 -0.0429688 5.871094 -0.507812 3.261719 1.792969 L 3.972656 2.65625 C 6.085938 0.792969 9.277344 1.121094 11.246094 3.238281 Z M 3.261719 1.792969 C 0.3125 4.40625 0.175781 9.039062 2.792969 11.84375 L 3.582031 11.054688 C 1.394531 8.714844 1.515625 4.835938 3.972656 2.65625 Z M 2.792969 11.84375 L 11.121094 20.710938 L 11.90625 19.921875 L 3.582031 11.054688 Z M 11.109375 20.703125 C 11.84375 21.523438 13.113281 21.523438 13.847656 20.703125 L 13.039062 19.933594 C 12.746094 20.265625 12.214844 20.265625 11.917969 19.933594 Z M 13.839844 20.710938 L 22.160156 11.84375 L 21.375 11.054688 L 13.050781 19.921875 Z M 22.164062 11.84375 C 24.78125 9.039062 24.644531 4.40625 21.695312 1.792969 L 20.984375 2.65625 C 23.441406 4.835938 23.5625 8.714844 21.375 11.054688 Z M 22.164062 11.84375 "/>
</g>
</svg>
