<?xml version="1.0" encoding="UTF-8"?>
<svg xmlns="http://www.w3.org/2000/svg" xmlns:xlink="http://www.w3.org/1999/xlink" width="25px" height="21px" viewBox="0 0 24 21" version="1.1">
<g id="surface1">
<path style=" stroke:none;fill-rule:nonzero;fill:rgb(100%,57.647059%,57.647059%);fill-opacity:1;" d="M 20.777344 2.226562 C 18.433594 0.140625 14.984375 0.539062 12.808594 2.847656 L 12 3.734375 L 11.148438 2.847656 C 9.015625 0.539062 5.523438 0.140625 3.179688 2.226562 C 0.496094 4.621094 0.367188 8.878906 2.753906 11.449219 L 11.019531 20.316406 C 11.53125 20.894531 12.425781 20.894531 12.9375 20.316406 L 21.203125 11.449219 C 23.589844 8.878906 23.464844 4.621094 20.777344 2.226562 Z M 20.777344 2.226562 "/>
</g>
</svg>
