<svg width="164" height="112" viewBox="0 0 164 112" fill="none" xmlns="http://www.w3.org/2000/svg">
<rect x="26.5" y="2.5" width="15" height="20" rx="2.5" stroke="white" stroke-width="5"/>
<rect x="50.5" y="2.5" width="15" height="20" rx="2.5" stroke="white" stroke-width="5"/>
<rect x="74.5" y="2.5" width="15" height="20" rx="2.5" stroke="white" stroke-width="5"/>
<rect x="98.5" y="2.5" width="15" height="20" rx="2.5" stroke="white" stroke-width="5"/>
<rect x="122.5" y="2.5" width="15" height="20" rx="2.5" stroke="white" stroke-width="5"/>
<rect x="146.5" y="2.5" width="15" height="20" rx="2.5" stroke="white" stroke-width="5"/>
<rect x="2.5" y="31.5" width="15" height="20" rx="2.5" stroke="white" stroke-width="5"/>
<rect x="26.5" y="31.5" width="15" height="20" rx="2.5" stroke="white" stroke-width="5"/>
<rect x="50.5" y="31.5" width="15" height="20" rx="2.5" stroke="white" stroke-width="5"/>
<rect x="74.5" y="31.5" width="15" height="20" rx="2.5" stroke="white" stroke-width="5"/>
<rect x="98.5" y="31.5" width="15" height="20" rx="2.5" stroke="white" stroke-width="5"/>
<rect x="122.5" y="31.5" width="15" height="20" rx="2.5" stroke="white" stroke-width="5"/>
<rect x="146.5" y="31.5" width="15" height="20" rx="2.5" stroke="white" stroke-width="5"/>
<rect x="2.5" y="60.5" width="15" height="20" rx="2.5" stroke="white" stroke-width="5"/>
<rect x="26.5" y="60.5" width="15" height="20" rx="2.5" stroke="white" stroke-width="5"/>
<rect x="50.5" y="60.5" width="15" height="20" rx="2.5" stroke="white" stroke-width="5"/>
<rect x="74.5" y="60.5" width="15" height="20" rx="2.5" stroke="white" stroke-width="5"/>
<rect x="98.5" y="60.5" width="15" height="20" rx="2.5" stroke="white" stroke-width="5"/>
<rect x="122.5" y="60.5" width="15" height="20" rx="2.5" stroke="white" stroke-width="5"/>
<rect x="146.5" y="60.5" width="15" height="20" rx="2.5" stroke="white" stroke-width="5"/>
<rect x="2.5" y="89.5" width="15" height="20" rx="2.5" stroke="white" stroke-width="5"/>
<rect x="26.5" y="89.5" width="15" height="20" rx="2.5" stroke="white" stroke-width="5"/>
<rect x="50.5" y="89.5" width="15" height="20" rx="2.5" stroke="white" stroke-width="5"/>
<rect x="74.5" y="89.5" width="15" height="20" rx="2.5" stroke="white" stroke-width="5"/>
<rect x="98.5" y="89.5" width="15" height="20" rx="2.5" stroke="white" stroke-width="5"/>
</svg>
