EESchema Schematic File Version 4
EELAYER 30 0
EELAYER END
$Descr A4 11693 8268
encoding utf-8
Sheet 4 4
Title ""
Date ""
Rev ""
Comp ""
Comment1 ""
Comment2 ""
Comment3 ""
Comment4 ""
$EndDescr
$Comp
L Connector:Conn_Coaxial J?
U 1 1 5F780F25
P 4350 4100
F 0 "J?" H 4450 4075 50  0000 L CNN
F 1 "BNC" H 4450 3984 50  0000 L CNN
F 2 "Connector_Coaxial:BNC_Amphenol_B6252HB-NPP3G-50_Horizontal" H 4350 4100 50  0001 C CNN
F 3 " ~" H 4350 4100 50  0001 C CNN
	1    4350 4100
	-1   0    0    -1  
$EndComp
$Comp
L power:GNDPWR #PWR?
U 1 1 5F780F2B
P 4350 4600
F 0 "#PWR?" H 4350 4400 50  0001 C CNN
F 1 "GNDPWR" H 4354 4446 50  0001 C CNN
F 2 "" H 4350 4550 50  0001 C CNN
F 3 "" H 4350 4550 50  0001 C CNN
	1    4350 4600
	-1   0    0    -1  
$EndComp
Wire Wire Line
	4350 4600 4350 4300
$Comp
L power:+12V #PWR?
U 1 1 5F780F32
P 7550 3200
F 0 "#PWR?" H 7550 3050 50  0001 C CNN
F 1 "+12V" H 7565 3373 50  0000 C CNN
F 2 "" H 7550 3200 50  0001 C CNN
F 3 "" H 7550 3200 50  0001 C CNN
	1    7550 3200
	1    0    0    -1  
$EndComp
$Comp
L power:GNDPWR #PWR?
U 1 1 5F780F38
P 5200 3600
F 0 "#PWR?" H 5200 3400 50  0001 C CNN
F 1 "GNDPWR" H 5204 3446 50  0000 C CNN
F 2 "" H 5200 3550 50  0001 C CNN
F 3 "" H 5200 3550 50  0001 C CNN
	1    5200 3600
	1    0    0    -1  
$EndComp
$Comp
L power:GNDPWR #PWR?
U 1 1 5F780F3E
P 7650 4350
F 0 "#PWR?" H 7650 4150 50  0001 C CNN
F 1 "GNDPWR" H 7654 4196 50  0000 C CNN
F 2 "" H 7650 4300 50  0001 C CNN
F 3 "" H 7650 4300 50  0001 C CNN
	1    7650 4350
	1    0    0    -1  
$EndComp
$Comp
L Connector:Conn_Coaxial J?
U 1 1 5F780F44
P 4350 3650
F 0 "J?" H 4278 3888 50  0000 C CNN
F 1 "SMA" H 4278 3797 50  0000 C CNN
F 2 "SMA_EDGE:SMA_Samtec_SMA-J-P-X-ST-EM1_EdgeMount" H 4350 3650 50  0001 C CNN
F 3 " ~" H 4350 3650 50  0001 C CNN
	1    4350 3650
	-1   0    0    -1  
$EndComp
Wire Wire Line
	4550 3650 4550 3850
Connection ~ 4550 3850
Wire Wire Line
	4550 3850 4550 4100
Wire Wire Line
	4550 3850 4800 3850
$Comp
L Connector:TestPoint TP?
U 1 1 5F780F4E
P 4800 3850
F 0 "TP?" H 4858 3968 50  0000 L CNN
F 1 " " H 4858 3877 50  0000 L CNN
F 2 "TestPoint:TestPoint_THTPad_1.0x1.0mm_Drill0.5mm" H 5000 3850 50  0001 C CNN
F 3 "~" H 5000 3850 50  0001 C CNN
	1    4800 3850
	1    0    0    -1  
$EndComp
Wire Wire Line
	7500 4100 7650 4100
Wire Wire Line
	7650 4100 7650 4350
Wire Wire Line
	7550 3200 7550 3250
Wire Wire Line
	7550 3250 7500 3250
Wire Wire Line
	8150 3800 7500 3800
Wire Wire Line
	5250 3300 5200 3300
Wire Wire Line
	5200 3550 5250 3550
Wire Wire Line
	5250 3850 5200 3850
Connection ~ 4800 3850
Wire Wire Line
	5200 3850 5200 4100
Wire Wire Line
	5200 4100 5250 4100
Connection ~ 5200 3850
$Comp
L SDR_SSB-rescue:uSDX_LPF_BAND_MODULE-uSDX~LPF~BAND~Module U?
U 1 1 5F780F60
P 6400 3700
F 0 "U?" H 6375 4375 50  0000 C CNN
F 1 "uSDX_LPF_BAND_MODULE" H 6375 4284 50  0000 C CNN
F 2 "uSDX_LPF_BAND_MODULE:uSDX_LPF_Band_Module" H 6400 3900 50  0001 C CNN
F 3 "" H 6400 3900 50  0001 C CNN
	1    6400 3700
	1    0    0    -1  
$EndComp
$Comp
L power:GNDPWR #PWR?
U 1 1 5F780F66
P 4350 3850
F 0 "#PWR?" H 4350 3650 50  0001 C CNN
F 1 "GNDPWR" H 4354 3696 50  0001 C CNN
F 2 "" H 4350 3800 50  0001 C CNN
F 3 "" H 4350 3800 50  0001 C CNN
	1    4350 3850
	-1   0    0    -1  
$EndComp
Connection ~ 5200 3550
Wire Wire Line
	5200 3550 5200 3600
Wire Wire Line
	5200 3300 5200 3550
Wire Wire Line
	5200 3850 4800 3850
Text GLabel 7600 3700 2    50   Input ~ 0
FILTER_RX
Text GLabel 7500 3550 2    50   Input ~ 0
FILTER_TX
$EndSCHEMATC
