G04 #@! TF.GenerationSoftware,KiCad,Pcbnew,(5.1.5)-3*
G04 #@! TF.CreationDate,2020-07-31T12:21:34-04:00*
G04 #@! TF.ProjectId,face_plate_01,66616365-5f70-46c6-9174-655f30312e6b,rev?*
G04 #@! TF.SameCoordinates,Original*
G04 #@! TF.FileFunction,Copper,L2,Bot*
G04 #@! TF.FilePolarity,Positive*
%FSLAX46Y46*%
G04 Gerber Fmt 4.6, Leading zero omitted, Abs format (unit mm)*
G04 Created by KiCad (PCBNEW (5.1.5)-3) date 2020-07-31 12:21:34*
%MOMM*%
%LPD*%
G04 APERTURE LIST*
%ADD10C,4.000000*%
%ADD11C,0.254000*%
G04 APERTURE END LIST*
D10*
X186690000Y193040000D03*
X96520000Y193040000D03*
X186690000Y283210000D03*
X96520000Y283337000D03*
D11*
G36*
X189815001Y189915000D02*
G01*
X150105000Y189915000D01*
X150105000Y191192501D01*
X185022106Y191192501D01*
X185238228Y190825742D01*
X185698105Y190585062D01*
X186196098Y190438725D01*
X186713071Y190392352D01*
X187229159Y190447727D01*
X187724526Y190602721D01*
X188141772Y190825742D01*
X188357894Y191192501D01*
X186690000Y192860395D01*
X185022106Y191192501D01*
X150105000Y191192501D01*
X150105000Y193016929D01*
X184042352Y193016929D01*
X184097727Y192500841D01*
X184252721Y192005474D01*
X184475742Y191588228D01*
X184842501Y191372106D01*
X186510395Y193040000D01*
X186869605Y193040000D01*
X188537499Y191372106D01*
X188904258Y191588228D01*
X189144938Y192048105D01*
X189291275Y192546098D01*
X189337648Y193063071D01*
X189282273Y193579159D01*
X189127279Y194074526D01*
X188904258Y194491772D01*
X188537499Y194707894D01*
X186869605Y193040000D01*
X186510395Y193040000D01*
X184842501Y194707894D01*
X184475742Y194491772D01*
X184235062Y194031895D01*
X184088725Y193533902D01*
X184042352Y193016929D01*
X150105000Y193016929D01*
X150105000Y194887499D01*
X185022106Y194887499D01*
X186690000Y193219605D01*
X188357894Y194887499D01*
X188141772Y195254258D01*
X187681895Y195494938D01*
X187183902Y195641275D01*
X186666929Y195687648D01*
X186150841Y195632273D01*
X185655474Y195477279D01*
X185238228Y195254258D01*
X185022106Y194887499D01*
X150105000Y194887499D01*
X150105000Y204216152D01*
X150108313Y204249582D01*
X150105000Y204283430D01*
X150105000Y204283647D01*
X150101609Y204318079D01*
X150095169Y204383872D01*
X150095109Y204384070D01*
X150095088Y204384283D01*
X150075149Y204450013D01*
X150056078Y204513019D01*
X150055982Y204513200D01*
X150055919Y204513406D01*
X150023495Y204574068D01*
X149992544Y204632058D01*
X149992413Y204632217D01*
X149992312Y204632407D01*
X149948494Y204685798D01*
X149907006Y204736414D01*
X149906849Y204736543D01*
X149906711Y204736711D01*
X149853356Y204780499D01*
X149802754Y204822079D01*
X149802573Y204822176D01*
X149802407Y204822312D01*
X149741860Y204854675D01*
X149683792Y204885758D01*
X149683595Y204885818D01*
X149683406Y204885919D01*
X149618093Y204905731D01*
X149554693Y204925006D01*
X149554486Y204925027D01*
X149554283Y204925088D01*
X149486707Y204931744D01*
X149454063Y204934979D01*
X149453859Y204934979D01*
X149420000Y204938314D01*
X149386557Y204935020D01*
X100134309Y204964979D01*
X100100915Y204968313D01*
X100067019Y204965020D01*
X100066770Y204965020D01*
X100033190Y204961733D01*
X99966615Y204955265D01*
X99966378Y204955193D01*
X99966128Y204955169D01*
X99901179Y204935510D01*
X99837440Y204916268D01*
X99837222Y204916152D01*
X99836981Y204916079D01*
X99777135Y204884137D01*
X99718355Y204852819D01*
X99718163Y204852662D01*
X99717942Y204852544D01*
X99666051Y204810010D01*
X99613937Y204767357D01*
X99613777Y204767163D01*
X99613586Y204767006D01*
X99570712Y204714830D01*
X99528198Y204663167D01*
X99528082Y204662951D01*
X99527921Y204662755D01*
X99496097Y204603302D01*
X99464432Y204544251D01*
X99464358Y204544009D01*
X99464242Y204543792D01*
X99444683Y204479457D01*
X99425092Y204415180D01*
X99425068Y204414935D01*
X99424994Y204414693D01*
X99418340Y204347549D01*
X99415046Y204314557D01*
X99415046Y204314309D01*
X99411687Y204280418D01*
X99414956Y204247017D01*
X99395909Y189924072D01*
X93395000Y189915929D01*
X93395000Y191192501D01*
X94852106Y191192501D01*
X95068228Y190825742D01*
X95528105Y190585062D01*
X96026098Y190438725D01*
X96543071Y190392352D01*
X97059159Y190447727D01*
X97554526Y190602721D01*
X97971772Y190825742D01*
X98187894Y191192501D01*
X96520000Y192860395D01*
X94852106Y191192501D01*
X93395000Y191192501D01*
X93395000Y193016929D01*
X93872352Y193016929D01*
X93927727Y192500841D01*
X94082721Y192005474D01*
X94305742Y191588228D01*
X94672501Y191372106D01*
X96340395Y193040000D01*
X96699605Y193040000D01*
X98367499Y191372106D01*
X98734258Y191588228D01*
X98974938Y192048105D01*
X99121275Y192546098D01*
X99167648Y193063071D01*
X99112273Y193579159D01*
X98957279Y194074526D01*
X98734258Y194491772D01*
X98367499Y194707894D01*
X96699605Y193040000D01*
X96340395Y193040000D01*
X94672501Y194707894D01*
X94305742Y194491772D01*
X94065062Y194031895D01*
X93918725Y193533902D01*
X93872352Y193016929D01*
X93395000Y193016929D01*
X93395000Y194887499D01*
X94852106Y194887499D01*
X96520000Y193219605D01*
X98187894Y194887499D01*
X97971772Y195254258D01*
X97511895Y195494938D01*
X97013902Y195641275D01*
X96496929Y195687648D01*
X95980841Y195632273D01*
X95485474Y195477279D01*
X95068228Y195254258D01*
X94852106Y194887499D01*
X93395000Y194887499D01*
X93395000Y240836926D01*
X119444540Y240836926D01*
X119444540Y240103074D01*
X119587707Y239383323D01*
X119868540Y238705333D01*
X120276246Y238095158D01*
X120795158Y237576246D01*
X121405333Y237168540D01*
X122083323Y236887707D01*
X122803074Y236744540D01*
X123536926Y236744540D01*
X124256677Y236887707D01*
X124934667Y237168540D01*
X125544842Y237576246D01*
X126063754Y238095158D01*
X126471460Y238705333D01*
X126752293Y239383323D01*
X126895460Y240103074D01*
X126895460Y240450000D01*
X135195911Y240450000D01*
X135284846Y239461850D01*
X135548793Y238505460D01*
X135979268Y237611570D01*
X136562435Y236808909D01*
X137279552Y236123275D01*
X138107569Y235576706D01*
X139019872Y235186769D01*
X139987141Y234965996D01*
X140978286Y234921483D01*
X141961451Y235054662D01*
X142905036Y235361251D01*
X143778713Y235831397D01*
X144554402Y236449989D01*
X145207172Y237197144D01*
X145716042Y238048849D01*
X146064656Y238977728D01*
X146241810Y239953928D01*
X146241810Y240648258D01*
X156244075Y240648258D01*
X156244075Y239951742D01*
X156379958Y239268609D01*
X156646504Y238625111D01*
X157033468Y238045979D01*
X157525979Y237553468D01*
X158105111Y237166504D01*
X158748609Y236899958D01*
X159431742Y236764075D01*
X160128258Y236764075D01*
X160811391Y236899958D01*
X161454889Y237166504D01*
X162034021Y237553468D01*
X162526532Y238045979D01*
X162913496Y238625111D01*
X163180042Y239268609D01*
X163315925Y239951742D01*
X163315925Y240648258D01*
X163180042Y241331391D01*
X162913496Y241974889D01*
X162526532Y242554021D01*
X162034021Y243046532D01*
X161454889Y243433496D01*
X160811391Y243700042D01*
X160128258Y243835925D01*
X159431742Y243835925D01*
X158748609Y243700042D01*
X158105111Y243433496D01*
X157525979Y243046532D01*
X157033468Y242554021D01*
X156646504Y241974889D01*
X156379958Y241331391D01*
X156244075Y240648258D01*
X146241810Y240648258D01*
X146241810Y240946072D01*
X146064656Y241922272D01*
X145716042Y242851151D01*
X145207172Y243702856D01*
X144554402Y244450011D01*
X143778713Y245068603D01*
X142905036Y245538749D01*
X141961451Y245845338D01*
X140978286Y245978517D01*
X139987141Y245934004D01*
X139019872Y245713231D01*
X138107569Y245323294D01*
X137279552Y244776725D01*
X136562435Y244091091D01*
X135979268Y243288430D01*
X135548793Y242394540D01*
X135284846Y241438150D01*
X135195911Y240450000D01*
X126895460Y240450000D01*
X126895460Y240836926D01*
X126752293Y241556677D01*
X126471460Y242234667D01*
X126063754Y242844842D01*
X125544842Y243363754D01*
X124934667Y243771460D01*
X124256677Y244052293D01*
X123536926Y244195460D01*
X122803074Y244195460D01*
X122083323Y244052293D01*
X121405333Y243771460D01*
X120795158Y243363754D01*
X120276246Y242844842D01*
X119868540Y242234667D01*
X119587707Y241556677D01*
X119444540Y240836926D01*
X93395000Y240836926D01*
X93395000Y276860000D01*
X107261686Y276860000D01*
X107265001Y276826343D01*
X107265000Y260383647D01*
X107261686Y260350000D01*
X107274912Y260215717D01*
X107314081Y260086594D01*
X107377688Y259967593D01*
X107463289Y259863289D01*
X107567593Y259777688D01*
X107686594Y259714081D01*
X107815717Y259674912D01*
X107950000Y259661686D01*
X107983647Y259665000D01*
X173956353Y259665000D01*
X173990000Y259661686D01*
X174124283Y259674912D01*
X174253406Y259714081D01*
X174372407Y259777688D01*
X174476711Y259863289D01*
X174562312Y259967593D01*
X174625919Y260086594D01*
X174665088Y260215717D01*
X174675000Y260316353D01*
X174675000Y260316354D01*
X174678314Y260350000D01*
X174675000Y260383647D01*
X174675000Y276826353D01*
X174678314Y276860000D01*
X174665088Y276994283D01*
X174625919Y277123406D01*
X174562312Y277242407D01*
X174476711Y277346711D01*
X174372407Y277432312D01*
X174253406Y277495919D01*
X174124283Y277535088D01*
X174023647Y277545000D01*
X173990000Y277548314D01*
X173956353Y277545000D01*
X107983647Y277545000D01*
X107950000Y277548314D01*
X107916353Y277545000D01*
X107815717Y277535088D01*
X107686594Y277495919D01*
X107567593Y277432312D01*
X107463289Y277346711D01*
X107377688Y277242407D01*
X107314081Y277123406D01*
X107274912Y276994283D01*
X107261686Y276860000D01*
X93395000Y276860000D01*
X93395000Y281489501D01*
X94852106Y281489501D01*
X95068228Y281122742D01*
X95528105Y280882062D01*
X96026098Y280735725D01*
X96543071Y280689352D01*
X97059159Y280744727D01*
X97554526Y280899721D01*
X97971772Y281122742D01*
X98113056Y281362501D01*
X185022106Y281362501D01*
X185238228Y280995742D01*
X185698105Y280755062D01*
X186196098Y280608725D01*
X186713071Y280562352D01*
X187229159Y280617727D01*
X187724526Y280772721D01*
X188141772Y280995742D01*
X188357894Y281362501D01*
X186690000Y283030395D01*
X185022106Y281362501D01*
X98113056Y281362501D01*
X98187894Y281489501D01*
X96520000Y283157395D01*
X94852106Y281489501D01*
X93395000Y281489501D01*
X93395000Y283313929D01*
X93872352Y283313929D01*
X93927727Y282797841D01*
X94082721Y282302474D01*
X94305742Y281885228D01*
X94672501Y281669106D01*
X96340395Y283337000D01*
X96699605Y283337000D01*
X98367499Y281669106D01*
X98734258Y281885228D01*
X98974938Y282345105D01*
X99121275Y282843098D01*
X99152116Y283186929D01*
X184042352Y283186929D01*
X184097727Y282670841D01*
X184252721Y282175474D01*
X184475742Y281758228D01*
X184842501Y281542106D01*
X186510395Y283210000D01*
X186869605Y283210000D01*
X188537499Y281542106D01*
X188904258Y281758228D01*
X189144938Y282218105D01*
X189291275Y282716098D01*
X189337648Y283233071D01*
X189282273Y283749159D01*
X189127279Y284244526D01*
X188904258Y284661772D01*
X188537499Y284877894D01*
X186869605Y283210000D01*
X186510395Y283210000D01*
X184842501Y284877894D01*
X184475742Y284661772D01*
X184235062Y284201895D01*
X184088725Y283703902D01*
X184042352Y283186929D01*
X99152116Y283186929D01*
X99167648Y283360071D01*
X99112273Y283876159D01*
X98957279Y284371526D01*
X98734258Y284788772D01*
X98367499Y285004894D01*
X96699605Y283337000D01*
X96340395Y283337000D01*
X94672501Y285004894D01*
X94305742Y284788772D01*
X94065062Y284328895D01*
X93918725Y283830902D01*
X93872352Y283313929D01*
X93395000Y283313929D01*
X93395000Y285184499D01*
X94852106Y285184499D01*
X96520000Y283516605D01*
X98060894Y285057499D01*
X185022106Y285057499D01*
X186690000Y283389605D01*
X188357894Y285057499D01*
X188141772Y285424258D01*
X187681895Y285664938D01*
X187183902Y285811275D01*
X186666929Y285857648D01*
X186150841Y285802273D01*
X185655474Y285647279D01*
X185238228Y285424258D01*
X185022106Y285057499D01*
X98060894Y285057499D01*
X98187894Y285184499D01*
X97971772Y285551258D01*
X97511895Y285791938D01*
X97013902Y285938275D01*
X96496929Y285984648D01*
X95980841Y285929273D01*
X95485474Y285774279D01*
X95068228Y285551258D01*
X94852106Y285184499D01*
X93395000Y285184499D01*
X93395000Y286335000D01*
X189815000Y286335000D01*
X189815001Y189915000D01*
G37*
X189815001Y189915000D02*
X150105000Y189915000D01*
X150105000Y191192501D01*
X185022106Y191192501D01*
X185238228Y190825742D01*
X185698105Y190585062D01*
X186196098Y190438725D01*
X186713071Y190392352D01*
X187229159Y190447727D01*
X187724526Y190602721D01*
X188141772Y190825742D01*
X188357894Y191192501D01*
X186690000Y192860395D01*
X185022106Y191192501D01*
X150105000Y191192501D01*
X150105000Y193016929D01*
X184042352Y193016929D01*
X184097727Y192500841D01*
X184252721Y192005474D01*
X184475742Y191588228D01*
X184842501Y191372106D01*
X186510395Y193040000D01*
X186869605Y193040000D01*
X188537499Y191372106D01*
X188904258Y191588228D01*
X189144938Y192048105D01*
X189291275Y192546098D01*
X189337648Y193063071D01*
X189282273Y193579159D01*
X189127279Y194074526D01*
X188904258Y194491772D01*
X188537499Y194707894D01*
X186869605Y193040000D01*
X186510395Y193040000D01*
X184842501Y194707894D01*
X184475742Y194491772D01*
X184235062Y194031895D01*
X184088725Y193533902D01*
X184042352Y193016929D01*
X150105000Y193016929D01*
X150105000Y194887499D01*
X185022106Y194887499D01*
X186690000Y193219605D01*
X188357894Y194887499D01*
X188141772Y195254258D01*
X187681895Y195494938D01*
X187183902Y195641275D01*
X186666929Y195687648D01*
X186150841Y195632273D01*
X185655474Y195477279D01*
X185238228Y195254258D01*
X185022106Y194887499D01*
X150105000Y194887499D01*
X150105000Y204216152D01*
X150108313Y204249582D01*
X150105000Y204283430D01*
X150105000Y204283647D01*
X150101609Y204318079D01*
X150095169Y204383872D01*
X150095109Y204384070D01*
X150095088Y204384283D01*
X150075149Y204450013D01*
X150056078Y204513019D01*
X150055982Y204513200D01*
X150055919Y204513406D01*
X150023495Y204574068D01*
X149992544Y204632058D01*
X149992413Y204632217D01*
X149992312Y204632407D01*
X149948494Y204685798D01*
X149907006Y204736414D01*
X149906849Y204736543D01*
X149906711Y204736711D01*
X149853356Y204780499D01*
X149802754Y204822079D01*
X149802573Y204822176D01*
X149802407Y204822312D01*
X149741860Y204854675D01*
X149683792Y204885758D01*
X149683595Y204885818D01*
X149683406Y204885919D01*
X149618093Y204905731D01*
X149554693Y204925006D01*
X149554486Y204925027D01*
X149554283Y204925088D01*
X149486707Y204931744D01*
X149454063Y204934979D01*
X149453859Y204934979D01*
X149420000Y204938314D01*
X149386557Y204935020D01*
X100134309Y204964979D01*
X100100915Y204968313D01*
X100067019Y204965020D01*
X100066770Y204965020D01*
X100033190Y204961733D01*
X99966615Y204955265D01*
X99966378Y204955193D01*
X99966128Y204955169D01*
X99901179Y204935510D01*
X99837440Y204916268D01*
X99837222Y204916152D01*
X99836981Y204916079D01*
X99777135Y204884137D01*
X99718355Y204852819D01*
X99718163Y204852662D01*
X99717942Y204852544D01*
X99666051Y204810010D01*
X99613937Y204767357D01*
X99613777Y204767163D01*
X99613586Y204767006D01*
X99570712Y204714830D01*
X99528198Y204663167D01*
X99528082Y204662951D01*
X99527921Y204662755D01*
X99496097Y204603302D01*
X99464432Y204544251D01*
X99464358Y204544009D01*
X99464242Y204543792D01*
X99444683Y204479457D01*
X99425092Y204415180D01*
X99425068Y204414935D01*
X99424994Y204414693D01*
X99418340Y204347549D01*
X99415046Y204314557D01*
X99415046Y204314309D01*
X99411687Y204280418D01*
X99414956Y204247017D01*
X99395909Y189924072D01*
X93395000Y189915929D01*
X93395000Y191192501D01*
X94852106Y191192501D01*
X95068228Y190825742D01*
X95528105Y190585062D01*
X96026098Y190438725D01*
X96543071Y190392352D01*
X97059159Y190447727D01*
X97554526Y190602721D01*
X97971772Y190825742D01*
X98187894Y191192501D01*
X96520000Y192860395D01*
X94852106Y191192501D01*
X93395000Y191192501D01*
X93395000Y193016929D01*
X93872352Y193016929D01*
X93927727Y192500841D01*
X94082721Y192005474D01*
X94305742Y191588228D01*
X94672501Y191372106D01*
X96340395Y193040000D01*
X96699605Y193040000D01*
X98367499Y191372106D01*
X98734258Y191588228D01*
X98974938Y192048105D01*
X99121275Y192546098D01*
X99167648Y193063071D01*
X99112273Y193579159D01*
X98957279Y194074526D01*
X98734258Y194491772D01*
X98367499Y194707894D01*
X96699605Y193040000D01*
X96340395Y193040000D01*
X94672501Y194707894D01*
X94305742Y194491772D01*
X94065062Y194031895D01*
X93918725Y193533902D01*
X93872352Y193016929D01*
X93395000Y193016929D01*
X93395000Y194887499D01*
X94852106Y194887499D01*
X96520000Y193219605D01*
X98187894Y194887499D01*
X97971772Y195254258D01*
X97511895Y195494938D01*
X97013902Y195641275D01*
X96496929Y195687648D01*
X95980841Y195632273D01*
X95485474Y195477279D01*
X95068228Y195254258D01*
X94852106Y194887499D01*
X93395000Y194887499D01*
X93395000Y240836926D01*
X119444540Y240836926D01*
X119444540Y240103074D01*
X119587707Y239383323D01*
X119868540Y238705333D01*
X120276246Y238095158D01*
X120795158Y237576246D01*
X121405333Y237168540D01*
X122083323Y236887707D01*
X122803074Y236744540D01*
X123536926Y236744540D01*
X124256677Y236887707D01*
X124934667Y237168540D01*
X125544842Y237576246D01*
X126063754Y238095158D01*
X126471460Y238705333D01*
X126752293Y239383323D01*
X126895460Y240103074D01*
X126895460Y240450000D01*
X135195911Y240450000D01*
X135284846Y239461850D01*
X135548793Y238505460D01*
X135979268Y237611570D01*
X136562435Y236808909D01*
X137279552Y236123275D01*
X138107569Y235576706D01*
X139019872Y235186769D01*
X139987141Y234965996D01*
X140978286Y234921483D01*
X141961451Y235054662D01*
X142905036Y235361251D01*
X143778713Y235831397D01*
X144554402Y236449989D01*
X145207172Y237197144D01*
X145716042Y238048849D01*
X146064656Y238977728D01*
X146241810Y239953928D01*
X146241810Y240648258D01*
X156244075Y240648258D01*
X156244075Y239951742D01*
X156379958Y239268609D01*
X156646504Y238625111D01*
X157033468Y238045979D01*
X157525979Y237553468D01*
X158105111Y237166504D01*
X158748609Y236899958D01*
X159431742Y236764075D01*
X160128258Y236764075D01*
X160811391Y236899958D01*
X161454889Y237166504D01*
X162034021Y237553468D01*
X162526532Y238045979D01*
X162913496Y238625111D01*
X163180042Y239268609D01*
X163315925Y239951742D01*
X163315925Y240648258D01*
X163180042Y241331391D01*
X162913496Y241974889D01*
X162526532Y242554021D01*
X162034021Y243046532D01*
X161454889Y243433496D01*
X160811391Y243700042D01*
X160128258Y243835925D01*
X159431742Y243835925D01*
X158748609Y243700042D01*
X158105111Y243433496D01*
X157525979Y243046532D01*
X157033468Y242554021D01*
X156646504Y241974889D01*
X156379958Y241331391D01*
X156244075Y240648258D01*
X146241810Y240648258D01*
X146241810Y240946072D01*
X146064656Y241922272D01*
X145716042Y242851151D01*
X145207172Y243702856D01*
X144554402Y244450011D01*
X143778713Y245068603D01*
X142905036Y245538749D01*
X141961451Y245845338D01*
X140978286Y245978517D01*
X139987141Y245934004D01*
X139019872Y245713231D01*
X138107569Y245323294D01*
X137279552Y244776725D01*
X136562435Y244091091D01*
X135979268Y243288430D01*
X135548793Y242394540D01*
X135284846Y241438150D01*
X135195911Y240450000D01*
X126895460Y240450000D01*
X126895460Y240836926D01*
X126752293Y241556677D01*
X126471460Y242234667D01*
X126063754Y242844842D01*
X125544842Y243363754D01*
X124934667Y243771460D01*
X124256677Y244052293D01*
X123536926Y244195460D01*
X122803074Y244195460D01*
X122083323Y244052293D01*
X121405333Y243771460D01*
X120795158Y243363754D01*
X120276246Y242844842D01*
X119868540Y242234667D01*
X119587707Y241556677D01*
X119444540Y240836926D01*
X93395000Y240836926D01*
X93395000Y276860000D01*
X107261686Y276860000D01*
X107265001Y276826343D01*
X107265000Y260383647D01*
X107261686Y260350000D01*
X107274912Y260215717D01*
X107314081Y260086594D01*
X107377688Y259967593D01*
X107463289Y259863289D01*
X107567593Y259777688D01*
X107686594Y259714081D01*
X107815717Y259674912D01*
X107950000Y259661686D01*
X107983647Y259665000D01*
X173956353Y259665000D01*
X173990000Y259661686D01*
X174124283Y259674912D01*
X174253406Y259714081D01*
X174372407Y259777688D01*
X174476711Y259863289D01*
X174562312Y259967593D01*
X174625919Y260086594D01*
X174665088Y260215717D01*
X174675000Y260316353D01*
X174675000Y260316354D01*
X174678314Y260350000D01*
X174675000Y260383647D01*
X174675000Y276826353D01*
X174678314Y276860000D01*
X174665088Y276994283D01*
X174625919Y277123406D01*
X174562312Y277242407D01*
X174476711Y277346711D01*
X174372407Y277432312D01*
X174253406Y277495919D01*
X174124283Y277535088D01*
X174023647Y277545000D01*
X173990000Y277548314D01*
X173956353Y277545000D01*
X107983647Y277545000D01*
X107950000Y277548314D01*
X107916353Y277545000D01*
X107815717Y277535088D01*
X107686594Y277495919D01*
X107567593Y277432312D01*
X107463289Y277346711D01*
X107377688Y277242407D01*
X107314081Y277123406D01*
X107274912Y276994283D01*
X107261686Y276860000D01*
X93395000Y276860000D01*
X93395000Y281489501D01*
X94852106Y281489501D01*
X95068228Y281122742D01*
X95528105Y280882062D01*
X96026098Y280735725D01*
X96543071Y280689352D01*
X97059159Y280744727D01*
X97554526Y280899721D01*
X97971772Y281122742D01*
X98113056Y281362501D01*
X185022106Y281362501D01*
X185238228Y280995742D01*
X185698105Y280755062D01*
X186196098Y280608725D01*
X186713071Y280562352D01*
X187229159Y280617727D01*
X187724526Y280772721D01*
X188141772Y280995742D01*
X188357894Y281362501D01*
X186690000Y283030395D01*
X185022106Y281362501D01*
X98113056Y281362501D01*
X98187894Y281489501D01*
X96520000Y283157395D01*
X94852106Y281489501D01*
X93395000Y281489501D01*
X93395000Y283313929D01*
X93872352Y283313929D01*
X93927727Y282797841D01*
X94082721Y282302474D01*
X94305742Y281885228D01*
X94672501Y281669106D01*
X96340395Y283337000D01*
X96699605Y283337000D01*
X98367499Y281669106D01*
X98734258Y281885228D01*
X98974938Y282345105D01*
X99121275Y282843098D01*
X99152116Y283186929D01*
X184042352Y283186929D01*
X184097727Y282670841D01*
X184252721Y282175474D01*
X184475742Y281758228D01*
X184842501Y281542106D01*
X186510395Y283210000D01*
X186869605Y283210000D01*
X188537499Y281542106D01*
X188904258Y281758228D01*
X189144938Y282218105D01*
X189291275Y282716098D01*
X189337648Y283233071D01*
X189282273Y283749159D01*
X189127279Y284244526D01*
X188904258Y284661772D01*
X188537499Y284877894D01*
X186869605Y283210000D01*
X186510395Y283210000D01*
X184842501Y284877894D01*
X184475742Y284661772D01*
X184235062Y284201895D01*
X184088725Y283703902D01*
X184042352Y283186929D01*
X99152116Y283186929D01*
X99167648Y283360071D01*
X99112273Y283876159D01*
X98957279Y284371526D01*
X98734258Y284788772D01*
X98367499Y285004894D01*
X96699605Y283337000D01*
X96340395Y283337000D01*
X94672501Y285004894D01*
X94305742Y284788772D01*
X94065062Y284328895D01*
X93918725Y283830902D01*
X93872352Y283313929D01*
X93395000Y283313929D01*
X93395000Y285184499D01*
X94852106Y285184499D01*
X96520000Y283516605D01*
X98060894Y285057499D01*
X185022106Y285057499D01*
X186690000Y283389605D01*
X188357894Y285057499D01*
X188141772Y285424258D01*
X187681895Y285664938D01*
X187183902Y285811275D01*
X186666929Y285857648D01*
X186150841Y285802273D01*
X185655474Y285647279D01*
X185238228Y285424258D01*
X185022106Y285057499D01*
X98060894Y285057499D01*
X98187894Y285184499D01*
X97971772Y285551258D01*
X97511895Y285791938D01*
X97013902Y285938275D01*
X96496929Y285984648D01*
X95980841Y285929273D01*
X95485474Y285774279D01*
X95068228Y285551258D01*
X94852106Y285184499D01*
X93395000Y285184499D01*
X93395000Y286335000D01*
X189815000Y286335000D01*
X189815001Y189915000D01*
M02*
