G04 #@! TF.GenerationSoftware,KiCad,Pcbnew,(5.1.5)-3*
G04 #@! TF.CreationDate,2020-07-10T20:33:57-04:00*
G04 #@! TF.ProjectId,Band_MODULE_V1_00,42616e64-5f4d-44f4-9455-4c455f56315f,rev?*
G04 #@! TF.SameCoordinates,Original*
G04 #@! TF.FileFunction,Copper,L2,Bot*
G04 #@! TF.FilePolarity,Positive*
%FSLAX46Y46*%
G04 Gerber Fmt 4.6, Leading zero omitted, Abs format (unit mm)*
G04 Created by KiCad (PCBNEW (5.1.5)-3) date 2020-07-10 20:33:57*
%MOMM*%
%LPD*%
G04 APERTURE LIST*
%ADD10C,2.020000*%
%ADD11C,2.000000*%
%ADD12C,1.600000*%
%ADD13C,0.800000*%
%ADD14C,0.500000*%
%ADD15C,0.254000*%
G04 APERTURE END LIST*
D10*
X156300000Y-78720000D03*
X156300000Y-76180000D03*
X156300000Y-73640000D03*
X156300000Y-71100000D03*
D11*
X146050000Y-74930000D03*
X151130000Y-74930000D03*
D12*
X147400000Y-82000000D03*
X149900000Y-82000000D03*
X153500000Y-82000000D03*
X156000000Y-82000000D03*
D11*
X142580000Y-75000000D03*
X137500000Y-75000000D03*
X133580000Y-75000000D03*
X128500000Y-75000000D03*
X124460000Y-75000000D03*
X119380000Y-75000000D03*
D10*
X114500000Y-71180000D03*
X114500000Y-73720000D03*
X114500000Y-76260000D03*
X114500000Y-78800000D03*
D12*
X143500000Y-82000000D03*
X141000000Y-82000000D03*
X137000000Y-82000000D03*
X134500000Y-82000000D03*
X128000000Y-82000000D03*
X130500000Y-82000000D03*
X123000000Y-82000000D03*
X120500000Y-82000000D03*
D13*
X119400000Y-71000000D03*
X119400000Y-78800000D03*
X124600000Y-78800000D03*
X124700000Y-71200000D03*
X128300000Y-78700000D03*
X128400000Y-71000000D03*
X131400000Y-71100000D03*
X140300000Y-71400000D03*
X135800000Y-71400000D03*
X145900000Y-71200000D03*
X148900000Y-76300000D03*
X125400000Y-82500000D03*
X153200000Y-72600000D03*
X137800000Y-78600000D03*
X144100000Y-77400000D03*
X148850000Y-71180000D03*
X131340000Y-75410000D03*
X132390000Y-79910000D03*
D14*
X114500000Y-76260000D02*
X114500000Y-78800000D01*
X120500000Y-82000000D02*
X115900000Y-82000000D01*
X114500000Y-80600000D02*
X114500000Y-78800000D01*
X115900000Y-82000000D02*
X114500000Y-80600000D01*
X117965787Y-75000000D02*
X116665787Y-76300000D01*
X119380000Y-75000000D02*
X117965787Y-75000000D01*
X116625787Y-76260000D02*
X114500000Y-76260000D01*
X116665787Y-76300000D02*
X116625787Y-76260000D01*
X124460000Y-75000000D02*
X128500000Y-75000000D01*
X128500000Y-75000000D02*
X130500000Y-77000000D01*
X130500000Y-77000000D02*
X130500000Y-82000000D01*
X133580000Y-75000000D02*
X133580000Y-79080000D01*
X134500000Y-80000000D02*
X134500000Y-82000000D01*
X133580000Y-79080000D02*
X134500000Y-80000000D01*
X133580000Y-75000000D02*
X137500000Y-75000000D01*
X141500000Y-75000000D02*
X142580000Y-75000000D01*
X141000000Y-75500000D02*
X141500000Y-75000000D01*
X141000000Y-78000000D02*
X141000000Y-75500000D01*
X155640000Y-76180000D02*
X156300000Y-76180000D01*
X141000000Y-79700000D02*
X146300000Y-79700000D01*
X141000000Y-79700000D02*
X141000000Y-78000000D01*
X141000000Y-82000000D02*
X141000000Y-79700000D01*
X147400000Y-80800000D02*
X147400000Y-82000000D01*
X146300000Y-79700000D02*
X147400000Y-80800000D01*
X147400000Y-80868630D02*
X148868630Y-79400000D01*
X147400000Y-82000000D02*
X147400000Y-80868630D01*
X148868630Y-79400000D02*
X152800000Y-79400000D01*
X152800000Y-79400000D02*
X154700000Y-77500000D01*
X154700000Y-77500000D02*
X154700000Y-76200000D01*
X154720000Y-76180000D02*
X156300000Y-76180000D01*
X154700000Y-76200000D02*
X154720000Y-76180000D01*
X146050000Y-78050000D02*
X152350000Y-78050000D01*
X146050000Y-74930000D02*
X146050000Y-78050000D01*
X152350000Y-78050000D02*
X153600000Y-76800000D01*
X153600000Y-76800000D02*
X153600000Y-74500000D01*
X154460000Y-73640000D02*
X156300000Y-73640000D01*
X153600000Y-74500000D02*
X154460000Y-73640000D01*
X149900000Y-82000000D02*
X153500000Y-82000000D01*
X151130000Y-72070000D02*
X151130000Y-74930000D01*
X156300000Y-71100000D02*
X152100000Y-71100000D01*
X152100000Y-71100000D02*
X151130000Y-72070000D01*
D15*
G36*
X154912914Y-70215000D02*
G01*
X152143465Y-70215000D01*
X152099999Y-70210719D01*
X152056533Y-70215000D01*
X152056523Y-70215000D01*
X151926510Y-70227805D01*
X151759687Y-70278411D01*
X151605941Y-70360589D01*
X151605939Y-70360590D01*
X151605940Y-70360590D01*
X151504953Y-70443468D01*
X151504951Y-70443470D01*
X151471183Y-70471183D01*
X151443470Y-70504951D01*
X150534956Y-71413466D01*
X150501183Y-71441183D01*
X150390589Y-71575942D01*
X150308411Y-71729688D01*
X150300840Y-71754647D01*
X150263057Y-71879199D01*
X150257805Y-71896511D01*
X150245000Y-72026524D01*
X150245000Y-72026531D01*
X150240719Y-72070000D01*
X150245000Y-72113469D01*
X150245001Y-73554940D01*
X150087748Y-73660013D01*
X149860013Y-73887748D01*
X149681082Y-74155537D01*
X149557832Y-74453088D01*
X149495000Y-74768967D01*
X149495000Y-75091033D01*
X149557832Y-75406912D01*
X149681082Y-75704463D01*
X149860013Y-75972252D01*
X150087748Y-76199987D01*
X150355537Y-76378918D01*
X150653088Y-76502168D01*
X150968967Y-76565000D01*
X151291033Y-76565000D01*
X151606912Y-76502168D01*
X151904463Y-76378918D01*
X152172252Y-76199987D01*
X152399987Y-75972252D01*
X152578918Y-75704463D01*
X152702168Y-75406912D01*
X152715001Y-75342398D01*
X152715000Y-76433421D01*
X151983422Y-77165000D01*
X146935000Y-77165000D01*
X146935000Y-76305059D01*
X147092252Y-76199987D01*
X147319987Y-75972252D01*
X147498918Y-75704463D01*
X147622168Y-75406912D01*
X147685000Y-75091033D01*
X147685000Y-74768967D01*
X147622168Y-74453088D01*
X147498918Y-74155537D01*
X147319987Y-73887748D01*
X147092252Y-73660013D01*
X146824463Y-73481082D01*
X146526912Y-73357832D01*
X146211033Y-73295000D01*
X145888967Y-73295000D01*
X145573088Y-73357832D01*
X145275537Y-73481082D01*
X145007748Y-73660013D01*
X144780013Y-73887748D01*
X144601082Y-74155537D01*
X144477832Y-74453088D01*
X144415000Y-74768967D01*
X144415000Y-75091033D01*
X144477832Y-75406912D01*
X144601082Y-75704463D01*
X144780013Y-75972252D01*
X145007748Y-76199987D01*
X145165000Y-76305060D01*
X145165001Y-78006514D01*
X145160718Y-78050000D01*
X145177805Y-78223490D01*
X145228411Y-78390313D01*
X145310589Y-78544059D01*
X145421183Y-78678817D01*
X145555941Y-78789411D01*
X145603815Y-78815000D01*
X141885000Y-78815000D01*
X141885000Y-76481833D01*
X142103088Y-76572168D01*
X142418967Y-76635000D01*
X142741033Y-76635000D01*
X143056912Y-76572168D01*
X143354463Y-76448918D01*
X143622252Y-76269987D01*
X143849987Y-76042252D01*
X144028918Y-75774463D01*
X144152168Y-75476912D01*
X144215000Y-75161033D01*
X144215000Y-74838967D01*
X144152168Y-74523088D01*
X144028918Y-74225537D01*
X143849987Y-73957748D01*
X143622252Y-73730013D01*
X143354463Y-73551082D01*
X143056912Y-73427832D01*
X142741033Y-73365000D01*
X142418967Y-73365000D01*
X142103088Y-73427832D01*
X141805537Y-73551082D01*
X141537748Y-73730013D01*
X141310013Y-73957748D01*
X141163304Y-74177314D01*
X141159687Y-74178411D01*
X141005941Y-74260589D01*
X140871183Y-74371183D01*
X140843466Y-74404956D01*
X140404952Y-74843470D01*
X140371184Y-74871183D01*
X140343471Y-74904951D01*
X140343468Y-74904954D01*
X140260590Y-75005941D01*
X140178412Y-75159687D01*
X140127805Y-75326510D01*
X140110719Y-75500000D01*
X140115001Y-75543479D01*
X140115000Y-78043476D01*
X140115001Y-78043486D01*
X140115000Y-79656523D01*
X140110718Y-79700000D01*
X140115001Y-79743486D01*
X140115000Y-80865478D01*
X140085241Y-80885363D01*
X139885363Y-81085241D01*
X139728320Y-81320273D01*
X139620147Y-81581426D01*
X139565000Y-81858665D01*
X139565000Y-82141335D01*
X139620147Y-82418574D01*
X139728320Y-82679727D01*
X139885363Y-82914759D01*
X140085241Y-83114637D01*
X140320273Y-83271680D01*
X140581426Y-83379853D01*
X140858665Y-83435000D01*
X141141335Y-83435000D01*
X141418574Y-83379853D01*
X141679727Y-83271680D01*
X141914759Y-83114637D01*
X142036694Y-82992702D01*
X142686903Y-82992702D01*
X142758486Y-83236671D01*
X143013996Y-83357571D01*
X143288184Y-83426300D01*
X143570512Y-83440217D01*
X143850130Y-83398787D01*
X144116292Y-83303603D01*
X144241514Y-83236671D01*
X144313097Y-82992702D01*
X143500000Y-82179605D01*
X142686903Y-82992702D01*
X142036694Y-82992702D01*
X142114637Y-82914759D01*
X142248692Y-82714131D01*
X142263329Y-82741514D01*
X142507298Y-82813097D01*
X143320395Y-82000000D01*
X143679605Y-82000000D01*
X144492702Y-82813097D01*
X144736671Y-82741514D01*
X144857571Y-82486004D01*
X144926300Y-82211816D01*
X144940217Y-81929488D01*
X144898787Y-81649870D01*
X144803603Y-81383708D01*
X144736671Y-81258486D01*
X144492702Y-81186903D01*
X143679605Y-82000000D01*
X143320395Y-82000000D01*
X142507298Y-81186903D01*
X142263329Y-81258486D01*
X142249676Y-81287341D01*
X142114637Y-81085241D01*
X141914759Y-80885363D01*
X141885000Y-80865479D01*
X141885000Y-80585000D01*
X143259294Y-80585000D01*
X143149870Y-80601213D01*
X142883708Y-80696397D01*
X142758486Y-80763329D01*
X142686903Y-81007298D01*
X143500000Y-81820395D01*
X144313097Y-81007298D01*
X144241514Y-80763329D01*
X143986004Y-80642429D01*
X143756896Y-80585000D01*
X145933422Y-80585000D01*
X146359513Y-81011091D01*
X146285363Y-81085241D01*
X146128320Y-81320273D01*
X146020147Y-81581426D01*
X145965000Y-81858665D01*
X145965000Y-82141335D01*
X146020147Y-82418574D01*
X146128320Y-82679727D01*
X146285363Y-82914759D01*
X146485241Y-83114637D01*
X146720273Y-83271680D01*
X146981426Y-83379853D01*
X147258665Y-83435000D01*
X147541335Y-83435000D01*
X147818574Y-83379853D01*
X148079727Y-83271680D01*
X148314759Y-83114637D01*
X148514637Y-82914759D01*
X148650000Y-82712173D01*
X148785363Y-82914759D01*
X148985241Y-83114637D01*
X149220273Y-83271680D01*
X149481426Y-83379853D01*
X149758665Y-83435000D01*
X150041335Y-83435000D01*
X150318574Y-83379853D01*
X150579727Y-83271680D01*
X150814759Y-83114637D01*
X151014637Y-82914759D01*
X151034521Y-82885000D01*
X152365479Y-82885000D01*
X152385363Y-82914759D01*
X152585241Y-83114637D01*
X152820273Y-83271680D01*
X153081426Y-83379853D01*
X153358665Y-83435000D01*
X153641335Y-83435000D01*
X153918574Y-83379853D01*
X154179727Y-83271680D01*
X154414759Y-83114637D01*
X154536694Y-82992702D01*
X155186903Y-82992702D01*
X155258486Y-83236671D01*
X155513996Y-83357571D01*
X155788184Y-83426300D01*
X156070512Y-83440217D01*
X156350130Y-83398787D01*
X156616292Y-83303603D01*
X156741514Y-83236671D01*
X156813097Y-82992702D01*
X156000000Y-82179605D01*
X155186903Y-82992702D01*
X154536694Y-82992702D01*
X154614637Y-82914759D01*
X154748692Y-82714131D01*
X154763329Y-82741514D01*
X155007298Y-82813097D01*
X155820395Y-82000000D01*
X155007298Y-81186903D01*
X154763329Y-81258486D01*
X154749676Y-81287341D01*
X154614637Y-81085241D01*
X154536694Y-81007298D01*
X155186903Y-81007298D01*
X156000000Y-81820395D01*
X156813097Y-81007298D01*
X156741514Y-80763329D01*
X156486004Y-80642429D01*
X156211816Y-80573700D01*
X155929488Y-80559783D01*
X155649870Y-80601213D01*
X155383708Y-80696397D01*
X155258486Y-80763329D01*
X155186903Y-81007298D01*
X154536694Y-81007298D01*
X154414759Y-80885363D01*
X154179727Y-80728320D01*
X153918574Y-80620147D01*
X153641335Y-80565000D01*
X153358665Y-80565000D01*
X153081426Y-80620147D01*
X152820273Y-80728320D01*
X152585241Y-80885363D01*
X152385363Y-81085241D01*
X152365479Y-81115000D01*
X151034521Y-81115000D01*
X151014637Y-81085241D01*
X150814759Y-80885363D01*
X150579727Y-80728320D01*
X150318574Y-80620147D01*
X150041335Y-80565000D01*
X149758665Y-80565000D01*
X149481426Y-80620147D01*
X149220273Y-80728320D01*
X148985241Y-80885363D01*
X148785363Y-81085241D01*
X148650000Y-81287827D01*
X148514637Y-81085241D01*
X148474802Y-81045406D01*
X149235209Y-80285000D01*
X152756531Y-80285000D01*
X152800000Y-80289281D01*
X152843469Y-80285000D01*
X152843477Y-80285000D01*
X152973490Y-80272195D01*
X153140313Y-80221589D01*
X153294059Y-80139411D01*
X153428817Y-80028817D01*
X153456534Y-79995044D01*
X154650756Y-78800823D01*
X154692084Y-79103253D01*
X154797749Y-79409578D01*
X154892032Y-79585968D01*
X155157455Y-79682939D01*
X156120395Y-78720000D01*
X156106252Y-78705858D01*
X156285858Y-78526252D01*
X156300000Y-78540395D01*
X156314142Y-78526252D01*
X156493748Y-78705858D01*
X156479605Y-78720000D01*
X156493748Y-78734142D01*
X156314142Y-78913748D01*
X156300000Y-78899605D01*
X155337061Y-79862545D01*
X155434032Y-80127968D01*
X155725353Y-80269856D01*
X156038757Y-80352185D01*
X156362200Y-80371789D01*
X156683253Y-80327916D01*
X156989578Y-80222251D01*
X157165968Y-80127968D01*
X157262938Y-79862546D01*
X157378580Y-79978188D01*
X157440001Y-79916767D01*
X157440001Y-81928029D01*
X157398787Y-81649870D01*
X157303603Y-81383708D01*
X157236671Y-81258486D01*
X156992702Y-81186903D01*
X156179605Y-82000000D01*
X156992702Y-82813097D01*
X157236671Y-82741514D01*
X157357571Y-82486004D01*
X157426300Y-82211816D01*
X157440001Y-81933873D01*
X157440001Y-83441456D01*
X113455545Y-83538552D01*
X113432030Y-80058411D01*
X113451374Y-80077755D01*
X113615000Y-80187086D01*
X113615000Y-80556531D01*
X113610719Y-80600000D01*
X113615000Y-80643469D01*
X113615000Y-80643476D01*
X113627805Y-80773489D01*
X113678411Y-80940312D01*
X113760589Y-81094058D01*
X113871183Y-81228817D01*
X113904956Y-81256534D01*
X115243470Y-82595049D01*
X115271183Y-82628817D01*
X115304951Y-82656530D01*
X115304953Y-82656532D01*
X115333216Y-82679727D01*
X115405941Y-82739411D01*
X115559687Y-82821589D01*
X115675903Y-82856843D01*
X115726509Y-82872195D01*
X115741306Y-82873652D01*
X115856523Y-82885000D01*
X115856531Y-82885000D01*
X115900000Y-82889281D01*
X115943469Y-82885000D01*
X119365479Y-82885000D01*
X119385363Y-82914759D01*
X119585241Y-83114637D01*
X119820273Y-83271680D01*
X120081426Y-83379853D01*
X120358665Y-83435000D01*
X120641335Y-83435000D01*
X120918574Y-83379853D01*
X121179727Y-83271680D01*
X121414759Y-83114637D01*
X121536694Y-82992702D01*
X122186903Y-82992702D01*
X122258486Y-83236671D01*
X122513996Y-83357571D01*
X122788184Y-83426300D01*
X123070512Y-83440217D01*
X123350130Y-83398787D01*
X123616292Y-83303603D01*
X123741514Y-83236671D01*
X123813097Y-82992702D01*
X127186903Y-82992702D01*
X127258486Y-83236671D01*
X127513996Y-83357571D01*
X127788184Y-83426300D01*
X128070512Y-83440217D01*
X128350130Y-83398787D01*
X128616292Y-83303603D01*
X128741514Y-83236671D01*
X128813097Y-82992702D01*
X128000000Y-82179605D01*
X127186903Y-82992702D01*
X123813097Y-82992702D01*
X123000000Y-82179605D01*
X122186903Y-82992702D01*
X121536694Y-82992702D01*
X121614637Y-82914759D01*
X121748692Y-82714131D01*
X121763329Y-82741514D01*
X122007298Y-82813097D01*
X122820395Y-82000000D01*
X123179605Y-82000000D01*
X123992702Y-82813097D01*
X124236671Y-82741514D01*
X124357571Y-82486004D01*
X124426300Y-82211816D01*
X124433265Y-82070512D01*
X126559783Y-82070512D01*
X126601213Y-82350130D01*
X126696397Y-82616292D01*
X126763329Y-82741514D01*
X127007298Y-82813097D01*
X127820395Y-82000000D01*
X127007298Y-81186903D01*
X126763329Y-81258486D01*
X126642429Y-81513996D01*
X126573700Y-81788184D01*
X126559783Y-82070512D01*
X124433265Y-82070512D01*
X124440217Y-81929488D01*
X124398787Y-81649870D01*
X124303603Y-81383708D01*
X124236671Y-81258486D01*
X123992702Y-81186903D01*
X123179605Y-82000000D01*
X122820395Y-82000000D01*
X122007298Y-81186903D01*
X121763329Y-81258486D01*
X121749676Y-81287341D01*
X121614637Y-81085241D01*
X121536694Y-81007298D01*
X122186903Y-81007298D01*
X123000000Y-81820395D01*
X123813097Y-81007298D01*
X127186903Y-81007298D01*
X128000000Y-81820395D01*
X128813097Y-81007298D01*
X128741514Y-80763329D01*
X128486004Y-80642429D01*
X128211816Y-80573700D01*
X127929488Y-80559783D01*
X127649870Y-80601213D01*
X127383708Y-80696397D01*
X127258486Y-80763329D01*
X127186903Y-81007298D01*
X123813097Y-81007298D01*
X123741514Y-80763329D01*
X123486004Y-80642429D01*
X123211816Y-80573700D01*
X122929488Y-80559783D01*
X122649870Y-80601213D01*
X122383708Y-80696397D01*
X122258486Y-80763329D01*
X122186903Y-81007298D01*
X121536694Y-81007298D01*
X121414759Y-80885363D01*
X121179727Y-80728320D01*
X120918574Y-80620147D01*
X120641335Y-80565000D01*
X120358665Y-80565000D01*
X120081426Y-80620147D01*
X119820273Y-80728320D01*
X119585241Y-80885363D01*
X119385363Y-81085241D01*
X119365479Y-81115000D01*
X116266579Y-81115000D01*
X115385000Y-80233422D01*
X115385000Y-80187086D01*
X115548626Y-80077755D01*
X115777755Y-79848626D01*
X115957780Y-79579199D01*
X116081783Y-79279829D01*
X116145000Y-78962018D01*
X116145000Y-78637982D01*
X116081783Y-78320171D01*
X115957780Y-78020801D01*
X115777755Y-77751374D01*
X115556381Y-77530000D01*
X115777755Y-77308626D01*
X115887086Y-77145000D01*
X116402649Y-77145000D01*
X116451065Y-77159687D01*
X116492297Y-77172195D01*
X116665787Y-77189281D01*
X116839277Y-77172195D01*
X117006100Y-77121589D01*
X117159846Y-77039411D01*
X117294604Y-76928817D01*
X117322321Y-76895044D01*
X118142563Y-76074802D01*
X118337748Y-76269987D01*
X118605537Y-76448918D01*
X118903088Y-76572168D01*
X119218967Y-76635000D01*
X119541033Y-76635000D01*
X119856912Y-76572168D01*
X120154463Y-76448918D01*
X120422252Y-76269987D01*
X120649987Y-76042252D01*
X120828918Y-75774463D01*
X120952168Y-75476912D01*
X121015000Y-75161033D01*
X121015000Y-74838967D01*
X122825000Y-74838967D01*
X122825000Y-75161033D01*
X122887832Y-75476912D01*
X123011082Y-75774463D01*
X123190013Y-76042252D01*
X123417748Y-76269987D01*
X123685537Y-76448918D01*
X123983088Y-76572168D01*
X124298967Y-76635000D01*
X124621033Y-76635000D01*
X124936912Y-76572168D01*
X125234463Y-76448918D01*
X125502252Y-76269987D01*
X125729987Y-76042252D01*
X125835059Y-75885000D01*
X127124941Y-75885000D01*
X127230013Y-76042252D01*
X127457748Y-76269987D01*
X127725537Y-76448918D01*
X128023088Y-76572168D01*
X128338967Y-76635000D01*
X128661033Y-76635000D01*
X128846525Y-76598103D01*
X129615000Y-77366579D01*
X129615001Y-80865478D01*
X129585241Y-80885363D01*
X129385363Y-81085241D01*
X129251308Y-81285869D01*
X129236671Y-81258486D01*
X128992702Y-81186903D01*
X128179605Y-82000000D01*
X128992702Y-82813097D01*
X129236671Y-82741514D01*
X129250324Y-82712659D01*
X129385363Y-82914759D01*
X129585241Y-83114637D01*
X129820273Y-83271680D01*
X130081426Y-83379853D01*
X130358665Y-83435000D01*
X130641335Y-83435000D01*
X130918574Y-83379853D01*
X131179727Y-83271680D01*
X131414759Y-83114637D01*
X131614637Y-82914759D01*
X131771680Y-82679727D01*
X131879853Y-82418574D01*
X131935000Y-82141335D01*
X131935000Y-81858665D01*
X131879853Y-81581426D01*
X131771680Y-81320273D01*
X131614637Y-81085241D01*
X131414759Y-80885363D01*
X131385000Y-80865479D01*
X131385000Y-77043465D01*
X131389281Y-76999999D01*
X131385000Y-76956532D01*
X131385000Y-76956523D01*
X131372195Y-76826510D01*
X131321589Y-76659687D01*
X131239411Y-76505941D01*
X131192613Y-76448918D01*
X131156532Y-76404953D01*
X131156530Y-76404951D01*
X131128817Y-76371183D01*
X131095050Y-76343471D01*
X130098103Y-75346525D01*
X130135000Y-75161033D01*
X130135000Y-74838967D01*
X131945000Y-74838967D01*
X131945000Y-75161033D01*
X132007832Y-75476912D01*
X132131082Y-75774463D01*
X132310013Y-76042252D01*
X132537748Y-76269987D01*
X132695000Y-76375060D01*
X132695001Y-79036521D01*
X132690719Y-79080000D01*
X132707805Y-79253490D01*
X132758412Y-79420313D01*
X132840590Y-79574059D01*
X132923468Y-79675046D01*
X132923471Y-79675049D01*
X132951184Y-79708817D01*
X132984951Y-79736529D01*
X133615000Y-80366579D01*
X133615000Y-80865478D01*
X133585241Y-80885363D01*
X133385363Y-81085241D01*
X133228320Y-81320273D01*
X133120147Y-81581426D01*
X133065000Y-81858665D01*
X133065000Y-82141335D01*
X133120147Y-82418574D01*
X133228320Y-82679727D01*
X133385363Y-82914759D01*
X133585241Y-83114637D01*
X133820273Y-83271680D01*
X134081426Y-83379853D01*
X134358665Y-83435000D01*
X134641335Y-83435000D01*
X134918574Y-83379853D01*
X135179727Y-83271680D01*
X135414759Y-83114637D01*
X135536694Y-82992702D01*
X136186903Y-82992702D01*
X136258486Y-83236671D01*
X136513996Y-83357571D01*
X136788184Y-83426300D01*
X137070512Y-83440217D01*
X137350130Y-83398787D01*
X137616292Y-83303603D01*
X137741514Y-83236671D01*
X137813097Y-82992702D01*
X137000000Y-82179605D01*
X136186903Y-82992702D01*
X135536694Y-82992702D01*
X135614637Y-82914759D01*
X135748692Y-82714131D01*
X135763329Y-82741514D01*
X136007298Y-82813097D01*
X136820395Y-82000000D01*
X137179605Y-82000000D01*
X137992702Y-82813097D01*
X138236671Y-82741514D01*
X138357571Y-82486004D01*
X138426300Y-82211816D01*
X138440217Y-81929488D01*
X138398787Y-81649870D01*
X138303603Y-81383708D01*
X138236671Y-81258486D01*
X137992702Y-81186903D01*
X137179605Y-82000000D01*
X136820395Y-82000000D01*
X136007298Y-81186903D01*
X135763329Y-81258486D01*
X135749676Y-81287341D01*
X135614637Y-81085241D01*
X135536694Y-81007298D01*
X136186903Y-81007298D01*
X137000000Y-81820395D01*
X137813097Y-81007298D01*
X137741514Y-80763329D01*
X137486004Y-80642429D01*
X137211816Y-80573700D01*
X136929488Y-80559783D01*
X136649870Y-80601213D01*
X136383708Y-80696397D01*
X136258486Y-80763329D01*
X136186903Y-81007298D01*
X135536694Y-81007298D01*
X135414759Y-80885363D01*
X135385000Y-80865479D01*
X135385000Y-80043465D01*
X135389281Y-79999999D01*
X135385000Y-79956533D01*
X135385000Y-79956523D01*
X135372195Y-79826510D01*
X135321589Y-79659687D01*
X135239411Y-79505941D01*
X135215210Y-79476452D01*
X135156532Y-79404953D01*
X135156530Y-79404951D01*
X135128817Y-79371183D01*
X135095050Y-79343471D01*
X134465000Y-78713422D01*
X134465000Y-76375059D01*
X134622252Y-76269987D01*
X134849987Y-76042252D01*
X134955059Y-75885000D01*
X136124941Y-75885000D01*
X136230013Y-76042252D01*
X136457748Y-76269987D01*
X136725537Y-76448918D01*
X137023088Y-76572168D01*
X137338967Y-76635000D01*
X137661033Y-76635000D01*
X137976912Y-76572168D01*
X138274463Y-76448918D01*
X138542252Y-76269987D01*
X138769987Y-76042252D01*
X138948918Y-75774463D01*
X139072168Y-75476912D01*
X139135000Y-75161033D01*
X139135000Y-74838967D01*
X139072168Y-74523088D01*
X138948918Y-74225537D01*
X138769987Y-73957748D01*
X138542252Y-73730013D01*
X138274463Y-73551082D01*
X137976912Y-73427832D01*
X137661033Y-73365000D01*
X137338967Y-73365000D01*
X137023088Y-73427832D01*
X136725537Y-73551082D01*
X136457748Y-73730013D01*
X136230013Y-73957748D01*
X136124941Y-74115000D01*
X134955059Y-74115000D01*
X134849987Y-73957748D01*
X134622252Y-73730013D01*
X134354463Y-73551082D01*
X134056912Y-73427832D01*
X133741033Y-73365000D01*
X133418967Y-73365000D01*
X133103088Y-73427832D01*
X132805537Y-73551082D01*
X132537748Y-73730013D01*
X132310013Y-73957748D01*
X132131082Y-74225537D01*
X132007832Y-74523088D01*
X131945000Y-74838967D01*
X130135000Y-74838967D01*
X130072168Y-74523088D01*
X129948918Y-74225537D01*
X129769987Y-73957748D01*
X129542252Y-73730013D01*
X129274463Y-73551082D01*
X128976912Y-73427832D01*
X128661033Y-73365000D01*
X128338967Y-73365000D01*
X128023088Y-73427832D01*
X127725537Y-73551082D01*
X127457748Y-73730013D01*
X127230013Y-73957748D01*
X127124941Y-74115000D01*
X125835059Y-74115000D01*
X125729987Y-73957748D01*
X125502252Y-73730013D01*
X125234463Y-73551082D01*
X124936912Y-73427832D01*
X124621033Y-73365000D01*
X124298967Y-73365000D01*
X123983088Y-73427832D01*
X123685537Y-73551082D01*
X123417748Y-73730013D01*
X123190013Y-73957748D01*
X123011082Y-74225537D01*
X122887832Y-74523088D01*
X122825000Y-74838967D01*
X121015000Y-74838967D01*
X120952168Y-74523088D01*
X120828918Y-74225537D01*
X120649987Y-73957748D01*
X120422252Y-73730013D01*
X120154463Y-73551082D01*
X119856912Y-73427832D01*
X119541033Y-73365000D01*
X119218967Y-73365000D01*
X118903088Y-73427832D01*
X118605537Y-73551082D01*
X118337748Y-73730013D01*
X118110013Y-73957748D01*
X118005207Y-74114601D01*
X117965787Y-74110719D01*
X117922318Y-74115000D01*
X117922310Y-74115000D01*
X117792297Y-74127805D01*
X117625473Y-74178411D01*
X117471728Y-74260589D01*
X117370740Y-74343468D01*
X117370738Y-74343470D01*
X117336970Y-74371183D01*
X117309257Y-74404951D01*
X116339209Y-75375000D01*
X115887086Y-75375000D01*
X115777755Y-75211374D01*
X115548626Y-74982245D01*
X115444601Y-74912738D01*
X115462939Y-74862545D01*
X114500000Y-73899605D01*
X114485858Y-73913748D01*
X114306252Y-73734142D01*
X114320395Y-73720000D01*
X114679605Y-73720000D01*
X115642545Y-74682939D01*
X115907968Y-74585968D01*
X116049856Y-74294647D01*
X116132185Y-73981243D01*
X116151789Y-73657800D01*
X116107916Y-73336747D01*
X116002251Y-73030422D01*
X115907968Y-72854032D01*
X115642545Y-72757061D01*
X114679605Y-73720000D01*
X114320395Y-73720000D01*
X114306252Y-73705858D01*
X114485858Y-73526252D01*
X114500000Y-73540395D01*
X115462939Y-72577455D01*
X115416374Y-72450000D01*
X115462939Y-72322545D01*
X114500000Y-71359605D01*
X114485858Y-71373748D01*
X114306252Y-71194142D01*
X114320395Y-71180000D01*
X114306252Y-71165858D01*
X114485858Y-70986252D01*
X114500000Y-71000395D01*
X114514142Y-70986252D01*
X114693748Y-71165858D01*
X114679605Y-71180000D01*
X115642545Y-72142939D01*
X115907968Y-72045968D01*
X116049856Y-71754647D01*
X116132185Y-71441243D01*
X116151789Y-71117800D01*
X116107916Y-70796747D01*
X116002251Y-70490422D01*
X115907968Y-70314032D01*
X115642546Y-70217062D01*
X115758188Y-70101420D01*
X115716768Y-70060000D01*
X155016481Y-70060000D01*
X154912914Y-70215000D01*
G37*
X154912914Y-70215000D02*
X152143465Y-70215000D01*
X152099999Y-70210719D01*
X152056533Y-70215000D01*
X152056523Y-70215000D01*
X151926510Y-70227805D01*
X151759687Y-70278411D01*
X151605941Y-70360589D01*
X151605939Y-70360590D01*
X151605940Y-70360590D01*
X151504953Y-70443468D01*
X151504951Y-70443470D01*
X151471183Y-70471183D01*
X151443470Y-70504951D01*
X150534956Y-71413466D01*
X150501183Y-71441183D01*
X150390589Y-71575942D01*
X150308411Y-71729688D01*
X150300840Y-71754647D01*
X150263057Y-71879199D01*
X150257805Y-71896511D01*
X150245000Y-72026524D01*
X150245000Y-72026531D01*
X150240719Y-72070000D01*
X150245000Y-72113469D01*
X150245001Y-73554940D01*
X150087748Y-73660013D01*
X149860013Y-73887748D01*
X149681082Y-74155537D01*
X149557832Y-74453088D01*
X149495000Y-74768967D01*
X149495000Y-75091033D01*
X149557832Y-75406912D01*
X149681082Y-75704463D01*
X149860013Y-75972252D01*
X150087748Y-76199987D01*
X150355537Y-76378918D01*
X150653088Y-76502168D01*
X150968967Y-76565000D01*
X151291033Y-76565000D01*
X151606912Y-76502168D01*
X151904463Y-76378918D01*
X152172252Y-76199987D01*
X152399987Y-75972252D01*
X152578918Y-75704463D01*
X152702168Y-75406912D01*
X152715001Y-75342398D01*
X152715000Y-76433421D01*
X151983422Y-77165000D01*
X146935000Y-77165000D01*
X146935000Y-76305059D01*
X147092252Y-76199987D01*
X147319987Y-75972252D01*
X147498918Y-75704463D01*
X147622168Y-75406912D01*
X147685000Y-75091033D01*
X147685000Y-74768967D01*
X147622168Y-74453088D01*
X147498918Y-74155537D01*
X147319987Y-73887748D01*
X147092252Y-73660013D01*
X146824463Y-73481082D01*
X146526912Y-73357832D01*
X146211033Y-73295000D01*
X145888967Y-73295000D01*
X145573088Y-73357832D01*
X145275537Y-73481082D01*
X145007748Y-73660013D01*
X144780013Y-73887748D01*
X144601082Y-74155537D01*
X144477832Y-74453088D01*
X144415000Y-74768967D01*
X144415000Y-75091033D01*
X144477832Y-75406912D01*
X144601082Y-75704463D01*
X144780013Y-75972252D01*
X145007748Y-76199987D01*
X145165000Y-76305060D01*
X145165001Y-78006514D01*
X145160718Y-78050000D01*
X145177805Y-78223490D01*
X145228411Y-78390313D01*
X145310589Y-78544059D01*
X145421183Y-78678817D01*
X145555941Y-78789411D01*
X145603815Y-78815000D01*
X141885000Y-78815000D01*
X141885000Y-76481833D01*
X142103088Y-76572168D01*
X142418967Y-76635000D01*
X142741033Y-76635000D01*
X143056912Y-76572168D01*
X143354463Y-76448918D01*
X143622252Y-76269987D01*
X143849987Y-76042252D01*
X144028918Y-75774463D01*
X144152168Y-75476912D01*
X144215000Y-75161033D01*
X144215000Y-74838967D01*
X144152168Y-74523088D01*
X144028918Y-74225537D01*
X143849987Y-73957748D01*
X143622252Y-73730013D01*
X143354463Y-73551082D01*
X143056912Y-73427832D01*
X142741033Y-73365000D01*
X142418967Y-73365000D01*
X142103088Y-73427832D01*
X141805537Y-73551082D01*
X141537748Y-73730013D01*
X141310013Y-73957748D01*
X141163304Y-74177314D01*
X141159687Y-74178411D01*
X141005941Y-74260589D01*
X140871183Y-74371183D01*
X140843466Y-74404956D01*
X140404952Y-74843470D01*
X140371184Y-74871183D01*
X140343471Y-74904951D01*
X140343468Y-74904954D01*
X140260590Y-75005941D01*
X140178412Y-75159687D01*
X140127805Y-75326510D01*
X140110719Y-75500000D01*
X140115001Y-75543479D01*
X140115000Y-78043476D01*
X140115001Y-78043486D01*
X140115000Y-79656523D01*
X140110718Y-79700000D01*
X140115001Y-79743486D01*
X140115000Y-80865478D01*
X140085241Y-80885363D01*
X139885363Y-81085241D01*
X139728320Y-81320273D01*
X139620147Y-81581426D01*
X139565000Y-81858665D01*
X139565000Y-82141335D01*
X139620147Y-82418574D01*
X139728320Y-82679727D01*
X139885363Y-82914759D01*
X140085241Y-83114637D01*
X140320273Y-83271680D01*
X140581426Y-83379853D01*
X140858665Y-83435000D01*
X141141335Y-83435000D01*
X141418574Y-83379853D01*
X141679727Y-83271680D01*
X141914759Y-83114637D01*
X142036694Y-82992702D01*
X142686903Y-82992702D01*
X142758486Y-83236671D01*
X143013996Y-83357571D01*
X143288184Y-83426300D01*
X143570512Y-83440217D01*
X143850130Y-83398787D01*
X144116292Y-83303603D01*
X144241514Y-83236671D01*
X144313097Y-82992702D01*
X143500000Y-82179605D01*
X142686903Y-82992702D01*
X142036694Y-82992702D01*
X142114637Y-82914759D01*
X142248692Y-82714131D01*
X142263329Y-82741514D01*
X142507298Y-82813097D01*
X143320395Y-82000000D01*
X143679605Y-82000000D01*
X144492702Y-82813097D01*
X144736671Y-82741514D01*
X144857571Y-82486004D01*
X144926300Y-82211816D01*
X144940217Y-81929488D01*
X144898787Y-81649870D01*
X144803603Y-81383708D01*
X144736671Y-81258486D01*
X144492702Y-81186903D01*
X143679605Y-82000000D01*
X143320395Y-82000000D01*
X142507298Y-81186903D01*
X142263329Y-81258486D01*
X142249676Y-81287341D01*
X142114637Y-81085241D01*
X141914759Y-80885363D01*
X141885000Y-80865479D01*
X141885000Y-80585000D01*
X143259294Y-80585000D01*
X143149870Y-80601213D01*
X142883708Y-80696397D01*
X142758486Y-80763329D01*
X142686903Y-81007298D01*
X143500000Y-81820395D01*
X144313097Y-81007298D01*
X144241514Y-80763329D01*
X143986004Y-80642429D01*
X143756896Y-80585000D01*
X145933422Y-80585000D01*
X146359513Y-81011091D01*
X146285363Y-81085241D01*
X146128320Y-81320273D01*
X146020147Y-81581426D01*
X145965000Y-81858665D01*
X145965000Y-82141335D01*
X146020147Y-82418574D01*
X146128320Y-82679727D01*
X146285363Y-82914759D01*
X146485241Y-83114637D01*
X146720273Y-83271680D01*
X146981426Y-83379853D01*
X147258665Y-83435000D01*
X147541335Y-83435000D01*
X147818574Y-83379853D01*
X148079727Y-83271680D01*
X148314759Y-83114637D01*
X148514637Y-82914759D01*
X148650000Y-82712173D01*
X148785363Y-82914759D01*
X148985241Y-83114637D01*
X149220273Y-83271680D01*
X149481426Y-83379853D01*
X149758665Y-83435000D01*
X150041335Y-83435000D01*
X150318574Y-83379853D01*
X150579727Y-83271680D01*
X150814759Y-83114637D01*
X151014637Y-82914759D01*
X151034521Y-82885000D01*
X152365479Y-82885000D01*
X152385363Y-82914759D01*
X152585241Y-83114637D01*
X152820273Y-83271680D01*
X153081426Y-83379853D01*
X153358665Y-83435000D01*
X153641335Y-83435000D01*
X153918574Y-83379853D01*
X154179727Y-83271680D01*
X154414759Y-83114637D01*
X154536694Y-82992702D01*
X155186903Y-82992702D01*
X155258486Y-83236671D01*
X155513996Y-83357571D01*
X155788184Y-83426300D01*
X156070512Y-83440217D01*
X156350130Y-83398787D01*
X156616292Y-83303603D01*
X156741514Y-83236671D01*
X156813097Y-82992702D01*
X156000000Y-82179605D01*
X155186903Y-82992702D01*
X154536694Y-82992702D01*
X154614637Y-82914759D01*
X154748692Y-82714131D01*
X154763329Y-82741514D01*
X155007298Y-82813097D01*
X155820395Y-82000000D01*
X155007298Y-81186903D01*
X154763329Y-81258486D01*
X154749676Y-81287341D01*
X154614637Y-81085241D01*
X154536694Y-81007298D01*
X155186903Y-81007298D01*
X156000000Y-81820395D01*
X156813097Y-81007298D01*
X156741514Y-80763329D01*
X156486004Y-80642429D01*
X156211816Y-80573700D01*
X155929488Y-80559783D01*
X155649870Y-80601213D01*
X155383708Y-80696397D01*
X155258486Y-80763329D01*
X155186903Y-81007298D01*
X154536694Y-81007298D01*
X154414759Y-80885363D01*
X154179727Y-80728320D01*
X153918574Y-80620147D01*
X153641335Y-80565000D01*
X153358665Y-80565000D01*
X153081426Y-80620147D01*
X152820273Y-80728320D01*
X152585241Y-80885363D01*
X152385363Y-81085241D01*
X152365479Y-81115000D01*
X151034521Y-81115000D01*
X151014637Y-81085241D01*
X150814759Y-80885363D01*
X150579727Y-80728320D01*
X150318574Y-80620147D01*
X150041335Y-80565000D01*
X149758665Y-80565000D01*
X149481426Y-80620147D01*
X149220273Y-80728320D01*
X148985241Y-80885363D01*
X148785363Y-81085241D01*
X148650000Y-81287827D01*
X148514637Y-81085241D01*
X148474802Y-81045406D01*
X149235209Y-80285000D01*
X152756531Y-80285000D01*
X152800000Y-80289281D01*
X152843469Y-80285000D01*
X152843477Y-80285000D01*
X152973490Y-80272195D01*
X153140313Y-80221589D01*
X153294059Y-80139411D01*
X153428817Y-80028817D01*
X153456534Y-79995044D01*
X154650756Y-78800823D01*
X154692084Y-79103253D01*
X154797749Y-79409578D01*
X154892032Y-79585968D01*
X155157455Y-79682939D01*
X156120395Y-78720000D01*
X156106252Y-78705858D01*
X156285858Y-78526252D01*
X156300000Y-78540395D01*
X156314142Y-78526252D01*
X156493748Y-78705858D01*
X156479605Y-78720000D01*
X156493748Y-78734142D01*
X156314142Y-78913748D01*
X156300000Y-78899605D01*
X155337061Y-79862545D01*
X155434032Y-80127968D01*
X155725353Y-80269856D01*
X156038757Y-80352185D01*
X156362200Y-80371789D01*
X156683253Y-80327916D01*
X156989578Y-80222251D01*
X157165968Y-80127968D01*
X157262938Y-79862546D01*
X157378580Y-79978188D01*
X157440001Y-79916767D01*
X157440001Y-81928029D01*
X157398787Y-81649870D01*
X157303603Y-81383708D01*
X157236671Y-81258486D01*
X156992702Y-81186903D01*
X156179605Y-82000000D01*
X156992702Y-82813097D01*
X157236671Y-82741514D01*
X157357571Y-82486004D01*
X157426300Y-82211816D01*
X157440001Y-81933873D01*
X157440001Y-83441456D01*
X113455545Y-83538552D01*
X113432030Y-80058411D01*
X113451374Y-80077755D01*
X113615000Y-80187086D01*
X113615000Y-80556531D01*
X113610719Y-80600000D01*
X113615000Y-80643469D01*
X113615000Y-80643476D01*
X113627805Y-80773489D01*
X113678411Y-80940312D01*
X113760589Y-81094058D01*
X113871183Y-81228817D01*
X113904956Y-81256534D01*
X115243470Y-82595049D01*
X115271183Y-82628817D01*
X115304951Y-82656530D01*
X115304953Y-82656532D01*
X115333216Y-82679727D01*
X115405941Y-82739411D01*
X115559687Y-82821589D01*
X115675903Y-82856843D01*
X115726509Y-82872195D01*
X115741306Y-82873652D01*
X115856523Y-82885000D01*
X115856531Y-82885000D01*
X115900000Y-82889281D01*
X115943469Y-82885000D01*
X119365479Y-82885000D01*
X119385363Y-82914759D01*
X119585241Y-83114637D01*
X119820273Y-83271680D01*
X120081426Y-83379853D01*
X120358665Y-83435000D01*
X120641335Y-83435000D01*
X120918574Y-83379853D01*
X121179727Y-83271680D01*
X121414759Y-83114637D01*
X121536694Y-82992702D01*
X122186903Y-82992702D01*
X122258486Y-83236671D01*
X122513996Y-83357571D01*
X122788184Y-83426300D01*
X123070512Y-83440217D01*
X123350130Y-83398787D01*
X123616292Y-83303603D01*
X123741514Y-83236671D01*
X123813097Y-82992702D01*
X127186903Y-82992702D01*
X127258486Y-83236671D01*
X127513996Y-83357571D01*
X127788184Y-83426300D01*
X128070512Y-83440217D01*
X128350130Y-83398787D01*
X128616292Y-83303603D01*
X128741514Y-83236671D01*
X128813097Y-82992702D01*
X128000000Y-82179605D01*
X127186903Y-82992702D01*
X123813097Y-82992702D01*
X123000000Y-82179605D01*
X122186903Y-82992702D01*
X121536694Y-82992702D01*
X121614637Y-82914759D01*
X121748692Y-82714131D01*
X121763329Y-82741514D01*
X122007298Y-82813097D01*
X122820395Y-82000000D01*
X123179605Y-82000000D01*
X123992702Y-82813097D01*
X124236671Y-82741514D01*
X124357571Y-82486004D01*
X124426300Y-82211816D01*
X124433265Y-82070512D01*
X126559783Y-82070512D01*
X126601213Y-82350130D01*
X126696397Y-82616292D01*
X126763329Y-82741514D01*
X127007298Y-82813097D01*
X127820395Y-82000000D01*
X127007298Y-81186903D01*
X126763329Y-81258486D01*
X126642429Y-81513996D01*
X126573700Y-81788184D01*
X126559783Y-82070512D01*
X124433265Y-82070512D01*
X124440217Y-81929488D01*
X124398787Y-81649870D01*
X124303603Y-81383708D01*
X124236671Y-81258486D01*
X123992702Y-81186903D01*
X123179605Y-82000000D01*
X122820395Y-82000000D01*
X122007298Y-81186903D01*
X121763329Y-81258486D01*
X121749676Y-81287341D01*
X121614637Y-81085241D01*
X121536694Y-81007298D01*
X122186903Y-81007298D01*
X123000000Y-81820395D01*
X123813097Y-81007298D01*
X127186903Y-81007298D01*
X128000000Y-81820395D01*
X128813097Y-81007298D01*
X128741514Y-80763329D01*
X128486004Y-80642429D01*
X128211816Y-80573700D01*
X127929488Y-80559783D01*
X127649870Y-80601213D01*
X127383708Y-80696397D01*
X127258486Y-80763329D01*
X127186903Y-81007298D01*
X123813097Y-81007298D01*
X123741514Y-80763329D01*
X123486004Y-80642429D01*
X123211816Y-80573700D01*
X122929488Y-80559783D01*
X122649870Y-80601213D01*
X122383708Y-80696397D01*
X122258486Y-80763329D01*
X122186903Y-81007298D01*
X121536694Y-81007298D01*
X121414759Y-80885363D01*
X121179727Y-80728320D01*
X120918574Y-80620147D01*
X120641335Y-80565000D01*
X120358665Y-80565000D01*
X120081426Y-80620147D01*
X119820273Y-80728320D01*
X119585241Y-80885363D01*
X119385363Y-81085241D01*
X119365479Y-81115000D01*
X116266579Y-81115000D01*
X115385000Y-80233422D01*
X115385000Y-80187086D01*
X115548626Y-80077755D01*
X115777755Y-79848626D01*
X115957780Y-79579199D01*
X116081783Y-79279829D01*
X116145000Y-78962018D01*
X116145000Y-78637982D01*
X116081783Y-78320171D01*
X115957780Y-78020801D01*
X115777755Y-77751374D01*
X115556381Y-77530000D01*
X115777755Y-77308626D01*
X115887086Y-77145000D01*
X116402649Y-77145000D01*
X116451065Y-77159687D01*
X116492297Y-77172195D01*
X116665787Y-77189281D01*
X116839277Y-77172195D01*
X117006100Y-77121589D01*
X117159846Y-77039411D01*
X117294604Y-76928817D01*
X117322321Y-76895044D01*
X118142563Y-76074802D01*
X118337748Y-76269987D01*
X118605537Y-76448918D01*
X118903088Y-76572168D01*
X119218967Y-76635000D01*
X119541033Y-76635000D01*
X119856912Y-76572168D01*
X120154463Y-76448918D01*
X120422252Y-76269987D01*
X120649987Y-76042252D01*
X120828918Y-75774463D01*
X120952168Y-75476912D01*
X121015000Y-75161033D01*
X121015000Y-74838967D01*
X122825000Y-74838967D01*
X122825000Y-75161033D01*
X122887832Y-75476912D01*
X123011082Y-75774463D01*
X123190013Y-76042252D01*
X123417748Y-76269987D01*
X123685537Y-76448918D01*
X123983088Y-76572168D01*
X124298967Y-76635000D01*
X124621033Y-76635000D01*
X124936912Y-76572168D01*
X125234463Y-76448918D01*
X125502252Y-76269987D01*
X125729987Y-76042252D01*
X125835059Y-75885000D01*
X127124941Y-75885000D01*
X127230013Y-76042252D01*
X127457748Y-76269987D01*
X127725537Y-76448918D01*
X128023088Y-76572168D01*
X128338967Y-76635000D01*
X128661033Y-76635000D01*
X128846525Y-76598103D01*
X129615000Y-77366579D01*
X129615001Y-80865478D01*
X129585241Y-80885363D01*
X129385363Y-81085241D01*
X129251308Y-81285869D01*
X129236671Y-81258486D01*
X128992702Y-81186903D01*
X128179605Y-82000000D01*
X128992702Y-82813097D01*
X129236671Y-82741514D01*
X129250324Y-82712659D01*
X129385363Y-82914759D01*
X129585241Y-83114637D01*
X129820273Y-83271680D01*
X130081426Y-83379853D01*
X130358665Y-83435000D01*
X130641335Y-83435000D01*
X130918574Y-83379853D01*
X131179727Y-83271680D01*
X131414759Y-83114637D01*
X131614637Y-82914759D01*
X131771680Y-82679727D01*
X131879853Y-82418574D01*
X131935000Y-82141335D01*
X131935000Y-81858665D01*
X131879853Y-81581426D01*
X131771680Y-81320273D01*
X131614637Y-81085241D01*
X131414759Y-80885363D01*
X131385000Y-80865479D01*
X131385000Y-77043465D01*
X131389281Y-76999999D01*
X131385000Y-76956532D01*
X131385000Y-76956523D01*
X131372195Y-76826510D01*
X131321589Y-76659687D01*
X131239411Y-76505941D01*
X131192613Y-76448918D01*
X131156532Y-76404953D01*
X131156530Y-76404951D01*
X131128817Y-76371183D01*
X131095050Y-76343471D01*
X130098103Y-75346525D01*
X130135000Y-75161033D01*
X130135000Y-74838967D01*
X131945000Y-74838967D01*
X131945000Y-75161033D01*
X132007832Y-75476912D01*
X132131082Y-75774463D01*
X132310013Y-76042252D01*
X132537748Y-76269987D01*
X132695000Y-76375060D01*
X132695001Y-79036521D01*
X132690719Y-79080000D01*
X132707805Y-79253490D01*
X132758412Y-79420313D01*
X132840590Y-79574059D01*
X132923468Y-79675046D01*
X132923471Y-79675049D01*
X132951184Y-79708817D01*
X132984951Y-79736529D01*
X133615000Y-80366579D01*
X133615000Y-80865478D01*
X133585241Y-80885363D01*
X133385363Y-81085241D01*
X133228320Y-81320273D01*
X133120147Y-81581426D01*
X133065000Y-81858665D01*
X133065000Y-82141335D01*
X133120147Y-82418574D01*
X133228320Y-82679727D01*
X133385363Y-82914759D01*
X133585241Y-83114637D01*
X133820273Y-83271680D01*
X134081426Y-83379853D01*
X134358665Y-83435000D01*
X134641335Y-83435000D01*
X134918574Y-83379853D01*
X135179727Y-83271680D01*
X135414759Y-83114637D01*
X135536694Y-82992702D01*
X136186903Y-82992702D01*
X136258486Y-83236671D01*
X136513996Y-83357571D01*
X136788184Y-83426300D01*
X137070512Y-83440217D01*
X137350130Y-83398787D01*
X137616292Y-83303603D01*
X137741514Y-83236671D01*
X137813097Y-82992702D01*
X137000000Y-82179605D01*
X136186903Y-82992702D01*
X135536694Y-82992702D01*
X135614637Y-82914759D01*
X135748692Y-82714131D01*
X135763329Y-82741514D01*
X136007298Y-82813097D01*
X136820395Y-82000000D01*
X137179605Y-82000000D01*
X137992702Y-82813097D01*
X138236671Y-82741514D01*
X138357571Y-82486004D01*
X138426300Y-82211816D01*
X138440217Y-81929488D01*
X138398787Y-81649870D01*
X138303603Y-81383708D01*
X138236671Y-81258486D01*
X137992702Y-81186903D01*
X137179605Y-82000000D01*
X136820395Y-82000000D01*
X136007298Y-81186903D01*
X135763329Y-81258486D01*
X135749676Y-81287341D01*
X135614637Y-81085241D01*
X135536694Y-81007298D01*
X136186903Y-81007298D01*
X137000000Y-81820395D01*
X137813097Y-81007298D01*
X137741514Y-80763329D01*
X137486004Y-80642429D01*
X137211816Y-80573700D01*
X136929488Y-80559783D01*
X136649870Y-80601213D01*
X136383708Y-80696397D01*
X136258486Y-80763329D01*
X136186903Y-81007298D01*
X135536694Y-81007298D01*
X135414759Y-80885363D01*
X135385000Y-80865479D01*
X135385000Y-80043465D01*
X135389281Y-79999999D01*
X135385000Y-79956533D01*
X135385000Y-79956523D01*
X135372195Y-79826510D01*
X135321589Y-79659687D01*
X135239411Y-79505941D01*
X135215210Y-79476452D01*
X135156532Y-79404953D01*
X135156530Y-79404951D01*
X135128817Y-79371183D01*
X135095050Y-79343471D01*
X134465000Y-78713422D01*
X134465000Y-76375059D01*
X134622252Y-76269987D01*
X134849987Y-76042252D01*
X134955059Y-75885000D01*
X136124941Y-75885000D01*
X136230013Y-76042252D01*
X136457748Y-76269987D01*
X136725537Y-76448918D01*
X137023088Y-76572168D01*
X137338967Y-76635000D01*
X137661033Y-76635000D01*
X137976912Y-76572168D01*
X138274463Y-76448918D01*
X138542252Y-76269987D01*
X138769987Y-76042252D01*
X138948918Y-75774463D01*
X139072168Y-75476912D01*
X139135000Y-75161033D01*
X139135000Y-74838967D01*
X139072168Y-74523088D01*
X138948918Y-74225537D01*
X138769987Y-73957748D01*
X138542252Y-73730013D01*
X138274463Y-73551082D01*
X137976912Y-73427832D01*
X137661033Y-73365000D01*
X137338967Y-73365000D01*
X137023088Y-73427832D01*
X136725537Y-73551082D01*
X136457748Y-73730013D01*
X136230013Y-73957748D01*
X136124941Y-74115000D01*
X134955059Y-74115000D01*
X134849987Y-73957748D01*
X134622252Y-73730013D01*
X134354463Y-73551082D01*
X134056912Y-73427832D01*
X133741033Y-73365000D01*
X133418967Y-73365000D01*
X133103088Y-73427832D01*
X132805537Y-73551082D01*
X132537748Y-73730013D01*
X132310013Y-73957748D01*
X132131082Y-74225537D01*
X132007832Y-74523088D01*
X131945000Y-74838967D01*
X130135000Y-74838967D01*
X130072168Y-74523088D01*
X129948918Y-74225537D01*
X129769987Y-73957748D01*
X129542252Y-73730013D01*
X129274463Y-73551082D01*
X128976912Y-73427832D01*
X128661033Y-73365000D01*
X128338967Y-73365000D01*
X128023088Y-73427832D01*
X127725537Y-73551082D01*
X127457748Y-73730013D01*
X127230013Y-73957748D01*
X127124941Y-74115000D01*
X125835059Y-74115000D01*
X125729987Y-73957748D01*
X125502252Y-73730013D01*
X125234463Y-73551082D01*
X124936912Y-73427832D01*
X124621033Y-73365000D01*
X124298967Y-73365000D01*
X123983088Y-73427832D01*
X123685537Y-73551082D01*
X123417748Y-73730013D01*
X123190013Y-73957748D01*
X123011082Y-74225537D01*
X122887832Y-74523088D01*
X122825000Y-74838967D01*
X121015000Y-74838967D01*
X120952168Y-74523088D01*
X120828918Y-74225537D01*
X120649987Y-73957748D01*
X120422252Y-73730013D01*
X120154463Y-73551082D01*
X119856912Y-73427832D01*
X119541033Y-73365000D01*
X119218967Y-73365000D01*
X118903088Y-73427832D01*
X118605537Y-73551082D01*
X118337748Y-73730013D01*
X118110013Y-73957748D01*
X118005207Y-74114601D01*
X117965787Y-74110719D01*
X117922318Y-74115000D01*
X117922310Y-74115000D01*
X117792297Y-74127805D01*
X117625473Y-74178411D01*
X117471728Y-74260589D01*
X117370740Y-74343468D01*
X117370738Y-74343470D01*
X117336970Y-74371183D01*
X117309257Y-74404951D01*
X116339209Y-75375000D01*
X115887086Y-75375000D01*
X115777755Y-75211374D01*
X115548626Y-74982245D01*
X115444601Y-74912738D01*
X115462939Y-74862545D01*
X114500000Y-73899605D01*
X114485858Y-73913748D01*
X114306252Y-73734142D01*
X114320395Y-73720000D01*
X114679605Y-73720000D01*
X115642545Y-74682939D01*
X115907968Y-74585968D01*
X116049856Y-74294647D01*
X116132185Y-73981243D01*
X116151789Y-73657800D01*
X116107916Y-73336747D01*
X116002251Y-73030422D01*
X115907968Y-72854032D01*
X115642545Y-72757061D01*
X114679605Y-73720000D01*
X114320395Y-73720000D01*
X114306252Y-73705858D01*
X114485858Y-73526252D01*
X114500000Y-73540395D01*
X115462939Y-72577455D01*
X115416374Y-72450000D01*
X115462939Y-72322545D01*
X114500000Y-71359605D01*
X114485858Y-71373748D01*
X114306252Y-71194142D01*
X114320395Y-71180000D01*
X114306252Y-71165858D01*
X114485858Y-70986252D01*
X114500000Y-71000395D01*
X114514142Y-70986252D01*
X114693748Y-71165858D01*
X114679605Y-71180000D01*
X115642545Y-72142939D01*
X115907968Y-72045968D01*
X116049856Y-71754647D01*
X116132185Y-71441243D01*
X116151789Y-71117800D01*
X116107916Y-70796747D01*
X116002251Y-70490422D01*
X115907968Y-70314032D01*
X115642546Y-70217062D01*
X115758188Y-70101420D01*
X115716768Y-70060000D01*
X155016481Y-70060000D01*
X154912914Y-70215000D01*
G36*
X155022245Y-72148626D02*
G01*
X155243619Y-72370000D01*
X155022245Y-72591374D01*
X154912914Y-72755000D01*
X154503469Y-72755000D01*
X154460000Y-72750719D01*
X154416531Y-72755000D01*
X154416523Y-72755000D01*
X154286510Y-72767805D01*
X154119686Y-72818411D01*
X153965941Y-72900589D01*
X153864953Y-72983468D01*
X153864951Y-72983470D01*
X153831183Y-73011183D01*
X153803470Y-73044951D01*
X153004951Y-73843471D01*
X152971184Y-73871183D01*
X152943471Y-73904951D01*
X152943468Y-73904954D01*
X152860590Y-74005941D01*
X152778412Y-74159687D01*
X152727805Y-74326510D01*
X152710977Y-74497376D01*
X152702168Y-74453088D01*
X152578918Y-74155537D01*
X152399987Y-73887748D01*
X152172252Y-73660013D01*
X152015000Y-73554941D01*
X152015000Y-72436578D01*
X152466579Y-71985000D01*
X154912914Y-71985000D01*
X155022245Y-72148626D01*
G37*
X155022245Y-72148626D02*
X155243619Y-72370000D01*
X155022245Y-72591374D01*
X154912914Y-72755000D01*
X154503469Y-72755000D01*
X154460000Y-72750719D01*
X154416531Y-72755000D01*
X154416523Y-72755000D01*
X154286510Y-72767805D01*
X154119686Y-72818411D01*
X153965941Y-72900589D01*
X153864953Y-72983468D01*
X153864951Y-72983470D01*
X153831183Y-73011183D01*
X153803470Y-73044951D01*
X153004951Y-73843471D01*
X152971184Y-73871183D01*
X152943471Y-73904951D01*
X152943468Y-73904954D01*
X152860590Y-74005941D01*
X152778412Y-74159687D01*
X152727805Y-74326510D01*
X152710977Y-74497376D01*
X152702168Y-74453088D01*
X152578918Y-74155537D01*
X152399987Y-73887748D01*
X152172252Y-73660013D01*
X152015000Y-73554941D01*
X152015000Y-72436578D01*
X152466579Y-71985000D01*
X154912914Y-71985000D01*
X155022245Y-72148626D01*
M02*
