EESchema Schematic File Version 4
EELAYER 30 0
EELAYER END
$Descr A2 23386 16535
encoding utf-8
Sheet 1 3
Title "uSDX  SDR SSB PCB VER.1.02"
Date "6/6/2020"
Rev "V1.02"
Comp "WB2CBA"
Comment1 "Pluggable Band LPF Module + SI5351 smd option+PY2OHH PA mod option"
Comment2 "LM1117-5.0 regulator for 5 volts + 1N5819 Polarity Protection"
Comment3 "Test Points + BAOFENG UV-3R MIC/SPK jack"
Comment4 "Barrel Power Jack option + SMA or BNC Antenna Jack option"
$EndDescr
$Comp
L dk_Embedded-Microcontrollers:ATMEGA328-PU U2
U 1 1 5EC0748C
P 17650 6000
F 0 "U2" H 17550 7403 60  0000 C CNN
F 1 "ATMEGA328-PU" H 17550 7297 60  0000 C CNN
F 2 "Package_DIP:DIP-28_W7.62mm_Socket_LongPads" H 17850 6200 60  0001 L CNN
F 3 "http://www.microchip.com/mymicrochip/filehandler.aspx?ddocname=en608326" H 17850 6300 60  0001 L CNN
F 4 "ATMEGA328-PU-ND" H 17850 6400 60  0001 L CNN "Digi-Key_PN"
F 5 "ATMEGA328-PU" H 17850 6500 60  0001 L CNN "MPN"
F 6 "Integrated Circuits (ICs)" H 17850 6600 60  0001 L CNN "Category"
F 7 "Embedded - Microcontrollers" H 17850 6700 60  0001 L CNN "Family"
F 8 "http://www.microchip.com/mymicrochip/filehandler.aspx?ddocname=en608326" H 17850 6800 60  0001 L CNN "DK_Datasheet_Link"
F 9 "/product-detail/en/microchip-technology/ATMEGA328-PU/ATMEGA328-PU-ND/2271026" H 17850 6900 60  0001 L CNN "DK_Detail_Page"
F 10 "IC MCU 8BIT 32KB FLASH 28DIP" H 17850 7000 60  0001 L CNN "Description"
F 11 "Microchip Technology" H 17850 7100 60  0001 L CNN "Manufacturer"
F 12 "Active" H 17850 7200 60  0001 L CNN "Status"
	1    17650 6000
	1    0    0    -1  
$EndComp
$Comp
L Amplifier_Operational:LM4562 U4
U 2 1 5EC08B35
P 13000 5400
F 0 "U4" H 13000 5033 50  0000 C CNN
F 1 "LM4562" H 13000 5124 50  0000 C CNN
F 2 "Package_DIP:DIP-8_W7.62mm_LongPads" H 13000 5400 50  0001 C CNN
F 3 "http://www.ti.com/lit/ds/symlink/lm4562.pdf" H 13000 5400 50  0001 C CNN
	2    13000 5400
	1    0    0    1   
$EndComp
$Comp
L Amplifier_Operational:LM4562 U4
U 1 1 5EC0AB22
P 13000 6650
F 0 "U4" H 13200 6950 50  0000 C CNN
F 1 "LM4562" H 13200 6850 50  0000 C CNN
F 2 "Package_DIP:DIP-8_W7.62mm_LongPads" H 13000 6650 50  0001 C CNN
F 3 "http://www.ti.com/lit/ds/symlink/lm4562.pdf" H 13000 6650 50  0001 C CNN
	1    13000 6650
	1    0    0    1   
$EndComp
$Comp
L Analog_Switch:SN74CBT3253 U5
U 1 1 5EC0D54D
P 11250 5700
F 0 "U5" H 11000 6400 50  0000 C CNN
F 1 "FST3253" H 11000 6300 50  0000 C CNN
F 2 "Package_SO:SOIC-16_4.55x10.3mm_P1.27mm" H 11250 5700 50  0001 C CNN
F 3 "http://www.ti.com/lit/gpn/sn74cbt3253" H 11250 5700 50  0001 C CNN
	1    11250 5700
	1    0    0    -1  
$EndComp
$Comp
L Device:Crystal Y1
U 1 1 5EC1047A
P 17000 5600
F 0 "Y1" H 17000 5332 50  0000 C CNN
F 1 "20 Mhz" H 17000 5423 50  0000 C CNN
F 2 "Crystal:Crystal_HC49-U_Vertical" H 17000 5600 50  0001 C CNN
F 3 "~" H 17000 5600 50  0001 C CNN
	1    17000 5600
	-1   0    0    1   
$EndComp
$Comp
L dk_Transistors-FETs-MOSFETs-Single:BS170 Q3
U 1 1 5EC11FDA
P 14250 10600
F 0 "Q3" H 14358 10653 60  0000 L CNN
F 1 "BS170" H 14358 10547 60  0000 L CNN
F 2 "Package_TO_SOT_THT:TO-92L_HandSolder" H 14450 10800 60  0001 L CNN
F 3 "https://www.onsemi.com/pub/Collateral/BS170-D.PDF" H 14450 10900 60  0001 L CNN
F 4 "BS170-ND" H 14450 11000 60  0001 L CNN "Digi-Key_PN"
F 5 "BS170" H 14450 11100 60  0001 L CNN "MPN"
F 6 "Discrete Semiconductor Products" H 14450 11200 60  0001 L CNN "Category"
F 7 "Transistors - FETs, MOSFETs - Single" H 14450 11300 60  0001 L CNN "Family"
F 8 "https://www.onsemi.com/pub/Collateral/BS170-D.PDF" H 14450 11400 60  0001 L CNN "DK_Datasheet_Link"
F 9 "/product-detail/en/on-semiconductor/BS170/BS170-ND/244280" H 14450 11500 60  0001 L CNN "DK_Detail_Page"
F 10 "MOSFET N-CH 60V 500MA TO-92" H 14450 11600 60  0001 L CNN "Description"
F 11 "ON Semiconductor" H 14450 11700 60  0001 L CNN "Manufacturer"
F 12 "Active" H 14450 11800 60  0001 L CNN "Status"
	1    14250 10600
	-1   0    0    -1  
$EndComp
$Comp
L dk_Transistors-FETs-MOSFETs-Single:BS170 Q4
U 1 1 5EC14422
P 14250 11200
F 0 "Q4" H 14358 11253 60  0000 L CNN
F 1 "BS170" H 14358 11147 60  0000 L CNN
F 2 "Package_TO_SOT_THT:TO-92L_HandSolder" H 14450 11400 60  0001 L CNN
F 3 "https://www.onsemi.com/pub/Collateral/BS170-D.PDF" H 14450 11500 60  0001 L CNN
F 4 "BS170-ND" H 14450 11600 60  0001 L CNN "Digi-Key_PN"
F 5 "BS170" H 14450 11700 60  0001 L CNN "MPN"
F 6 "Discrete Semiconductor Products" H 14450 11800 60  0001 L CNN "Category"
F 7 "Transistors - FETs, MOSFETs - Single" H 14450 11900 60  0001 L CNN "Family"
F 8 "https://www.onsemi.com/pub/Collateral/BS170-D.PDF" H 14450 12000 60  0001 L CNN "DK_Datasheet_Link"
F 9 "/product-detail/en/on-semiconductor/BS170/BS170-ND/244280" H 14450 12100 60  0001 L CNN "DK_Detail_Page"
F 10 "MOSFET N-CH 60V 500MA TO-92" H 14450 12200 60  0001 L CNN "Description"
F 11 "ON Semiconductor" H 14450 12300 60  0001 L CNN "Manufacturer"
F 12 "Active" H 14450 12400 60  0001 L CNN "Status"
	1    14250 11200
	-1   0    0    -1  
$EndComp
$Comp
L dk_Transistors-FETs-MOSFETs-Single:BS170 Q1
U 1 1 5EC15C2F
P 11300 9200
F 0 "Q1" H 11408 9253 60  0000 L CNN
F 1 "BS170" H 11408 9147 60  0000 L CNN
F 2 "Package_TO_SOT_THT:TO-92L_HandSolder" H 11500 9400 60  0001 L CNN
F 3 "https://www.onsemi.com/pub/Collateral/BS170-D.PDF" H 11500 9500 60  0001 L CNN
F 4 "BS170-ND" H 11500 9600 60  0001 L CNN "Digi-Key_PN"
F 5 "BS170" H 11500 9700 60  0001 L CNN "MPN"
F 6 "Discrete Semiconductor Products" H 11500 9800 60  0001 L CNN "Category"
F 7 "Transistors - FETs, MOSFETs - Single" H 11500 9900 60  0001 L CNN "Family"
F 8 "https://www.onsemi.com/pub/Collateral/BS170-D.PDF" H 11500 10000 60  0001 L CNN "DK_Datasheet_Link"
F 9 "/product-detail/en/on-semiconductor/BS170/BS170-ND/244280" H 11500 10100 60  0001 L CNN "DK_Detail_Page"
F 10 "MOSFET N-CH 60V 500MA TO-92" H 11500 10200 60  0001 L CNN "Description"
F 11 "ON Semiconductor" H 11500 10300 60  0001 L CNN "Manufacturer"
F 12 "Active" H 11500 10400 60  0001 L CNN "Status"
	1    11300 9200
	-1   0    0    1   
$EndComp
Wire Wire Line
	17650 6800 17750 6800
$Comp
L Display_Character:RC1602A U3
U 1 1 5EC2A016
P 19200 5500
F 0 "U3" H 19200 6381 50  0000 C CNN
F 1 "RC1602A" H 19200 6290 50  0000 C CNN
F 2 "Display:WC1602A" H 19300 4700 50  0001 C CNN
F 3 "http://www.raystar-optronics.com/down.php?ProID=18" H 19300 5400 50  0001 C CNN
	1    19200 5500
	1    0    0    -1  
$EndComp
Wire Wire Line
	18800 5100 18550 5100
Wire Wire Line
	18550 5100 18550 6250
Wire Wire Line
	18550 6250 19200 6250
Wire Wire Line
	19200 6250 19200 6200
Wire Wire Line
	19200 6250 19650 6250
Wire Wire Line
	19650 6250 19650 5700
Wire Wire Line
	19650 5700 19600 5700
Connection ~ 19200 6250
$Comp
L power:GNDPWR #PWR0101
U 1 1 5EC2EB05
P 19650 6250
F 0 "#PWR0101" H 19650 6050 50  0001 C CNN
F 1 "GNDPWR" H 19654 6096 50  0000 C CNN
F 2 "" H 19650 6200 50  0001 C CNN
F 3 "" H 19650 6200 50  0001 C CNN
	1    19650 6250
	1    0    0    -1  
$EndComp
$Comp
L Device:R R22
U 1 1 5EC2FACA
P 20300 5650
F 0 "R22" H 20370 5696 50  0000 L CNN
F 1 "1k-1/2W" H 20370 5605 50  0000 L CNN
F 2 "Resistor_THT:R_Axial_DIN0204_L3.6mm_D1.6mm_P2.54mm_Vertical" V 20230 5650 50  0001 C CNN
F 3 "~" H 20300 5650 50  0001 C CNN
	1    20300 5650
	1    0    0    -1  
$EndComp
Wire Wire Line
	20300 5800 19600 5800
$Comp
L Device:R_POT RV1
U 1 1 5EC34175
P 19900 5300
F 0 "RV1" H 19830 5346 50  0000 R CNN
F 1 "10k" H 19830 5255 50  0000 R CNN
F 2 "Potentiometer_THT:Potentiometer_Piher_PT-10-V10_Vertical" H 19900 5300 50  0001 C CNN
F 3 "~" H 19900 5300 50  0001 C CNN
	1    19900 5300
	-1   0    0    -1  
$EndComp
Wire Wire Line
	19750 5300 19600 5300
$Comp
L power:GNDPWR #PWR0103
U 1 1 5EC3749E
P 19900 6150
F 0 "#PWR0103" H 19900 5950 50  0001 C CNN
F 1 "GNDPWR" H 19904 5996 50  0000 C CNN
F 2 "" H 19900 6100 50  0001 C CNN
F 3 "" H 19900 6100 50  0001 C CNN
	1    19900 6150
	1    0    0    -1  
$EndComp
$Comp
L pspice:CAP C6
U 1 1 5EC4C38D
P 16600 3850
F 0 "C6" H 16778 3896 50  0000 L CNN
F 1 "100nF" H 16778 3805 50  0000 L CNN
F 2 "Capacitor_THT:C_Disc_D3.0mm_W2.0mm_P2.50mm" H 16600 3850 50  0001 C CNN
F 3 "~" H 16600 3850 50  0001 C CNN
	1    16600 3850
	1    0    0    -1  
$EndComp
$Comp
L Device:CP C5
U 1 1 5EC4C393
P 17100 3850
F 0 "C5" H 17218 3896 50  0000 L CNN
F 1 "10uF" H 17218 3805 50  0000 L CNN
F 2 "Capacitor_THT:CP_Radial_D4.0mm_P2.00mm" H 17138 3700 50  0001 C CNN
F 3 "~" H 17100 3850 50  0001 C CNN
	1    17100 3850
	1    0    0    -1  
$EndComp
Wire Wire Line
	17100 3600 17100 3700
Wire Wire Line
	16600 4100 16900 4100
Wire Wire Line
	17100 4100 17100 4000
$Comp
L power:GNDPWR #PWR0105
U 1 1 5EC690B3
P 16900 4200
F 0 "#PWR0105" H 16900 4000 50  0001 C CNN
F 1 "GNDPWR" H 16904 4046 50  0000 C CNN
F 2 "" H 16900 4150 50  0001 C CNN
F 3 "" H 16900 4150 50  0001 C CNN
	1    16900 4200
	1    0    0    -1  
$EndComp
Wire Wire Line
	16900 4200 16900 4100
Connection ~ 16900 4100
Wire Wire Line
	16900 4100 17100 4100
Wire Wire Line
	16600 3600 17100 3600
Wire Wire Line
	16350 3600 16600 3600
Connection ~ 16600 3600
Wire Wire Line
	17650 3600 17650 4800
Connection ~ 17100 3600
Wire Wire Line
	17650 3600 17750 3600
Wire Wire Line
	19200 3600 19200 4400
Connection ~ 17650 3600
Wire Wire Line
	19200 4800 19200 4400
Connection ~ 19200 4400
$Comp
L pspice:CAP C8
U 1 1 5EC79AD3
P 20550 4400
F 0 "C8" H 20728 4446 50  0000 L CNN
F 1 "100nF" H 20728 4355 50  0000 L CNN
F 2 "Capacitor_THT:C_Disc_D3.0mm_W2.0mm_P2.50mm" H 20550 4400 50  0001 C CNN
F 3 "~" H 20550 4400 50  0001 C CNN
	1    20550 4400
	0    -1   -1   0   
$EndComp
Wire Wire Line
	20300 4400 19900 4400
$Comp
L power:GNDPWR #PWR0106
U 1 1 5EC7B95C
P 20800 4400
F 0 "#PWR0106" H 20800 4200 50  0001 C CNN
F 1 "GNDPWR" H 20804 4246 50  0000 C CNN
F 2 "" H 20800 4350 50  0001 C CNN
F 3 "" H 20800 4350 50  0001 C CNN
	1    20800 4400
	0    -1   -1   0   
$EndComp
$Comp
L pspice:INDUCTOR L2
U 1 1 5EC8093D
P 17750 4000
F 0 "L2" V 17704 4078 50  0000 L CNN
F 1 "100uH" V 17795 4078 50  0000 L CNN
F 2 "Inductor_THT:L_Axial_L5.3mm_D2.2mm_P2.54mm_Vertical_Vishay_IM-1" H 17750 4000 50  0001 C CNN
F 3 "~" H 17750 4000 50  0001 C CNN
	1    17750 4000
	0    1    1    0   
$EndComp
Wire Wire Line
	17750 3750 17750 3600
Connection ~ 17750 3600
Wire Wire Line
	17750 3600 19200 3600
Wire Wire Line
	17750 4250 17750 4600
$Comp
L pspice:CAP C7
U 1 1 5EC8B731
P 18150 4600
F 0 "C7" H 18328 4646 50  0000 L CNN
F 1 "100nF" H 18100 4600 50  0000 L CNN
F 2 "Capacitor_THT:C_Disc_D3.0mm_W2.0mm_P2.50mm" H 18150 4600 50  0001 C CNN
F 3 "~" H 18150 4600 50  0001 C CNN
	1    18150 4600
	0    -1   -1   0   
$EndComp
Wire Wire Line
	17900 4600 17750 4600
Connection ~ 17750 4600
Wire Wire Line
	17750 4600 17750 4800
$Comp
L power:GNDPWR #PWR0107
U 1 1 5EC8DB9E
P 18400 4800
F 0 "#PWR0107" H 18400 4600 50  0001 C CNN
F 1 "GNDPWR" H 18404 4646 50  0000 C CNN
F 2 "" H 18400 4750 50  0001 C CNN
F 3 "" H 18400 4750 50  0001 C CNN
	1    18400 4800
	1    0    0    -1  
$EndComp
Wire Wire Line
	18400 4600 18400 4800
Wire Wire Line
	17100 3600 17650 3600
$Comp
L Device:Rotary_Encoder_Switch SW3
U 1 1 5EC9B7A8
P 20950 10450
F 0 "SW3" H 20950 10817 50  0000 C CNN
F 1 "Tune" H 20950 10726 50  0000 C CNN
F 2 "USDX_V_1_01:RotaryEncoder_Alps_EC11E-Switch_Vertical_Modified_H20mm" H 20800 10610 50  0001 C CNN
F 3 "~" H 20950 10710 50  0001 C CNN
	1    20950 10450
	0    1    1    0   
$EndComp
Wire Wire Line
	21050 10150 21050 9800
Wire Wire Line
	21050 9800 20750 9800
Wire Wire Line
	20750 9900 20850 9900
Wire Wire Line
	20850 9900 20850 10150
$Comp
L power:GNDPWR #PWR0109
U 1 1 5ECA60F4
P 21900 10550
F 0 "#PWR0109" H 21900 10350 50  0001 C CNN
F 1 "GNDPWR" H 21904 10396 50  0000 C CNN
F 2 "" H 21900 10500 50  0001 C CNN
F 3 "" H 21900 10500 50  0001 C CNN
	1    21900 10550
	1    0    0    -1  
$EndComp
Wire Wire Line
	20950 10150 20950 10050
Wire Wire Line
	20950 10050 21900 10050
Wire Wire Line
	21900 10050 21900 10550
$Comp
L Device:R R18
U 1 1 5ECAB735
P 20850 11050
F 0 "R18" H 20920 11096 50  0000 L CNN
F 1 "10k" H 20920 11005 50  0000 L CNN
F 2 "Resistor_THT:R_Axial_DIN0204_L3.6mm_D1.6mm_P1.90mm_Vertical" V 20780 11050 50  0001 C CNN
F 3 "~" H 20850 11050 50  0001 C CNN
	1    20850 11050
	1    0    0    -1  
$EndComp
$Comp
L power:GNDPWR #PWR0110
U 1 1 5ECB3E6E
P 20850 11200
F 0 "#PWR0110" H 20850 11000 50  0001 C CNN
F 1 "GNDPWR" H 20854 11046 50  0000 C CNN
F 2 "" H 20850 11150 50  0001 C CNN
F 3 "" H 20850 11150 50  0001 C CNN
	1    20850 11200
	1    0    0    -1  
$EndComp
$Comp
L Switch:SW_Push SW1
U 1 1 5ECB4B03
P 19450 11250
F 0 "SW1" V 19404 11398 50  0000 L CNN
F 1 "L_Button" V 19495 11398 50  0000 L CNN
F 2 "Button_Switch_THT:SW_PUSH_6mm" H 19450 11450 50  0001 C CNN
F 3 "~" H 19450 11450 50  0001 C CNN
	1    19450 11250
	0    1    1    0   
$EndComp
$Comp
L Switch:SW_Push SW2
U 1 1 5ECB61E4
P 20000 11250
F 0 "SW2" V 19954 11398 50  0000 L CNN
F 1 "R_Button" V 20045 11398 50  0000 L CNN
F 2 "Button_Switch_THT:SW_PUSH_6mm" H 20000 11450 50  0001 C CNN
F 3 "~" H 20000 11450 50  0001 C CNN
	1    20000 11250
	0    1    1    0   
$EndComp
Wire Wire Line
	19450 11050 19450 10750
Connection ~ 19450 10750
Wire Wire Line
	19450 10750 19300 10750
Wire Wire Line
	20000 11050 20000 10750
Wire Wire Line
	20000 10750 19450 10750
Wire Wire Line
	20000 10750 20850 10750
Wire Wire Line
	20850 10750 20850 10900
Connection ~ 20850 10750
$Comp
L Device:R R17
U 1 1 5ECC47C0
P 20000 11750
F 0 "R17" H 20070 11796 50  0000 L CNN
F 1 "1k" H 20070 11705 50  0000 L CNN
F 2 "Resistor_THT:R_Axial_DIN0204_L3.6mm_D1.6mm_P1.90mm_Vertical" V 19930 11750 50  0001 C CNN
F 3 "~" H 20000 11750 50  0001 C CNN
	1    20000 11750
	1    0    0    -1  
$EndComp
Wire Wire Line
	20000 11450 20000 11600
$Comp
L Device:R R16
U 1 1 5ECC6CA8
P 19450 11750
F 0 "R16" H 19520 11796 50  0000 L CNN
F 1 "3.3k" H 19520 11705 50  0000 L CNN
F 2 "Resistor_THT:R_Axial_DIN0204_L3.6mm_D1.6mm_P1.90mm_Vertical" V 19380 11750 50  0001 C CNN
F 3 "~" H 19450 11750 50  0001 C CNN
	1    19450 11750
	1    0    0    -1  
$EndComp
Wire Wire Line
	19450 11450 19450 11600
Wire Wire Line
	19450 11900 20000 11900
Wire Wire Line
	20000 11900 21050 11900
Wire Wire Line
	21050 11900 21050 10750
$Comp
L power:+5V #PWR0111
U 1 1 5ECCE415
P 21300 11900
F 0 "#PWR0111" H 21300 11750 50  0001 C CNN
F 1 "+5V" V 21315 12028 50  0000 L CNN
F 2 "" H 21300 11900 50  0001 C CNN
F 3 "" H 21300 11900 50  0001 C CNN
	1    21300 11900
	0    1    1    0   
$EndComp
Wire Wire Line
	21300 11900 21050 11900
Connection ~ 21050 11900
$Comp
L power:GNDPWR #PWR0112
U 1 1 5ECD5D08
P 17750 6800
F 0 "#PWR0112" H 17750 6600 50  0001 C CNN
F 1 "GNDPWR" H 17754 6646 50  0000 C CNN
F 2 "" H 17750 6750 50  0001 C CNN
F 3 "" H 17750 6750 50  0001 C CNN
	1    17750 6800
	1    0    0    -1  
$EndComp
Connection ~ 17750 6800
Wire Wire Line
	17150 5400 16250 5400
$Comp
L power:GNDPWR #PWR0113
U 1 1 5ECE6D3B
P 18800 7900
F 0 "#PWR0113" H 18800 7700 50  0001 C CNN
F 1 "GNDPWR" H 18804 7746 50  0000 C CNN
F 2 "" H 18800 7850 50  0001 C CNN
F 3 "" H 18800 7850 50  0001 C CNN
	1    18800 7900
	1    0    0    -1  
$EndComp
$Comp
L Device:CP C9
U 1 1 5ECEECFB
P 18950 8650
F 0 "C9" V 18695 8650 50  0000 C CNN
F 1 "10uF/16V" V 18786 8650 50  0000 C CNN
F 2 "Capacitor_THT:CP_Radial_D4.0mm_P2.00mm" H 18988 8500 50  0001 C CNN
F 3 "~" H 18950 8650 50  0001 C CNN
	1    18950 8650
	0    1    1    0   
$EndComp
$Comp
L Device:R R24
U 1 1 5ECFB0EF
P 16250 5100
F 0 "R24" H 16320 5146 50  0000 L CNN
F 1 "10k" H 16320 5055 50  0000 L CNN
F 2 "Resistor_THT:R_Axial_DIN0204_L3.6mm_D1.6mm_P1.90mm_Vertical" V 16180 5100 50  0001 C CNN
F 3 "~" H 16250 5100 50  0001 C CNN
	1    16250 5100
	1    0    0    -1  
$EndComp
$Comp
L Device:R R19
U 1 1 5ECFBF1C
P 16600 7200
F 0 "R19" H 16670 7246 50  0000 L CNN
F 1 "10k" H 16670 7155 50  0000 L CNN
F 2 "Resistor_THT:R_Axial_DIN0204_L3.6mm_D1.6mm_P1.90mm_Vertical" V 16530 7200 50  0001 C CNN
F 3 "~" H 16600 7200 50  0001 C CNN
	1    16600 7200
	1    0    0    -1  
$EndComp
$Comp
L Device:R R20
U 1 1 5ECFC931
P 16600 6800
F 0 "R20" H 16670 6846 50  0000 L CNN
F 1 "10k" H 16670 6755 50  0000 L CNN
F 2 "Resistor_THT:R_Axial_DIN0204_L3.6mm_D1.6mm_P1.90mm_Vertical" V 16530 6800 50  0001 C CNN
F 3 "~" H 16600 6800 50  0001 C CNN
	1    16600 6800
	1    0    0    -1  
$EndComp
$Comp
L pspice:CAP C11
U 1 1 5ECFD4BE
P 16250 6400
F 0 "C11" H 16428 6446 50  0000 L CNN
F 1 "10nF" H 16428 6355 50  0000 L CNN
F 2 "Capacitor_THT:C_Disc_D3.0mm_W2.0mm_P2.50mm" H 16250 6400 50  0001 C CNN
F 3 "~" H 16250 6400 50  0001 C CNN
	1    16250 6400
	1    0    0    -1  
$EndComp
$Comp
L pspice:CAP C10
U 1 1 5ECFDF8F
P 16500 6000
F 0 "C10" V 16815 6000 50  0000 C CNN
F 1 "100nF" V 16724 6000 50  0000 C CNN
F 2 "Capacitor_THT:C_Disc_D3.0mm_W2.0mm_P2.50mm" H 16500 6000 50  0001 C CNN
F 3 "~" H 16500 6000 50  0001 C CNN
	1    16500 6000
	0    -1   -1   0   
$EndComp
Wire Wire Line
	17150 6000 16750 6000
Wire Wire Line
	16250 6000 16250 6150
Connection ~ 16250 6000
$Comp
L power:GNDPWR #PWR0114
U 1 1 5ED13FED
P 16250 6650
F 0 "#PWR0114" H 16250 6450 50  0001 C CNN
F 1 "GNDPWR" H 16254 6496 50  0000 C CNN
F 2 "" H 16250 6600 50  0001 C CNN
F 3 "" H 16250 6600 50  0001 C CNN
	1    16250 6650
	1    0    0    -1  
$EndComp
Wire Wire Line
	16600 6950 16600 7000
Wire Wire Line
	16600 6650 16600 6600
Wire Wire Line
	16600 6600 17150 6600
Wire Wire Line
	16600 7000 16750 7000
Wire Wire Line
	16750 7000 16750 6000
Connection ~ 16600 7000
Wire Wire Line
	16600 7000 16600 7050
Connection ~ 16750 6000
$Comp
L power:GNDPWR #PWR0115
U 1 1 5ED3F1DD
P 16600 7350
F 0 "#PWR0115" H 16600 7150 50  0001 C CNN
F 1 "GNDPWR" H 16604 7196 50  0000 C CNN
F 2 "" H 16600 7300 50  0001 C CNN
F 3 "" H 16600 7300 50  0001 C CNN
	1    16600 7350
	1    0    0    -1  
$EndComp
Connection ~ 16250 5400
Wire Wire Line
	16250 4950 16250 4850
Wire Wire Line
	16250 4850 16750 4850
Wire Wire Line
	16750 4850 16750 4600
Wire Wire Line
	16750 4600 17750 4600
$Comp
L Device:R R5
U 1 1 5ED63FF2
P 12550 5500
F 0 "R5" H 12350 5550 50  0000 L CNN
F 1 "100" H 12350 5450 50  0000 L CNN
F 2 "Resistor_THT:R_Axial_DIN0204_L3.6mm_D1.6mm_P1.90mm_Vertical" V 12480 5500 50  0001 C CNN
F 3 "~" H 12550 5500 50  0001 C CNN
	1    12550 5500
	0    -1   -1   0   
$EndComp
$Comp
L Device:R R8
U 1 1 5ED64492
P 12550 6550
F 0 "R8" H 12620 6596 50  0000 L CNN
F 1 "100" H 12620 6505 50  0000 L CNN
F 2 "Resistor_THT:R_Axial_DIN0204_L3.6mm_D1.6mm_P1.90mm_Vertical" V 12480 6550 50  0001 C CNN
F 3 "~" H 12550 6550 50  0001 C CNN
	1    12550 6550
	0    -1   -1   0   
$EndComp
$Comp
L Device:R R9
U 1 1 5ED64E22
P 12550 6750
F 0 "R9" H 12400 6800 50  0000 L CNN
F 1 "100" H 12350 6700 50  0000 L CNN
F 2 "Resistor_THT:R_Axial_DIN0204_L3.6mm_D1.6mm_P1.90mm_Vertical" V 12480 6750 50  0001 C CNN
F 3 "~" H 12550 6750 50  0001 C CNN
	1    12550 6750
	0    -1   -1   0   
$EndComp
$Comp
L Device:R R4
U 1 1 5ED65637
P 12550 5300
F 0 "R4" H 12620 5346 50  0000 L CNN
F 1 "100" H 12620 5255 50  0000 L CNN
F 2 "Resistor_THT:R_Axial_DIN0204_L3.6mm_D1.6mm_P1.90mm_Vertical" V 12480 5300 50  0001 C CNN
F 3 "~" H 12550 5300 50  0001 C CNN
	1    12550 5300
	0    -1   -1   0   
$EndComp
Wire Wire Line
	12400 5300 12300 5300
Wire Wire Line
	12000 5300 12000 6000
Wire Wire Line
	12000 6000 11650 6000
Wire Wire Line
	12400 5500 12100 5500
Wire Wire Line
	12100 5500 12100 5900
Wire Wire Line
	12100 5900 11650 5900
Wire Wire Line
	11650 5800 12300 5800
Wire Wire Line
	12300 6750 12400 6750
$Comp
L pspice:CAP C18
U 1 1 5ED9194C
P 11800 4650
F 0 "C18" H 11800 4750 50  0000 L CNN
F 1 "470nF" H 11700 4650 50  0000 L CNN
F 2 "Capacitor_THT:C_Disc_D3.0mm_W2.0mm_P2.50mm" H 11800 4650 50  0001 C CNN
F 3 "~" H 11800 4650 50  0001 C CNN
	1    11800 4650
	1    0    0    -1  
$EndComp
$Comp
L pspice:CAP C17
U 1 1 5ED941EB
P 12300 4650
F 0 "C17" H 12350 4750 50  0000 L CNN
F 1 "470nF" H 12200 4650 50  0000 L CNN
F 2 "Capacitor_THT:C_Disc_D3.0mm_W2.0mm_P2.50mm" H 12300 4650 50  0001 C CNN
F 3 "~" H 12300 4650 50  0001 C CNN
	1    12300 4650
	1    0    0    -1  
$EndComp
$Comp
L pspice:CAP C22
U 1 1 5ED9C269
P 11800 7050
F 0 "C22" H 11550 7150 50  0000 L CNN
F 1 "470nF" H 11750 7050 50  0000 L CNN
F 2 "Capacitor_THT:C_Disc_D3.0mm_W2.0mm_P2.50mm" H 11800 7050 50  0001 C CNN
F 3 "~" H 11800 7050 50  0001 C CNN
	1    11800 7050
	1    0    0    -1  
$EndComp
$Comp
L pspice:CAP C23
U 1 1 5ED9C26F
P 12300 7050
F 0 "C23" H 12150 7150 50  0000 L CNN
F 1 "470nF" H 12250 7050 50  0000 L CNN
F 2 "Capacitor_THT:C_Disc_D3.0mm_W2.0mm_P2.50mm" H 12300 7050 50  0001 C CNN
F 3 "~" H 12300 7050 50  0001 C CNN
	1    12300 7050
	1    0    0    -1  
$EndComp
Wire Wire Line
	12300 6800 12300 6750
Connection ~ 12300 6750
Wire Wire Line
	11800 6800 11800 6550
Wire Wire Line
	11800 6550 12300 6550
Wire Wire Line
	12300 4900 12300 5300
Connection ~ 12300 5300
Wire Wire Line
	12300 5300 12000 5300
Wire Wire Line
	11800 4900 11800 5500
Wire Wire Line
	11800 5500 12100 5500
Connection ~ 12100 5500
$Comp
L power:GNDPWR #PWR0116
U 1 1 5EDC7E80
P 11800 7300
F 0 "#PWR0116" H 11800 7100 50  0001 C CNN
F 1 "GNDPWR" H 11804 7146 50  0000 C CNN
F 2 "" H 11800 7250 50  0001 C CNN
F 3 "" H 11800 7250 50  0001 C CNN
	1    11800 7300
	1    0    0    -1  
$EndComp
$Comp
L power:GNDPWR #PWR0117
U 1 1 5EDC8B62
P 12300 7300
F 0 "#PWR0117" H 12300 7100 50  0001 C CNN
F 1 "GNDPWR" H 12304 7146 50  0000 C CNN
F 2 "" H 12300 7250 50  0001 C CNN
F 3 "" H 12300 7250 50  0001 C CNN
	1    12300 7300
	1    0    0    -1  
$EndComp
$Comp
L Device:R R6
U 1 1 5EDCACB2
P 13000 4800
F 0 "R6" H 13070 4846 50  0000 L CNN
F 1 "82k" H 13070 4755 50  0000 L CNN
F 2 "Resistor_THT:R_Axial_DIN0204_L3.6mm_D1.6mm_P1.90mm_Vertical" V 12930 4800 50  0001 C CNN
F 3 "~" H 13000 4800 50  0001 C CNN
	1    13000 4800
	0    -1   -1   0   
$EndComp
$Comp
L Device:R R7
U 1 1 5EDD13B3
P 13000 6150
F 0 "R7" H 13070 6196 50  0000 L CNN
F 1 "82k" H 13070 6105 50  0000 L CNN
F 2 "Resistor_THT:R_Axial_DIN0204_L3.6mm_D1.6mm_P1.90mm_Vertical" V 12930 6150 50  0001 C CNN
F 3 "~" H 13000 6150 50  0001 C CNN
	1    13000 6150
	0    -1   -1   0   
$EndComp
Wire Wire Line
	12850 6150 12700 6150
Wire Wire Line
	12700 6150 12700 6550
Connection ~ 12700 6550
Wire Wire Line
	13150 6150 13450 6150
Wire Wire Line
	13450 6150 13450 6650
Wire Wire Line
	13150 4800 13500 4800
Wire Wire Line
	13500 4800 13500 5400
Wire Wire Line
	13500 5400 13300 5400
Wire Wire Line
	12850 4800 12700 4800
Wire Wire Line
	12700 4800 12700 5300
Connection ~ 12700 5300
$Comp
L pspice:CAP C15
U 1 1 5EDF39AC
P 13000 4450
F 0 "C15" H 13178 4496 50  0000 L CNN
F 1 "1nF" H 13178 4405 50  0000 L CNN
F 2 "Capacitor_THT:C_Disc_D3.0mm_W2.0mm_P2.50mm" H 13000 4450 50  0001 C CNN
F 3 "~" H 13000 4450 50  0001 C CNN
	1    13000 4450
	0    -1   -1   0   
$EndComp
Wire Wire Line
	12750 4450 12700 4450
Wire Wire Line
	12700 4450 12700 4800
Connection ~ 12700 4800
Wire Wire Line
	13250 4450 13500 4450
Wire Wire Line
	13500 4450 13500 4800
Connection ~ 13500 4800
$Comp
L pspice:CAP C16
U 1 1 5EE0C080
P 13050 5800
F 0 "C16" H 13200 5650 50  0000 L CNN
F 1 "1nF" H 13228 5755 50  0000 L CNN
F 2 "Capacitor_THT:C_Disc_D3.0mm_W2.0mm_P2.50mm" H 13050 5800 50  0001 C CNN
F 3 "~" H 13050 5800 50  0001 C CNN
	1    13050 5800
	0    -1   -1   0   
$EndComp
Wire Wire Line
	13300 5800 13450 5800
Wire Wire Line
	13450 5800 13450 6150
Connection ~ 13450 6150
Wire Wire Line
	12800 5800 12700 5800
Wire Wire Line
	12700 5800 12700 6150
Connection ~ 12700 6150
$Comp
L pspice:CAP C12
U 1 1 5EE244EF
P 14100 5400
F 0 "C12" H 14278 5446 50  0000 L CNN
F 1 "100nF" H 14278 5355 50  0000 L CNN
F 2 "Capacitor_THT:C_Disc_D3.0mm_W2.0mm_P2.50mm" H 14100 5400 50  0001 C CNN
F 3 "~" H 14100 5400 50  0001 C CNN
	1    14100 5400
	0    -1   -1   0   
$EndComp
$Comp
L pspice:CAP C13
U 1 1 5EE34232
P 14100 6650
F 0 "C13" H 14278 6696 50  0000 L CNN
F 1 "100nF" H 14278 6605 50  0000 L CNN
F 2 "Capacitor_THT:C_Disc_D3.0mm_W2.0mm_P2.50mm" H 14100 6650 50  0001 C CNN
F 3 "~" H 14100 6650 50  0001 C CNN
	1    14100 6650
	0    -1   -1   0   
$EndComp
Wire Wire Line
	13850 5400 13500 5400
Connection ~ 13500 5400
Wire Wire Line
	13450 6650 13850 6650
Connection ~ 13450 6650
$Comp
L Device:R R10
U 1 1 5EE4D740
P 14450 5100
F 0 "R10" H 14520 5146 50  0000 L CNN
F 1 "10k" H 14520 5055 50  0000 L CNN
F 2 "Resistor_THT:R_Axial_DIN0204_L3.6mm_D1.6mm_P1.90mm_Vertical" V 14380 5100 50  0001 C CNN
F 3 "~" H 14450 5100 50  0001 C CNN
	1    14450 5100
	-1   0    0    1   
$EndComp
$Comp
L Device:R R11
U 1 1 5EE569A8
P 14450 5650
F 0 "R11" H 14520 5696 50  0000 L CNN
F 1 "10k" H 14520 5605 50  0000 L CNN
F 2 "Resistor_THT:R_Axial_DIN0204_L3.6mm_D1.6mm_P1.90mm_Vertical" V 14380 5650 50  0001 C CNN
F 3 "~" H 14450 5650 50  0001 C CNN
	1    14450 5650
	-1   0    0    1   
$EndComp
Wire Wire Line
	14450 5400 14450 5250
Wire Wire Line
	14450 5400 14450 5500
Connection ~ 14450 5400
$Comp
L Device:R R12
U 1 1 5EE789FD
P 14450 6350
F 0 "R12" H 14520 6396 50  0000 L CNN
F 1 "10k" H 14520 6305 50  0000 L CNN
F 2 "Resistor_THT:R_Axial_DIN0204_L3.6mm_D1.6mm_P1.90mm_Vertical" V 14380 6350 50  0001 C CNN
F 3 "~" H 14450 6350 50  0001 C CNN
	1    14450 6350
	-1   0    0    1   
$EndComp
$Comp
L Device:R R13
U 1 1 5EE78A03
P 14450 6900
F 0 "R13" H 14520 6946 50  0000 L CNN
F 1 "10k" H 14520 6855 50  0000 L CNN
F 2 "Resistor_THT:R_Axial_DIN0204_L3.6mm_D1.6mm_P1.90mm_Vertical" V 14380 6900 50  0001 C CNN
F 3 "~" H 14450 6900 50  0001 C CNN
	1    14450 6900
	-1   0    0    1   
$EndComp
Wire Wire Line
	14450 6650 14450 6500
Wire Wire Line
	14450 6650 14450 6750
Connection ~ 14450 6650
$Comp
L power:GNDPWR #PWR0118
U 1 1 5EE80D0B
P 14450 5800
F 0 "#PWR0118" H 14450 5600 50  0001 C CNN
F 1 "GNDPWR" H 14454 5646 50  0000 C CNN
F 2 "" H 14450 5750 50  0001 C CNN
F 3 "" H 14450 5750 50  0001 C CNN
	1    14450 5800
	1    0    0    -1  
$EndComp
$Comp
L power:GNDPWR #PWR0119
U 1 1 5EE8243C
P 14450 7050
F 0 "#PWR0119" H 14450 6850 50  0001 C CNN
F 1 "GNDPWR" H 14454 6896 50  0000 C CNN
F 2 "" H 14450 7000 50  0001 C CNN
F 3 "" H 14450 7000 50  0001 C CNN
	1    14450 7050
	1    0    0    -1  
$EndComp
Wire Wire Line
	14450 4950 14800 4950
Wire Wire Line
	14500 5400 14450 5400
$Comp
L pspice:CAP C14
U 1 1 5EEAC1D1
P 14800 6850
F 0 "C14" V 14600 6800 50  0000 L CNN
F 1 "100nF" H 14700 6850 50  0000 L CNN
F 2 "Capacitor_THT:C_Disc_D3.0mm_W2.0mm_P2.50mm" H 14800 6850 50  0001 C CNN
F 3 "~" H 14800 6850 50  0001 C CNN
	1    14800 6850
	-1   0    0    1   
$EndComp
$Comp
L power:GNDPWR #PWR0120
U 1 1 5EEBF2BD
P 14800 7100
F 0 "#PWR0120" H 14800 6900 50  0001 C CNN
F 1 "GNDPWR" H 14804 6946 50  0000 C CNN
F 2 "" H 14800 7050 50  0001 C CNN
F 3 "" H 14800 7050 50  0001 C CNN
	1    14800 7100
	1    0    0    -1  
$EndComp
Wire Wire Line
	16850 5600 16850 5700
Wire Wire Line
	16850 5700 17150 5700
Wire Wire Line
	14350 5400 14450 5400
$Comp
L pspice:CAP C24
U 1 1 5ED5C055
P 14450 8200
F 0 "C24" V 14135 8200 50  0000 C CNN
F 1 "10nF" V 14226 8200 50  0000 C CNN
F 2 "Capacitor_THT:C_Disc_D3.0mm_W2.0mm_P2.50mm" H 14450 8200 50  0001 C CNN
F 3 "~" H 14450 8200 50  0001 C CNN
	1    14450 8200
	0    1    1    0   
$EndComp
Wire Wire Line
	11600 9100 12200 9100
$Comp
L pspice:CAP C25
U 1 1 5EE01D56
P 12200 9350
F 0 "C25" H 12378 9396 50  0000 L CNN
F 1 "10nF" H 12378 9305 50  0000 L CNN
F 2 "Capacitor_THT:C_Disc_D3.0mm_W2.0mm_P2.50mm" H 12200 9350 50  0001 C CNN
F 3 "~" H 12200 9350 50  0001 C CNN
	1    12200 9350
	1    0    0    -1  
$EndComp
Wire Wire Line
	11300 9000 10200 9000
Wire Wire Line
	6650 9000 6650 4250
Wire Wire Line
	10650 5400 10850 5400
$Comp
L pspice:CAP C21
U 1 1 5EE148D0
P 9350 4250
F 0 "C21" V 9035 4250 50  0000 C CNN
F 1 "10nF" V 9126 4250 50  0000 C CNN
F 2 "Capacitor_THT:C_Disc_D3.0mm_W2.0mm_P2.50mm" H 9350 4250 50  0001 C CNN
F 3 "~" H 9350 4250 50  0001 C CNN
	1    9350 4250
	0    1    1    0   
$EndComp
$Comp
L Device:R R2
U 1 1 5EE5C72C
P 9850 3850
F 0 "R2" H 9920 3896 50  0000 L CNN
F 1 "1k" H 9920 3805 50  0000 L CNN
F 2 "Resistor_THT:R_Axial_DIN0204_L3.6mm_D1.6mm_P1.90mm_Vertical" V 9780 3850 50  0001 C CNN
F 3 "~" H 9850 3850 50  0001 C CNN
	1    9850 3850
	1    0    0    -1  
$EndComp
$Comp
L Device:R R3
U 1 1 5EE5D426
P 11050 3850
F 0 "R3" H 11120 3896 50  0000 L CNN
F 1 "10k" H 11120 3805 50  0000 L CNN
F 2 "Resistor_THT:R_Axial_DIN0204_L3.6mm_D1.6mm_P1.90mm_Vertical" V 10980 3850 50  0001 C CNN
F 3 "~" H 11050 3850 50  0001 C CNN
	1    11050 3850
	1    0    0    -1  
$EndComp
$Comp
L Device:R R1
U 1 1 5EE5F2E3
P 11050 3450
F 0 "R1" H 11120 3496 50  0000 L CNN
F 1 "10k" H 11120 3405 50  0000 L CNN
F 2 "Resistor_THT:R_Axial_DIN0204_L3.6mm_D1.6mm_P1.90mm_Vertical" V 10980 3450 50  0001 C CNN
F 3 "~" H 11050 3450 50  0001 C CNN
	1    11050 3450
	1    0    0    -1  
$EndComp
Wire Wire Line
	9100 4250 6650 4250
Wire Wire Line
	10650 4250 10650 5400
Wire Wire Line
	9600 4250 9850 4250
Wire Wire Line
	9850 4000 9850 4250
Connection ~ 9850 4250
Wire Wire Line
	9850 4250 10650 4250
Wire Wire Line
	11050 3700 11050 3600
Connection ~ 11050 3700
Wire Wire Line
	9850 3700 10750 3700
$Comp
L pspice:CAP C20
U 1 1 5EF56F71
P 10750 3950
F 0 "C20" H 10550 4050 50  0000 L CNN
F 1 "100nF" H 10600 3950 50  0000 L CNN
F 2 "Capacitor_THT:C_Disc_D3.0mm_W2.0mm_P2.50mm" H 10750 3950 50  0001 C CNN
F 3 "~" H 10750 3950 50  0001 C CNN
	1    10750 3950
	1    0    0    -1  
$EndComp
Connection ~ 10750 3700
Wire Wire Line
	10750 3700 11050 3700
Wire Wire Line
	11050 4000 11050 4200
Wire Wire Line
	11050 4200 10900 4200
$Comp
L power:GNDPWR #PWR0123
U 1 1 5EF7D4DE
P 10900 4400
F 0 "#PWR0123" H 10900 4200 50  0001 C CNN
F 1 "GNDPWR" H 10904 4246 50  0000 C CNN
F 2 "" H 10900 4350 50  0001 C CNN
F 3 "" H 10900 4350 50  0001 C CNN
	1    10900 4400
	1    0    0    -1  
$EndComp
Wire Wire Line
	10900 4400 10900 4200
Connection ~ 10900 4200
Wire Wire Line
	10900 4200 10750 4200
$Comp
L power:GNDPWR #PWR0124
U 1 1 5EF91B7C
P 12200 9600
F 0 "#PWR0124" H 12200 9400 50  0001 C CNN
F 1 "GNDPWR" H 12204 9446 50  0000 C CNN
F 2 "" H 12200 9550 50  0001 C CNN
F 3 "" H 12200 9550 50  0001 C CNN
	1    12200 9600
	1    0    0    -1  
$EndComp
$Comp
L power:GNDPWR #PWR0126
U 1 1 5F04FC1A
P 13700 12150
F 0 "#PWR0126" H 13700 11950 50  0001 C CNN
F 1 "GNDPWR" H 13704 11996 50  0000 C CNN
F 2 "" H 13700 12100 50  0001 C CNN
F 3 "" H 13700 12100 50  0001 C CNN
	1    13700 12150
	1    0    0    -1  
$EndComp
Wire Wire Line
	13700 12150 13700 11400
Connection ~ 14700 10700
Wire Wire Line
	14500 10100 14700 10100
Wire Wire Line
	14550 11300 14700 11300
Wire Wire Line
	14200 10200 13700 10200
Wire Wire Line
	13700 10200 13700 10800
Wire Wire Line
	14250 11400 13700 11400
Connection ~ 13700 11400
Wire Wire Line
	14250 10800 13700 10800
Connection ~ 13700 10800
$Comp
L Connector:Conn_Coaxial J4
U 1 1 5EC9A223
P 7500 11400
F 0 "J4" H 7600 11375 50  0000 L CNN
F 1 "BNC" H 7600 11284 50  0000 L CNN
F 2 "Connector_Coaxial:BNC_Amphenol_B6252HB-NPP3G-50_Horizontal" H 7500 11400 50  0001 C CNN
F 3 " ~" H 7500 11400 50  0001 C CNN
	1    7500 11400
	-1   0    0    -1  
$EndComp
$Comp
L power:GNDPWR #PWR0128
U 1 1 5EC9A22B
P 7500 11900
F 0 "#PWR0128" H 7500 11700 50  0001 C CNN
F 1 "GNDPWR" H 7504 11746 50  0001 C CNN
F 2 "" H 7500 11850 50  0001 C CNN
F 3 "" H 7500 11850 50  0001 C CNN
	1    7500 11900
	-1   0    0    -1  
$EndComp
Wire Wire Line
	7500 11900 7500 11600
$Comp
L power:+5V #PWR0131
U 1 1 5ED015D1
P 8050 7350
F 0 "#PWR0131" H 8050 7200 50  0001 C CNN
F 1 "+5V" H 8065 7523 50  0000 C CNN
F 2 "" H 8050 7350 50  0001 C CNN
F 3 "" H 8050 7350 50  0001 C CNN
	1    8050 7350
	1    0    0    -1  
$EndComp
$Comp
L 74xx:7400 U7
U 1 1 5ED3A73C
P 13300 8300
F 0 "U7" H 13300 8625 50  0000 C CNN
F 1 "74ACT00" H 13300 8534 50  0000 C CNN
F 2 "Package_DIP:DIP-14_W7.62mm_LongPads" H 13300 8300 50  0001 C CNN
F 3 "http://www.ti.com/lit/gpn/sn7400" H 13300 8300 50  0001 C CNN
	1    13300 8300
	1    0    0    -1  
$EndComp
$Comp
L 74xx:7400 U7
U 2 1 5ED3D6BB
P 13900 8200
F 0 "U7" H 13900 8525 50  0000 C CNN
F 1 "74ACT00" H 13900 8434 50  0000 C CNN
F 2 "Package_DIP:DIP-14_W7.62mm_LongPads" H 13900 8200 50  0001 C CNN
F 3 "http://www.ti.com/lit/gpn/sn7400" H 13900 8200 50  0001 C CNN
	2    13900 8200
	1    0    0    -1  
$EndComp
$Comp
L 74xx:7400 U7
U 5 1 5EDC9213
P 8550 7650
F 0 "U7" H 8780 7696 50  0000 L CNN
F 1 "74ACT00" H 8780 7605 50  0000 L CNN
F 2 "Package_DIP:DIP-14_W7.62mm_LongPads" H 8550 7650 50  0001 C CNN
F 3 "http://www.ti.com/lit/gpn/sn7400" H 8550 7650 50  0001 C CNN
	5    8550 7650
	0    -1   -1   0   
$EndComp
$Comp
L power:GNDPWR #PWR0132
U 1 1 5EE1FF46
P 9050 7850
F 0 "#PWR0132" H 9050 7650 50  0001 C CNN
F 1 "GNDPWR" H 9054 7696 50  0000 C CNN
F 2 "" H 9050 7800 50  0001 C CNN
F 3 "" H 9050 7800 50  0001 C CNN
	1    9050 7850
	1    0    0    -1  
$EndComp
$Comp
L Device:R R21
U 1 1 5ECBB69A
P 19900 6000
F 0 "R21" H 19970 6046 50  0000 L CNN
F 1 "1k" H 19970 5955 50  0000 L CNN
F 2 "Resistor_THT:R_Axial_DIN0204_L3.6mm_D1.6mm_P1.90mm_Vertical" V 19830 6000 50  0001 C CNN
F 3 "~" H 19900 6000 50  0001 C CNN
	1    19900 6000
	1    0    0    -1  
$EndComp
Wire Wire Line
	19900 5850 19900 5450
$Comp
L Device:R R23
U 1 1 5EDA2CB0
P 19350 8650
F 0 "R23" V 19143 8650 50  0000 C CNN
F 1 "470" V 19234 8650 50  0000 C CNN
F 2 "Resistor_THT:R_Axial_DIN0204_L3.6mm_D1.6mm_P1.90mm_Vertical" V 19280 8650 50  0001 C CNN
F 3 "~" H 19350 8650 50  0001 C CNN
	1    19350 8650
	0    1    1    0   
$EndComp
$Comp
L power:GNDPWR #PWR0133
U 1 1 5EDC6584
P 18800 8900
F 0 "#PWR0133" H 18800 8700 50  0001 C CNN
F 1 "GNDPWR" H 18804 8746 50  0000 C CNN
F 2 "" H 18800 8850 50  0001 C CNN
F 3 "" H 18800 8850 50  0001 C CNN
	1    18800 8900
	1    0    0    -1  
$EndComp
$Comp
L power:GNDPWR #PWR0134
U 1 1 5EE57EFC
P 11250 6600
F 0 "#PWR0134" H 11250 6400 50  0001 C CNN
F 1 "GNDPWR" H 11254 6446 50  0000 C CNN
F 2 "" H 11250 6550 50  0001 C CNN
F 3 "" H 11250 6550 50  0001 C CNN
	1    11250 6600
	1    0    0    -1  
$EndComp
Wire Wire Line
	11250 6300 11250 6400
Wire Wire Line
	11250 6400 10700 6400
Wire Wire Line
	10700 6400 10700 6100
Wire Wire Line
	10700 6100 10850 6100
Connection ~ 11250 6400
Wire Wire Line
	11250 6400 11250 6600
$Comp
L power:+5V #PWR0135
U 1 1 5EEAFB27
P 11250 4350
F 0 "#PWR0135" H 11250 4200 50  0001 C CNN
F 1 "+5V" H 11265 4523 50  0000 C CNN
F 2 "" H 11250 4350 50  0001 C CNN
F 3 "" H 11250 4350 50  0001 C CNN
	1    11250 4350
	1    0    0    -1  
$EndComp
$Comp
L pspice:CAP C19
U 1 1 5EEE9924
P 11500 4850
F 0 "C19" H 11350 4950 50  0000 L CNN
F 1 "100nF" H 11400 4850 50  0000 L CNN
F 2 "Capacitor_THT:C_Disc_D3.0mm_W2.0mm_P2.50mm" H 11500 4850 50  0001 C CNN
F 3 "~" H 11500 4850 50  0001 C CNN
	1    11500 4850
	1    0    0    -1  
$EndComp
Wire Wire Line
	11250 4350 11250 4600
Wire Wire Line
	11500 4600 11250 4600
Connection ~ 11250 4600
Wire Wire Line
	11250 4600 11250 4850
$Comp
L power:GNDPWR #PWR0136
U 1 1 5EF484E6
P 11500 5100
F 0 "#PWR0136" H 11500 4900 50  0001 C CNN
F 1 "GNDPWR" H 11504 4946 50  0000 C CNN
F 2 "" H 11500 5050 50  0001 C CNN
F 3 "" H 11500 5050 50  0001 C CNN
	1    11500 5100
	1    0    0    -1  
$EndComp
$Comp
L pspice:CAP C28
U 1 1 5F0D3052
P 7800 7650
F 0 "C28" V 7485 7650 50  0000 C CNN
F 1 "100nF" V 7576 7650 50  0000 C CNN
F 2 "Capacitor_THT:C_Disc_D3.0mm_W2.0mm_P2.50mm" H 7800 7650 50  0001 C CNN
F 3 "~" H 7800 7650 50  0001 C CNN
	1    7800 7650
	0    1    1    0   
$EndComp
Wire Wire Line
	8050 7350 8050 7650
Connection ~ 8050 7650
$Comp
L power:GNDPWR #PWR0137
U 1 1 5F16AA32
P 7550 7850
F 0 "#PWR0137" H 7550 7650 50  0001 C CNN
F 1 "GNDPWR" H 7554 7696 50  0000 C CNN
F 2 "" H 7550 7800 50  0001 C CNN
F 3 "" H 7550 7800 50  0001 C CNN
	1    7550 7850
	1    0    0    -1  
$EndComp
Wire Wire Line
	7550 7650 7550 7850
$Comp
L power:GNDPWR #PWR0138
U 1 1 5F1D3868
P 12900 6950
F 0 "#PWR0138" H 12900 6750 50  0001 C CNN
F 1 "GNDPWR" H 12904 6796 50  0000 C CNN
F 2 "" H 12900 6900 50  0001 C CNN
F 3 "" H 12900 6900 50  0001 C CNN
	1    12900 6950
	1    0    0    -1  
$EndComp
$Comp
L power:+12V #PWR0139
U 1 1 5F1D4C1C
P 13750 5850
F 0 "#PWR0139" H 13750 5700 50  0001 C CNN
F 1 "+12V" H 13765 6023 50  0000 C CNN
F 2 "" H 13750 5850 50  0001 C CNN
F 3 "" H 13750 5850 50  0001 C CNN
	1    13750 5850
	1    0    0    -1  
$EndComp
Wire Wire Line
	13750 5850 13750 6350
Wire Wire Line
	13750 6350 12900 6350
$Comp
L pspice:CAP C34
U 1 1 5F1F5480
P 13750 7000
F 0 "C34" H 13928 7046 50  0000 L CNN
F 1 "100nF" H 13928 6955 50  0000 L CNN
F 2 "Capacitor_THT:C_Disc_D3.0mm_W2.0mm_P2.50mm" H 13750 7000 50  0001 C CNN
F 3 "~" H 13750 7000 50  0001 C CNN
	1    13750 7000
	1    0    0    -1  
$EndComp
Wire Wire Line
	13750 6350 13750 6750
Connection ~ 13750 6350
$Comp
L power:GNDPWR #PWR0140
U 1 1 5F2162A6
P 13750 7250
F 0 "#PWR0140" H 13750 7050 50  0001 C CNN
F 1 "GNDPWR" H 13754 7096 50  0000 C CNN
F 2 "" H 13750 7200 50  0001 C CNN
F 3 "" H 13750 7200 50  0001 C CNN
	1    13750 7250
	1    0    0    -1  
$EndComp
$Comp
L Device:R R25
U 1 1 5F219A13
P 10200 9350
F 0 "R25" H 10270 9396 50  0000 L CNN
F 1 "1k" H 10270 9305 50  0000 L CNN
F 2 "Resistor_THT:R_Axial_DIN0204_L3.6mm_D1.6mm_P1.90mm_Vertical" V 10130 9350 50  0001 C CNN
F 3 "~" H 10200 9350 50  0001 C CNN
	1    10200 9350
	1    0    0    -1  
$EndComp
$Comp
L power:GNDPWR #PWR0141
U 1 1 5F21E3B6
P 10200 9700
F 0 "#PWR0141" H 10200 9500 50  0001 C CNN
F 1 "GNDPWR" H 10204 9546 50  0000 C CNN
F 2 "" H 10200 9650 50  0001 C CNN
F 3 "" H 10200 9650 50  0001 C CNN
	1    10200 9700
	1    0    0    -1  
$EndComp
Wire Wire Line
	10200 9500 10200 9700
Wire Wire Line
	10200 9200 10200 9000
Connection ~ 10200 9000
Wire Wire Line
	11650 6100 12050 6100
Wire Wire Line
	12050 6100 12050 6750
Wire Wire Line
	12050 6750 12300 6750
Wire Wire Line
	12300 5800 12300 6550
Connection ~ 12300 6550
Wire Wire Line
	12300 6550 12400 6550
Wire Wire Line
	14700 10700 14700 11300
$Comp
L Amplifier_Operational:LM4562 U4
U 3 1 5ED45FC5
P 13000 6650
F 0 "U4" H 12958 6696 50  0000 L CNN
F 1 "LM4562" H 12958 6605 50  0000 L CNN
F 2 "Package_DIP:DIP-8_W7.62mm_LongPads" H 13000 6650 50  0001 C CNN
F 3 "http://www.ti.com/lit/ds/symlink/lm4562.pdf" H 13000 6650 50  0001 C CNN
	3    13000 6650
	1    0    0    -1  
$EndComp
Wire Wire Line
	13300 6650 13450 6650
$Comp
L dk_Barrel-Audio-Connectors:SJ1-3523N CON1
U 1 1 5ECBD179
P 18400 8750
F 0 "CON1" H 18400 9100 60  0000 C CNN
F 1 "HEADPHONE" H 18400 9000 60  0000 C CNN
F 2 "digikey-footprints:Headphone_Jack_3.5mm_SJ1-3523N" H 18600 8950 60  0001 L CNN
F 3 "https://www.cui.com/product/resource/digikeypdf/sj1-352xn_series.pdf" H 18600 9050 60  0001 L CNN
F 4 "CP1-3523N-ND" H 18600 9150 60  0001 L CNN "Digi-Key_PN"
F 5 "SJ1-3523N" H 18600 9250 60  0001 L CNN "MPN"
F 6 "Connectors, Interconnects" H 18600 9350 60  0001 L CNN "Category"
F 7 "Barrel - Audio Connectors" H 18600 9450 60  0001 L CNN "Family"
F 8 "https://www.cui.com/product/resource/digikeypdf/sj1-352xn_series.pdf" H 18600 9550 60  0001 L CNN "DK_Datasheet_Link"
F 9 "/product-detail/en/cui-inc/SJ1-3523N/CP1-3523N-ND/738689" H 18600 9650 60  0001 L CNN "DK_Detail_Page"
F 10 "CONN JACK STEREO 3.5MM R/A" H 18600 9750 60  0001 L CNN "Description"
F 11 "CUI Inc." H 18600 9850 60  0001 L CNN "Manufacturer"
F 12 "Active" H 18600 9950 60  0001 L CNN "Status"
	1    18400 8750
	1    0    0    -1  
$EndComp
Wire Wire Line
	19200 8650 19100 8650
Wire Wire Line
	18800 8650 18800 8750
Connection ~ 18800 8650
Wire Wire Line
	18800 8850 18800 8900
$Comp
L dk_Barrel-Audio-Connectors:SJ1-3523N CON2
U 1 1 5ED89B3C
P 18400 7800
F 0 "CON2" H 18100 8100 60  0000 C CNN
F 1 "MIC/PTT" H 18458 8081 60  0000 C CNN
F 2 "digikey-footprints:Headphone_Jack_3.5mm_SJ1-3523N" H 18600 8000 60  0001 L CNN
F 3 "https://www.cui.com/product/resource/digikeypdf/sj1-352xn_series.pdf" H 18600 8100 60  0001 L CNN
F 4 "CP1-3523N-ND" H 18600 8200 60  0001 L CNN "Digi-Key_PN"
F 5 "SJ1-3523N" H 18600 8300 60  0001 L CNN "MPN"
F 6 "Connectors, Interconnects" H 18600 8400 60  0001 L CNN "Category"
F 7 "Barrel - Audio Connectors" H 18600 8500 60  0001 L CNN "Family"
F 8 "https://www.cui.com/product/resource/digikeypdf/sj1-352xn_series.pdf" H 18600 8600 60  0001 L CNN "DK_Datasheet_Link"
F 9 "/product-detail/en/cui-inc/SJ1-3523N/CP1-3523N-ND/738689" H 18600 8700 60  0001 L CNN "DK_Detail_Page"
F 10 "CONN JACK STEREO 3.5MM R/A" H 18600 8800 60  0001 L CNN "Description"
F 11 "CUI Inc." H 18600 8900 60  0001 L CNN "Manufacturer"
F 12 "Active" H 18600 9000 60  0001 L CNN "Status"
	1    18400 7800
	1    0    0    -1  
$EndComp
Wire Wire Line
	16250 5250 16250 5400
Wire Wire Line
	16250 5400 16250 6000
Wire Wire Line
	14700 10100 14700 10700
Wire Wire Line
	14550 10700 14700 10700
Wire Wire Line
	14800 4950 14800 6200
Wire Wire Line
	14350 6650 14450 6650
Wire Wire Line
	14450 6650 14500 6650
Wire Wire Line
	14450 6200 14800 6200
Connection ~ 14800 6200
Wire Wire Line
	14800 6200 14800 6600
Wire Wire Line
	16600 6600 16450 6600
Wire Wire Line
	16450 6600 16450 7000
Wire Wire Line
	14850 6200 14800 6200
Connection ~ 16600 6600
$Comp
L 74xx:7400 U7
U 4 1 5EE0F38A
P 8350 8550
F 0 "U7" H 8350 8233 50  0000 C CNN
F 1 "74ACT00" H 8350 8324 50  0000 C CNN
F 2 "Package_DIP:DIP-14_W7.62mm_LongPads" H 8350 8550 50  0001 C CNN
F 3 "http://www.ti.com/lit/gpn/sn7400" H 8350 8550 50  0001 C CNN
	4    8350 8550
	-1   0    0    1   
$EndComp
$Comp
L power:+5V #PWR0144
U 1 1 5EEA02EA
P 8700 8400
F 0 "#PWR0144" H 8700 8250 50  0001 C CNN
F 1 "+5V" H 8715 8573 50  0000 C CNN
F 2 "" H 8700 8400 50  0001 C CNN
F 3 "" H 8700 8400 50  0001 C CNN
	1    8700 8400
	1    0    0    -1  
$EndComp
Wire Wire Line
	8700 8400 8700 8450
Wire Wire Line
	8650 8450 8700 8450
Wire Wire Line
	10850 6000 10500 6000
Wire Wire Line
	10500 6000 10500 4850
Connection ~ 11250 4850
Wire Wire Line
	11250 4850 11250 5100
Wire Wire Line
	11300 9400 11300 9650
Wire Wire Line
	13700 10800 13700 11400
Wire Wire Line
	14200 9800 13300 9800
Wire Wire Line
	13300 9800 13300 10400
Wire Wire Line
	13300 11000 14250 11000
Wire Wire Line
	14250 10400 13300 10400
Connection ~ 13300 10400
Wire Wire Line
	13300 10400 13300 11000
Wire Wire Line
	12650 10400 12900 10400
$Comp
L pspice:CAP C27
U 1 1 5F1B5DC8
P 11300 10100
F 0 "C27" H 11478 10146 50  0000 L CNN
F 1 "10nF" H 11478 10055 50  0000 L CNN
F 2 "Capacitor_THT:C_Disc_D3.0mm_W2.0mm_P2.50mm" H 11300 10100 50  0001 C CNN
F 3 "~" H 11300 10100 50  0001 C CNN
	1    11300 10100
	1    0    0    -1  
$EndComp
$Comp
L power:+12V #PWR0129
U 1 1 5F1E31DB
P 10700 10500
F 0 "#PWR0129" H 10700 10350 50  0001 C CNN
F 1 "+12V" H 10715 10673 50  0000 C CNN
F 2 "" H 10700 10500 50  0001 C CNN
F 3 "" H 10700 10500 50  0001 C CNN
	1    10700 10500
	1    0    0    -1  
$EndComp
$Comp
L power:GNDPWR #PWR0142
U 1 1 5F2F647E
P 8350 10900
F 0 "#PWR0142" H 8350 10700 50  0001 C CNN
F 1 "GNDPWR" H 8354 10746 50  0000 C CNN
F 2 "" H 8350 10850 50  0001 C CNN
F 3 "" H 8350 10850 50  0001 C CNN
	1    8350 10900
	1    0    0    -1  
$EndComp
$Comp
L power:GNDPWR #PWR0143
U 1 1 5F3530D9
P 10800 11650
F 0 "#PWR0143" H 10800 11450 50  0001 C CNN
F 1 "GNDPWR" H 10804 11496 50  0000 C CNN
F 2 "" H 10800 11600 50  0001 C CNN
F 3 "" H 10800 11600 50  0001 C CNN
	1    10800 11650
	1    0    0    -1  
$EndComp
$Comp
L SDR_SSB-rescue:SJ-43514-SMT-SJ-43514-SMT CON3
U 1 1 5F160EF2
P 18250 9850
F 0 "CON3" H 17920 9804 50  0000 R CNN
F 1 "SJ-43514-SMT" H 17920 9895 50  0000 R CNN
F 2 "SJ-43514-SMT:CUI_SJ-43514-SMT" H 18250 9850 50  0001 L BNN
F 3 "CUI" H 18250 9850 50  0001 L BNN
F 4 "0.93 USD" H 18250 9850 50  0001 L BNN "Field4"
F 5 "Unavailable" H 18250 9850 50  0001 L BNN "Field5"
F 6 "None" H 18250 9850 50  0001 L BNN "Field6"
F 7 "SJ-43514-SMT" H 18250 9850 50  0001 L BNN "Field7"
F 8 "4 conductor 3.5 mm Surface Mount Audio Jack" H 18250 9850 50  0001 L BNN "Field8"
	1    18250 9850
	1    0    0    1   
$EndComp
$Comp
L Device:CP C30
U 1 1 5F1F7520
P 18800 9650
F 0 "C30" V 18545 9650 50  0000 C CNN
F 1 "10uF/16V" V 18636 9650 50  0000 C CNN
F 2 "Capacitor_THT:CP_Radial_D4.0mm_P2.00mm" H 18838 9500 50  0001 C CNN
F 3 "~" H 18800 9650 50  0001 C CNN
	1    18800 9650
	0    1    1    0   
$EndComp
$Comp
L Connector:Conn_Coaxial J3
U 1 1 5F35E14E
P 7500 10950
F 0 "J3" H 7428 11188 50  0000 C CNN
F 1 "SMA" H 7428 11097 50  0000 C CNN
F 2 "SMA_EDGE:SMA_Samtec_SMA-J-P-X-ST-EM1_EdgeMount" H 7500 10950 50  0001 C CNN
F 3 " ~" H 7500 10950 50  0001 C CNN
	1    7500 10950
	-1   0    0    -1  
$EndComp
Wire Wire Line
	7700 10950 7700 11150
Connection ~ 7700 11150
Wire Wire Line
	7700 11150 7700 11400
Wire Wire Line
	7700 11150 7950 11150
$Comp
L Connector:TestPoint TP1
U 1 1 5F4F580F
P 12900 10400
F 0 "TP1" H 12958 10518 50  0000 L CNN
F 1 " " H 12958 10427 50  0000 L CNN
F 2 "TestPoint:TestPoint_THTPad_1.0x1.0mm_Drill0.5mm" H 13100 10400 50  0001 C CNN
F 3 "~" H 13100 10400 50  0001 C CNN
	1    12900 10400
	1    0    0    -1  
$EndComp
$Comp
L Connector:TestPoint TP2
U 1 1 5F4F7092
P 7950 11150
F 0 "TP2" H 8008 11268 50  0000 L CNN
F 1 " " H 8008 11177 50  0000 L CNN
F 2 "TestPoint:TestPoint_THTPad_1.0x1.0mm_Drill0.5mm" H 8150 11150 50  0001 C CNN
F 3 "~" H 8150 11150 50  0001 C CNN
	1    7950 11150
	1    0    0    -1  
$EndComp
$Comp
L Connector:TestPoint TP3
U 1 1 5F4F88C4
P 11300 9650
F 0 "TP3" V 11254 9838 50  0000 L CNN
F 1 " " V 11345 9838 50  0000 L CNN
F 2 "TestPoint:TestPoint_THTPad_1.0x1.0mm_Drill0.5mm" H 11500 9650 50  0001 C CNN
F 3 "~" H 11500 9650 50  0001 C CNN
	1    11300 9650
	0    1    1    0   
$EndComp
Connection ~ 11300 9650
Wire Wire Line
	11300 9650 11300 9850
$Comp
L Connector:TestPoint TP4
U 1 1 5F4F9DD6
P 10200 9000
F 0 "TP4" H 10258 9118 50  0000 L CNN
F 1 " " H 10258 9027 50  0000 L CNN
F 2 "TestPoint:TestPoint_THTPad_1.0x1.0mm_Drill0.5mm" H 10400 9000 50  0001 C CNN
F 3 "~" H 10400 9000 50  0001 C CNN
	1    10200 9000
	1    0    0    -1  
$EndComp
$Comp
L Connector:TestPoint TP5
U 1 1 5F4FC65B
P 14700 8200
F 0 "TP5" H 14758 8318 50  0000 L CNN
F 1 " " H 14758 8227 50  0000 L CNN
F 2 "TestPoint:TestPoint_THTPad_1.0x1.0mm_Drill0.5mm" H 14900 8200 50  0001 C CNN
F 3 "~" H 14900 8200 50  0001 C CNN
	1    14700 8200
	1    0    0    -1  
$EndComp
Wire Wire Line
	10500 4850 11250 4850
Wire Wire Line
	10650 11400 10800 11400
Wire Wire Line
	10800 11400 10800 11650
Wire Wire Line
	10700 10500 10700 10550
Wire Wire Line
	10700 10550 10650 10550
Wire Wire Line
	11300 10350 11300 11100
Wire Wire Line
	11300 11100 10650 11100
Wire Wire Line
	8400 10600 8350 10600
Wire Wire Line
	8350 10850 8400 10850
Wire Wire Line
	8400 11150 8350 11150
Connection ~ 7950 11150
Wire Wire Line
	8350 11150 8350 11400
Wire Wire Line
	8350 11400 8400 11400
Connection ~ 8350 11150
$Comp
L uSDX~LPF~BAND~Module:uSDX_LPF_BAND_MODULE U9
U 1 1 5F571AB1
P 9550 11000
F 0 "U9" H 9525 11675 50  0000 C CNN
F 1 "uSDX_LPF_BAND_MODULE" H 9525 11584 50  0000 C CNN
F 2 "uSDX_LPF_BAND_MODULE:uSDX_LPF_Band_Module" H 9550 11200 50  0001 C CNN
F 3 "" H 9550 11200 50  0001 C CNN
	1    9550 11000
	1    0    0    -1  
$EndComp
$Comp
L power:GNDPWR #PWR0147
U 1 1 5F181521
P 7500 11150
F 0 "#PWR0147" H 7500 10950 50  0001 C CNN
F 1 "GNDPWR" H 7504 10996 50  0001 C CNN
F 2 "" H 7500 11100 50  0001 C CNN
F 3 "" H 7500 11100 50  0001 C CNN
	1    7500 11150
	-1   0    0    -1  
$EndComp
$Comp
L power:GNDPWR #PWR0125
U 1 1 5F03A816
P 15400 10100
F 0 "#PWR0125" H 15400 9900 50  0001 C CNN
F 1 "GNDPWR" H 15404 9946 50  0000 C CNN
F 2 "" H 15400 10050 50  0001 C CNN
F 3 "" H 15400 10050 50  0001 C CNN
	1    15400 10100
	1    0    0    -1  
$EndComp
Wire Wire Line
	15400 9600 15500 9600
Connection ~ 15400 9600
$Comp
L Device:R R15
U 1 1 5EFC2888
P 15650 9600
F 0 "R15" H 15720 9646 50  0000 L CNN
F 1 "10k" H 15720 9555 50  0000 L CNN
F 2 "Resistor_THT:R_Axial_DIN0204_L3.6mm_D1.6mm_P1.90mm_Vertical" V 15580 9600 50  0001 C CNN
F 3 "~" H 15650 9600 50  0001 C CNN
	1    15650 9600
	0    -1   -1   0   
$EndComp
$Comp
L Device:R R14
U 1 1 5EFC1BD8
P 15150 9600
F 0 "R14" H 15220 9646 50  0000 L CNN
F 1 "10k" H 15220 9555 50  0000 L CNN
F 2 "Resistor_THT:R_Axial_DIN0204_L3.6mm_D1.6mm_P1.90mm_Vertical" V 15080 9600 50  0001 C CNN
F 3 "~" H 15150 9600 50  0001 C CNN
	1    15150 9600
	0    -1   -1   0   
$EndComp
$Comp
L pspice:CAP C26
U 1 1 5EFC0DAE
P 15400 9850
F 0 "C26" H 15578 9896 50  0000 L CNN
F 1 "10nF" H 15578 9805 50  0000 L CNN
F 2 "Capacitor_THT:C_Disc_D3.0mm_W2.0mm_P2.50mm" H 15400 9850 50  0001 C CNN
F 3 "~" H 15400 9850 50  0001 C CNN
	1    15400 9850
	1    0    0    -1  
$EndComp
$Comp
L dk_Transistors-FETs-MOSFETs-Single:BS170 Q2
U 1 1 5EC14C89
P 14200 10000
F 0 "Q2" H 14308 10053 60  0000 L CNN
F 1 "BS170" H 14308 9947 60  0000 L CNN
F 2 "Package_TO_SOT_THT:TO-92L_HandSolder" H 14400 10200 60  0001 L CNN
F 3 "https://www.onsemi.com/pub/Collateral/BS170-D.PDF" H 14400 10300 60  0001 L CNN
F 4 "BS170-ND" H 14400 10400 60  0001 L CNN "Digi-Key_PN"
F 5 "BS170" H 14400 10500 60  0001 L CNN "MPN"
F 6 "Discrete Semiconductor Products" H 14400 10600 60  0001 L CNN "Category"
F 7 "Transistors - FETs, MOSFETs - Single" H 14400 10700 60  0001 L CNN "Family"
F 8 "https://www.onsemi.com/pub/Collateral/BS170-D.PDF" H 14400 10800 60  0001 L CNN "DK_Datasheet_Link"
F 9 "/product-detail/en/on-semiconductor/BS170/BS170-ND/244280" H 14400 10900 60  0001 L CNN "DK_Detail_Page"
F 10 "MOSFET N-CH 60V 500MA TO-92" H 14400 11000 60  0001 L CNN "Description"
F 11 "ON Semiconductor" H 14400 11100 60  0001 L CNN "Manufacturer"
F 12 "Active" H 14400 11200 60  0001 L CNN "Status"
	1    14200 10000
	-1   0    0    -1  
$EndComp
$Comp
L dk_Transistors-FETs-MOSFETs-Single:BS170 Q5
U 1 1 5F1D04BD
P 14700 9500
F 0 "Q5" H 14808 9553 60  0000 L CNN
F 1 "BS170" H 14808 9447 60  0000 L CNN
F 2 "Package_TO_SOT_THT:TO-92L_HandSolder" H 14900 9700 60  0001 L CNN
F 3 "https://www.onsemi.com/pub/Collateral/BS170-D.PDF" H 14900 9800 60  0001 L CNN
F 4 "BS170-ND" H 14900 9900 60  0001 L CNN "Digi-Key_PN"
F 5 "BS170" H 14900 10000 60  0001 L CNN "MPN"
F 6 "Discrete Semiconductor Products" H 14900 10100 60  0001 L CNN "Category"
F 7 "Transistors - FETs, MOSFETs - Single" H 14900 10200 60  0001 L CNN "Family"
F 8 "https://www.onsemi.com/pub/Collateral/BS170-D.PDF" H 14900 10300 60  0001 L CNN "DK_Datasheet_Link"
F 9 "/product-detail/en/on-semiconductor/BS170/BS170-ND/244280" H 14900 10400 60  0001 L CNN "DK_Detail_Page"
F 10 "MOSFET N-CH 60V 500MA TO-92" H 14900 10500 60  0001 L CNN "Description"
F 11 "ON Semiconductor" H 14900 10600 60  0001 L CNN "Manufacturer"
F 12 "Active" H 14900 10700 60  0001 L CNN "Status"
	1    14700 9500
	-1   0    0    -1  
$EndComp
Wire Wire Line
	14700 9700 14700 10100
Connection ~ 14700 10100
Wire Wire Line
	14700 8200 14700 9300
Wire Wire Line
	15300 9600 15400 9600
$Comp
L Connector:TestPoint TP6
U 1 1 5F44E2D3
P 14900 11150
F 0 "TP6" H 14958 11268 50  0000 L CNN
F 1 " " H 14958 11177 50  0000 L CNN
F 2 "TestPoint:TestPoint_THTPad_1.0x1.0mm_Drill0.5mm" H 15100 11150 50  0001 C CNN
F 3 "~" H 15100 11150 50  0001 C CNN
	1    14900 11150
	1    0    0    -1  
$EndComp
Wire Wire Line
	14900 11150 14900 11300
Wire Wire Line
	14900 11300 14700 11300
Connection ~ 14700 11300
$Comp
L Device:R R28
U 1 1 5F36687A
P 14700 11750
F 0 "R28" H 14770 11796 50  0000 L CNN
F 1 "100k" H 14770 11705 50  0000 L CNN
F 2 "Resistor_THT:R_Axial_DIN0204_L3.6mm_D1.6mm_P1.90mm_Vertical" V 14630 11750 50  0001 C CNN
F 3 "~" H 14700 11750 50  0001 C CNN
	1    14700 11750
	1    0    0    -1  
$EndComp
Wire Wire Line
	14700 11600 14700 11300
$Comp
L power:GNDPWR #PWR0102
U 1 1 5F39E807
P 14700 12150
F 0 "#PWR0102" H 14700 11950 50  0001 C CNN
F 1 "GNDPWR" H 14704 11996 50  0000 C CNN
F 2 "" H 14700 12100 50  0001 C CNN
F 3 "" H 14700 12100 50  0001 C CNN
	1    14700 12150
	1    0    0    -1  
$EndComp
Wire Wire Line
	14700 11900 14700 12150
$Sheet
S 2150 7350 1550 1250
U 5F77FAA5
F0 "Si5351" 50
F1 "usdx_si5351.sch" 50
$EndSheet
Text GLabel 10850 5700 0    50   Input ~ 0
SI5351_0
Text GLabel 10850 5800 0    50   Input ~ 0
SI5351_1
Text GLabel 13000 8400 0    50   Input ~ 0
SI5351_2
$Sheet
S 4650 7600 1400 1100
U 5FA0DDC5
F0 "Power" 50
F1 "usdx_power.sch" 50
$EndSheet
$Comp
L power:+12V #PWR?
U 1 1 5FA327B6
P 20300 5500
F 0 "#PWR?" H 20300 5350 50  0001 C CNN
F 1 "+12V" H 20315 5673 50  0000 C CNN
F 2 "" H 20300 5500 50  0001 C CNN
F 3 "" H 20300 5500 50  0001 C CNN
	1    20300 5500
	1    0    0    -1  
$EndComp
Wire Wire Line
	11800 4400 12050 4400
$Comp
L power:GNDPWR #PWR?
U 1 1 5FA779C7
P 12050 4400
F 0 "#PWR?" H 12050 4200 50  0001 C CNN
F 1 "GNDPWR" H 12054 4246 50  0000 C CNN
F 2 "" H 12050 4350 50  0001 C CNN
F 3 "" H 12050 4350 50  0001 C CNN
	1    12050 4400
	1    0    0    -1  
$EndComp
Connection ~ 12050 4400
Wire Wire Line
	12050 4400 12300 4400
$Comp
L power:+5V #PWR?
U 1 1 5FA9BFCC
P 11050 3300
F 0 "#PWR?" H 11050 3150 50  0001 C CNN
F 1 "+5V" H 11065 3473 50  0000 C CNN
F 2 "" H 11050 3300 50  0001 C CNN
F 3 "" H 11050 3300 50  0001 C CNN
	1    11050 3300
	1    0    0    -1  
$EndComp
$Comp
L pspice:INDUCTOR L1
U 1 1 5EC47B98
P 16100 3600
F 0 "L1" H 16100 3815 50  0000 C CNN
F 1 "100uH" H 16100 3724 50  0000 C CNN
F 2 "Inductor_THT:L_Axial_L5.3mm_D2.2mm_P2.54mm_Vertical_Vishay_IM-1" H 16100 3600 50  0001 C CNN
F 3 "~" H 16100 3600 50  0001 C CNN
	1    16100 3600
	1    0    0    -1  
$EndComp
$Comp
L power:+5V #PWR?
U 1 1 5FB49F9F
P 15750 3600
F 0 "#PWR?" H 15750 3450 50  0001 C CNN
F 1 "+5V" H 15765 3773 50  0000 C CNN
F 2 "" H 15750 3600 50  0001 C CNN
F 3 "" H 15750 3600 50  0001 C CNN
	1    15750 3600
	1    0    0    -1  
$EndComp
Wire Wire Line
	15750 3600 15850 3600
Text GLabel 12550 9100 2    50   Input ~ 0
RX_EN
Wire Wire Line
	12200 9100 12550 9100
Connection ~ 12200 9100
Text GLabel 12350 8100 0    50   Input ~ 0
RX_EN
Text GLabel 17150 5000 0    50   Output ~ 0
RX_EN
NoConn ~ 8050 8550
Text GLabel 17150 6300 0    50   Output ~ 0
I2C_SCL
Text GLabel 17150 6200 0    50   Output ~ 0
I2C_SDA
Text GLabel 14850 6200 2    50   Input ~ 0
AREF
Text GLabel 17950 5300 2    50   Input ~ 0
ROT_A
Text GLabel 17950 5400 2    50   Input ~ 0
ROT_B
Text GLabel 20750 9800 0    50   Output ~ 0
ROT_A
Text GLabel 20750 9900 0    50   Output ~ 0
ROT_B
Text GLabel 17150 6100 0    50   Input ~ 0
SWITCH
Text GLabel 19300 10750 0    50   Output ~ 0
SWITCH
Connection ~ 20000 10750
Connection ~ 20000 11900
Text GLabel 18800 5000 0    50   Input ~ 0
I2C_SDA
Text GLabel 14500 5400 2    50   Output ~ 0
PC0
Text GLabel 14500 6650 2    50   Output ~ 0
PC1
Text GLabel 17150 5800 0    50   Input ~ 0
PC0
Text GLabel 17150 5900 0    50   Input ~ 0
PC1
Text GLabel 18800 7800 2    50   Output ~ 0
PB4
Text GLabel 18800 7700 2    50   Output ~ 0
PB5
Text GLabel 19500 8650 2    50   Input ~ 0
PB1
$Comp
L power:GNDPWR #PWR?
U 1 1 5FEEED64
P 18700 10050
F 0 "#PWR?" H 18700 9850 50  0001 C CNN
F 1 "GNDPWR" H 18704 9896 50  0000 C CNN
F 2 "" H 18700 10000 50  0001 C CNN
F 3 "" H 18700 10000 50  0001 C CNN
	1    18700 10050
	1    0    0    -1  
$EndComp
Wire Wire Line
	18650 10050 18700 10050
Text GLabel 18650 9950 2    50   Output ~ 0
PB5
Text GLabel 18650 9850 2    50   Output ~ 0
PB4
Text GLabel 18950 9650 2    50   Input ~ 0
PB1
Text GLabel 18800 6000 0    50   Input ~ 0
PD3
Text GLabel 18800 5200 0    50   Input ~ 0
PD4
Text GLabel 18800 5900 0    50   Input ~ 0
PD2
Text GLabel 18800 5800 0    50   Input ~ 0
PD1
Text GLabel 18800 5700 0    50   Input ~ 0
PD0
Text GLabel 17950 6000 2    50   Output ~ 0
PD0
Text GLabel 17950 5900 2    50   Output ~ 0
PD1
Text GLabel 17950 5800 2    50   Output ~ 0
PD2
Text GLabel 17950 5700 2    50   Output ~ 0
PD3
Text GLabel 17950 5600 2    50   Output ~ 0
PD4
Text GLabel 15800 9600 2    50   Output ~ 0
PB2
Text GLabel 17950 5500 2    50   Output ~ 0
PD4
Text GLabel 17150 5200 0    50   Output ~ 0
PB2
Text GLabel 17150 5100 0    50   Output ~ 0
PB1
NoConn ~ 17150 5300
NoConn ~ 17150 6400
NoConn ~ 18800 5300
NoConn ~ 18800 5400
NoConn ~ 18800 5500
NoConn ~ 18800 5600
Text GLabel 14850 6200 2    50   Input ~ 0
AREF
Wire Wire Line
	6650 9000 10200 9000
Connection ~ 8350 10850
Wire Wire Line
	8350 10850 8350 10900
Wire Wire Line
	8350 10600 8350 10850
Wire Wire Line
	8350 11150 7950 11150
Wire Wire Line
	13600 8100 13600 8300
Connection ~ 13600 8300
$Comp
L 74xx:7400 U7
U 3 1 5ED4FC70
P 12700 8200
F 0 "U7" H 12700 8500 50  0000 C CNN
F 1 "74ACT00" H 12700 8400 50  0000 C CNN
F 2 "Package_DIP:DIP-14_W7.62mm_LongPads" H 12700 8200 50  0001 C CNN
F 3 "http://www.ti.com/lit/gpn/sn7400" H 12700 8200 50  0001 C CNN
	3    12700 8200
	1    0    0    -1  
$EndComp
Wire Wire Line
	12350 8100 12400 8100
Wire Wire Line
	12400 8100 12400 8300
Connection ~ 12400 8100
Connection ~ 8650 8450
Wire Wire Line
	8650 8450 8650 8650
Wire Wire Line
	9050 7650 9050 7850
Wire Wire Line
	19900 5150 19900 4400
Connection ~ 19900 4400
Wire Wire Line
	19900 4400 19200 4400
Connection ~ 19650 6250
Connection ~ 14700 8200
Text GLabel 10750 11000 2    50   Input ~ 0
FILTER_RX
Text GLabel 10650 10850 2    50   Input ~ 0
FILTER_TX
Text GLabel 12650 10400 0    50   Output ~ 0
FILTER_TX
Connection ~ 12900 10400
Wire Wire Line
	12900 10400 13300 10400
$EndSCHEMATC
