Manufacturer Part Number,Manufacturer,Digi-Key Part Number,Reference Designator,Quantity,Description
NHD-C0216AZ-FSW-GBW,Newhaven Display Intl,NHD-C0216AZ-FSW-GBW-ND,U1,1,LCD MOD 32DIG 16X2 TRANSFLCT WHT
RNMF14FTC3K30,Stackpole Electronics Inc,S3.3KCACT-ND,R1,1,RES 3.3K OHM 1/4W 1% AXIAL
C320C104J5R5TA7301,KEMET,399-9867-1-ND,C1,1,CAP CER 0.1UF 50V X7R RADIAL
PT10LV10-222A2020-PM-S,Amphenol Piher Sensing Systems,1993-1083-ND,RV1,1,POT 2.2K OHM LINEAR
PPTC161LFBN-RC,Sullins Connector Solutions,S7014-ND,J1,1,CONN HDR 16POS 0.1 TIN PCB
1301.9306,Schurter Inc.,486-3461-ND,"SW1,SW2",2,SWITCH TACTILE SPST-NO 0.05A 12V
PEC11R-4015F-S0024,Bourns Inc.,PEC11R-4015F-S0024-ND,SW3,1,ROTARY ENCODER MECHANICAL 24PPR
RNF14FTD1K00,Stackpole Electronics Inc,RNF14FTD1K00CT-ND,"R2,R4",2,RES 1K OHM 1/4W 1% AXIAL
RNF14FTD10K0,Stackpole Electronics Inc,RNF14FTD10K0CT-ND,R3,1,RES 10K OHM 1/4W 1% AXIAL
COM-10002,SparkFun Electronics,1568-1601-ND,SW3,1,"KNOB KNURLED 0.236"" METAL"
