EESchema Schematic File Version 4
EELAYER 30 0
EELAYER END
$Descr A4 11693 8268
encoding utf-8
Sheet 4 4
Title ""
Date ""
Rev ""
Comp ""
Comment1 ""
Comment2 ""
Comment3 ""
Comment4 ""
$EndDescr
Text GLabel 4400 3950 0    50   BiDi ~ 0
USB2_M
Text GLabel 4400 3850 0    50   BiDi ~ 0
USB1_P
Wire Wire Line
	6450 3650 6450 3600
$Comp
L Device:R R?
U 1 1 5F8C1450
P 6450 3450
F 0 "R?" H 6300 3500 50  0000 C CNN
F 1 "330" H 6300 3400 50  0000 C CNN
F 2 "" V 6380 3450 50  0001 C CNN
F 3 "~" H 6450 3450 50  0001 C CNN
	1    6450 3450
	1    0    0    -1  
$EndComp
$Comp
L Device:LED D?
U 1 1 5F816857
P 6450 3800
F 0 "D?" V 6500 3950 50  0000 C CNN
F 1 "LED" V 6400 3950 50  0000 C CNN
F 2 "" H 6450 3800 50  0001 C CNN
F 3 "~" H 6450 3800 50  0001 C CNN
	1    6450 3800
	0    -1   -1   0   
$EndComp
Text GLabel 3450 6200 0    50   Input ~ 0
MIC_IN
$Comp
L Device:C C?
U 1 1 5F97ED7B
P 3750 5600
F 0 "C?" H 3800 5700 50  0000 C CNN
F 1 "C" H 3800 5500 50  0000 C CNN
F 2 "" H 3788 5450 50  0001 C CNN
F 3 "~" H 3750 5600 50  0001 C CNN
	1    3750 5600
	1    0    0    -1  
$EndComp
$Comp
L Device:Ferrite_Bead FB?
U 1 1 5F986D27
P 3750 6000
F 0 "FB?" H 3887 6046 50  0000 L CNN
F 1 "Ferrite_Bead" H 3887 5955 50  0000 L CNN
F 2 "" V 3680 6000 50  0001 C CNN
F 3 "~" H 3750 6000 50  0001 C CNN
	1    3750 6000
	-1   0    0    -1  
$EndComp
$Comp
L Device:R R?
U 1 1 5F98D728
P 4000 5800
F 0 "R?" V 4100 5750 50  0000 L CNN
F 1 "1.5k" V 3900 5700 50  0000 L CNN
F 2 "" V 3930 5800 50  0001 C CNN
F 3 "~" H 4000 5800 50  0001 C CNN
	1    4000 5800
	0    1    -1   0   
$EndComp
$Comp
L Device:R R?
U 1 1 5F98DBD1
P 4250 5550
F 0 "R?" H 4320 5596 50  0000 L CNN
F 1 "2.2k" H 4320 5505 50  0000 L CNN
F 2 "" V 4180 5550 50  0001 C CNN
F 3 "~" H 4250 5550 50  0001 C CNN
	1    4250 5550
	1    0    0    -1  
$EndComp
$Comp
L Device:C C?
U 1 1 5F9A0E22
P 4250 6400
F 0 "C?" H 4365 6446 50  0000 L CNN
F 1 "C" H 4365 6355 50  0000 L CNN
F 2 "" H 4288 6250 50  0001 C CNN
F 3 "~" H 4250 6400 50  0001 C CNN
	1    4250 6400
	-1   0    0    -1  
$EndComp
$Comp
L power:GND #PWR?
U 1 1 5F9A4473
P 4250 6550
F 0 "#PWR?" H 4250 6300 50  0001 C CNN
F 1 "GND" H 4255 6377 50  0000 C CNN
F 2 "" H 4250 6550 50  0001 C CNN
F 3 "" H 4250 6550 50  0001 C CNN
	1    4250 6550
	-1   0    0    -1  
$EndComp
$Comp
L Device:C C?
U 1 1 5F9A73F0
P 3750 6400
F 0 "C?" H 3865 6446 50  0000 L CNN
F 1 "C" H 3865 6355 50  0000 L CNN
F 2 "" H 3788 6250 50  0001 C CNN
F 3 "~" H 3750 6400 50  0001 C CNN
	1    3750 6400
	-1   0    0    -1  
$EndComp
$Comp
L power:GND #PWR?
U 1 1 5F9A73F6
P 3750 6550
F 0 "#PWR?" H 3750 6300 50  0001 C CNN
F 1 "GND" H 3755 6377 50  0000 C CNN
F 2 "" H 3750 6550 50  0001 C CNN
F 3 "" H 3750 6550 50  0001 C CNN
	1    3750 6550
	-1   0    0    -1  
$EndComp
Wire Wire Line
	3750 6150 3750 6200
Wire Wire Line
	3450 6200 3750 6200
Connection ~ 3750 6200
Wire Wire Line
	3750 6200 3750 6250
Wire Wire Line
	3750 5750 3750 5800
Wire Wire Line
	4250 5700 4250 5800
Wire Wire Line
	3850 5800 3750 5800
Connection ~ 3750 5800
Wire Wire Line
	3750 5800 3750 5850
Wire Wire Line
	4150 5800 4250 5800
Connection ~ 4250 5800
Wire Wire Line
	4250 5800 4250 6250
Text GLabel 8050 2350 2    50   Output ~ 0
L_OUT
Text GLabel 8050 2550 2    50   Output ~ 0
R_OUT
$Comp
L Device:R R?
U 1 1 5FA18886
P 6050 2850
F 0 "R?" H 6120 2896 50  0000 L CNN
F 1 "4.7k" H 6120 2805 50  0000 L CNN
F 2 "" V 5980 2850 50  0001 C CNN
F 3 "~" H 6050 2850 50  0001 C CNN
	1    6050 2850
	1    0    0    -1  
$EndComp
$Comp
L Device:R R?
U 1 1 5FA1905B
P 6350 2850
F 0 "R?" H 6420 2896 50  0000 L CNN
F 1 "4.7k" H 6420 2805 50  0000 L CNN
F 2 "" V 6280 2850 50  0001 C CNN
F 3 "~" H 6350 2850 50  0001 C CNN
	1    6350 2850
	1    0    0    -1  
$EndComp
Wire Wire Line
	6050 2550 6050 2700
Wire Wire Line
	6350 2350 6350 2700
$Comp
L Device:C C?
U 1 1 5FA27F07
P 6650 2350
F 0 "C?" V 6600 2450 50  0000 C CNN
F 1 "100u" V 6600 2200 50  0000 C CNN
F 2 "" H 6688 2200 50  0001 C CNN
F 3 "~" H 6650 2350 50  0001 C CNN
	1    6650 2350
	0    1    1    0   
$EndComp
$Comp
L Device:C C?
U 1 1 5FA2BF5B
P 6650 2550
F 0 "C?" V 6600 2650 50  0000 C CNN
F 1 "100u" V 6600 2400 50  0000 C CNN
F 2 "" H 6688 2400 50  0001 C CNN
F 3 "~" H 6650 2550 50  0001 C CNN
	1    6650 2550
	0    1    1    0   
$EndComp
Wire Wire Line
	6350 2350 6500 2350
Wire Wire Line
	6050 2550 6500 2550
Connection ~ 6050 2550
$Comp
L Device:R R?
U 1 1 5FA3352C
P 6850 2850
F 0 "R?" H 6920 2896 50  0000 L CNN
F 1 "47k" H 6920 2805 50  0000 L CNN
F 2 "" V 6780 2850 50  0001 C CNN
F 3 "~" H 6850 2850 50  0001 C CNN
	1    6850 2850
	1    0    0    -1  
$EndComp
$Comp
L Device:R R?
U 1 1 5FA33C82
P 7150 2850
F 0 "R?" H 7220 2896 50  0000 L CNN
F 1 "47k" H 7220 2805 50  0000 L CNN
F 2 "" V 7080 2850 50  0001 C CNN
F 3 "~" H 7150 2850 50  0001 C CNN
	1    7150 2850
	1    0    0    -1  
$EndComp
Wire Wire Line
	6800 2350 7150 2350
Wire Wire Line
	7150 2350 7150 2700
Wire Wire Line
	6800 2550 6850 2550
Wire Wire Line
	6850 2550 6850 2700
$Comp
L Device:Ferrite_Bead FB?
U 1 1 5FA3ABCE
P 7350 2350
F 0 "FB?" V 7300 2500 50  0000 C CNN
F 1 "Ferrite_Bead" V 7167 2350 50  0001 C CNN
F 2 "" V 7280 2350 50  0001 C CNN
F 3 "~" H 7350 2350 50  0001 C CNN
	1    7350 2350
	0    1    1    0   
$EndComp
$Comp
L Device:Ferrite_Bead FB?
U 1 1 5FA3B668
P 7350 2550
F 0 "FB?" V 7300 2700 50  0000 C CNN
F 1 "Ferrite_Bead" V 7167 2550 50  0001 C CNN
F 2 "" V 7280 2550 50  0001 C CNN
F 3 "~" H 7350 2550 50  0001 C CNN
	1    7350 2550
	0    1    1    0   
$EndComp
Wire Wire Line
	6850 2550 7200 2550
Connection ~ 6850 2550
Wire Wire Line
	7150 2350 7200 2350
Connection ~ 7150 2350
$Comp
L Device:C C?
U 1 1 5FA42FFF
P 7600 2850
F 0 "C?" H 7715 2896 50  0000 L CNN
F 1 "C" H 7715 2805 50  0000 L CNN
F 2 "" H 7638 2700 50  0001 C CNN
F 3 "~" H 7600 2850 50  0001 C CNN
	1    7600 2850
	1    0    0    -1  
$EndComp
$Comp
L Device:C C?
U 1 1 5FA435F7
P 7950 2850
F 0 "C?" H 8065 2896 50  0000 L CNN
F 1 "C" H 8065 2805 50  0000 L CNN
F 2 "" H 7988 2700 50  0001 C CNN
F 3 "~" H 7950 2850 50  0001 C CNN
	1    7950 2850
	1    0    0    -1  
$EndComp
Wire Wire Line
	7500 2550 7600 2550
Wire Wire Line
	7600 2550 7600 2700
Wire Wire Line
	7500 2350 7950 2350
Wire Wire Line
	7950 2350 7950 2700
Wire Wire Line
	7950 2350 8050 2350
Connection ~ 7950 2350
Wire Wire Line
	8050 2550 7600 2550
Connection ~ 7600 2550
$Comp
L power:GND #PWR?
U 1 1 5FABBFD4
P 7950 3200
F 0 "#PWR?" H 7950 2950 50  0001 C CNN
F 1 "GND" H 7955 3027 50  0000 C CNN
F 2 "" H 7950 3200 50  0001 C CNN
F 3 "" H 7950 3200 50  0001 C CNN
	1    7950 3200
	1    0    0    -1  
$EndComp
Wire Wire Line
	6050 3000 6350 3000
Wire Wire Line
	7950 3000 7950 3200
Connection ~ 6350 3000
Wire Wire Line
	6350 3000 6850 3000
Connection ~ 6850 3000
Wire Wire Line
	6850 3000 7150 3000
Connection ~ 7150 3000
Wire Wire Line
	7150 3000 7600 3000
Connection ~ 7600 3000
Wire Wire Line
	7600 3000 7950 3000
Connection ~ 7950 3000
$Comp
L Device:C C?
U 1 1 5F85E90F
P 6150 1450
F 0 "C?" V 6100 1550 50  0000 C CNN
F 1 "10u" V 6100 1300 50  0000 C CNN
F 2 "" H 6188 1300 50  0001 C CNN
F 3 "~" H 6150 1450 50  0001 C CNN
	1    6150 1450
	0    1    1    0   
$EndComp
$Comp
L Device:C C?
U 1 1 5F85EFF1
P 6150 1650
F 0 "C?" V 6100 1750 50  0000 C CNN
F 1 "10u" V 6100 1500 50  0000 C CNN
F 2 "" H 6188 1500 50  0001 C CNN
F 3 "~" H 6150 1650 50  0001 C CNN
	1    6150 1650
	0    1    1    0   
$EndComp
$Comp
L Device:C C?
U 1 1 5F85F90B
P 6550 1550
F 0 "C?" V 6500 1650 50  0000 C CNN
F 1 "10u" V 6500 1400 50  0000 C CNN
F 2 "" H 6588 1400 50  0001 C CNN
F 3 "~" H 6550 1550 50  0001 C CNN
	1    6550 1550
	0    1    1    0   
$EndComp
Wire Wire Line
	6300 1650 6750 1650
Wire Wire Line
	6750 1650 6750 1550
Wire Wire Line
	6700 1550 6750 1550
Connection ~ 6750 1550
Wire Wire Line
	6750 1550 6750 1450
Wire Wire Line
	6050 2550 6050 2450
Wire Wire Line
	5800 1750 8500 1750
Wire Wire Line
	4250 5400 8500 5400
Wire Wire Line
	6700 3650 6700 3600
$Comp
L Device:R R?
U 1 1 5F90D0AC
P 6700 3450
F 0 "R?" H 6850 3500 50  0000 C CNN
F 1 "330" H 6850 3400 50  0000 C CNN
F 2 "" V 6630 3450 50  0001 C CNN
F 3 "~" H 6700 3450 50  0001 C CNN
	1    6700 3450
	1    0    0    -1  
$EndComp
$Comp
L Device:LED D?
U 1 1 5F90D0B2
P 6700 3800
F 0 "D?" V 6750 3650 50  0000 C CNN
F 1 "LED" V 6650 3650 50  0000 C CNN
F 2 "" H 6700 3800 50  0001 C CNN
F 3 "~" H 6700 3800 50  0001 C CNN
	1    6700 3800
	0    -1   -1   0   
$EndComp
Wire Wire Line
	5800 3250 6450 3250
Wire Wire Line
	6450 3250 6450 3300
Wire Wire Line
	5800 3150 6700 3150
Wire Wire Line
	6700 3150 6700 3300
Wire Wire Line
	3550 2450 3550 2650
$Comp
L power:GND #PWR?
U 1 1 5F91A794
P 3550 2850
F 0 "#PWR?" H 3550 2600 50  0001 C CNN
F 1 "GND" H 3555 2677 50  0000 C CNN
F 2 "" H 3550 2850 50  0001 C CNN
F 3 "" H 3550 2850 50  0001 C CNN
	1    3550 2850
	1    0    0    -1  
$EndComp
Connection ~ 3550 2650
Wire Wire Line
	3550 2650 3550 2750
Connection ~ 3550 2850
Wire Wire Line
	3550 2150 3550 2450
Connection ~ 3550 2450
NoConn ~ 4400 2250
NoConn ~ 4400 2350
NoConn ~ 4400 3250
NoConn ~ 4400 3350
NoConn ~ 5800 3450
NoConn ~ 5800 3550
NoConn ~ 5800 3650
NoConn ~ 5800 3750
$Comp
L power:GND #PWR?
U 1 1 5F959CF4
P 6000 5050
F 0 "#PWR?" H 6000 4800 50  0001 C CNN
F 1 "GND" H 6005 4877 50  0000 C CNN
F 2 "" H 6000 5050 50  0001 C CNN
F 3 "" H 6000 5050 50  0001 C CNN
	1    6000 5050
	1    0    0    -1  
$EndComp
Wire Wire Line
	5800 4650 6000 4650
Wire Wire Line
	6000 4650 6000 4750
Wire Wire Line
	5800 4750 6000 4750
Connection ~ 6000 4750
Wire Wire Line
	6000 4750 6000 4850
Wire Wire Line
	5800 4850 6000 4850
Connection ~ 6000 4850
Wire Wire Line
	6000 4850 6000 4950
Wire Wire Line
	5800 4950 6000 4950
Connection ~ 6000 4950
Wire Wire Line
	6000 4950 6000 5050
NoConn ~ 5800 2150
$Comp
L Device:Crystal Y?
U 1 1 5F974B65
P 4200 3550
F 0 "Y?" H 4200 3818 50  0000 C CNN
F 1 "12MHz" H 4200 3727 50  0000 C CNN
F 2 "" H 4200 3550 50  0001 C CNN
F 3 "~" H 4200 3550 50  0001 C CNN
	1    4200 3550
	1    0    0    -1  
$EndComp
Wire Wire Line
	4050 3650 4050 3550
Wire Wire Line
	4350 3550 4400 3550
NoConn ~ 4400 4150
NoConn ~ 4400 4250
NoConn ~ 4400 4450
NoConn ~ 5800 2550
NoConn ~ 5800 2650
NoConn ~ 5800 2750
NoConn ~ 5800 2850
NoConn ~ 5800 2950
NoConn ~ 5800 3050
NoConn ~ 5800 3950
NoConn ~ 5800 4050
NoConn ~ 5800 4150
NoConn ~ 5800 1950
$Comp
L Device:C C?
U 1 1 5F99EEA9
P 6150 1850
F 0 "C?" V 6100 1950 50  0000 C CNN
F 1 "10u" V 6100 1700 50  0000 C CNN
F 2 "" H 6188 1700 50  0001 C CNN
F 3 "~" H 6150 1850 50  0001 C CNN
	1    6150 1850
	0    1    1    0   
$EndComp
Wire Wire Line
	6300 1850 6500 1850
Wire Wire Line
	6750 1850 6750 1900
$Comp
L power:GND #PWR?
U 1 1 5F9A52BA
P 6750 1900
F 0 "#PWR?" H 6750 1650 50  0001 C CNN
F 1 "GND" H 6755 1727 50  0000 C CNN
F 2 "" H 6750 1900 50  0001 C CNN
F 3 "" H 6750 1900 50  0001 C CNN
	1    6750 1900
	1    0    0    -1  
$EndComp
Wire Wire Line
	5800 2350 6350 2350
Connection ~ 6350 2350
Wire Wire Line
	5800 2450 6050 2450
Wire Notes Line
	5950 3100 8400 3100
Wire Notes Line
	8400 3100 8400 2200
Wire Notes Line
	8400 2200 5950 2200
Wire Notes Line
	5950 2200 5950 3100
Text Notes 7650 2200 0    50   ~ 0
Audio Output Filter
Wire Wire Line
	8500 1750 8500 5400
Wire Wire Line
	3750 3050 3750 5450
Wire Notes Line
	3100 5300 3100 6850
Wire Notes Line
	3100 6850 4550 6850
Wire Notes Line
	4550 6850 4550 5300
Wire Notes Line
	4550 5300 3100 5300
Text Notes 3900 5300 0    50   ~ 0
Audio Input Filter
Wire Wire Line
	6750 1650 6750 1850
Connection ~ 6750 1650
Connection ~ 6750 1850
Wire Wire Line
	5800 1850 6000 1850
Wire Wire Line
	5800 1650 5850 1650
Wire Wire Line
	5800 1450 5850 1450
Wire Wire Line
	5800 1550 5850 1550
Connection ~ 5850 1450
Wire Wire Line
	5850 1450 5850 1550
Connection ~ 5850 1550
Wire Wire Line
	5850 1550 6400 1550
Wire Wire Line
	5850 1550 5850 1650
Connection ~ 5850 1650
Wire Wire Line
	5850 1650 6000 1650
Wire Wire Line
	6300 1450 6750 1450
Wire Wire Line
	5850 1450 6000 1450
Wire Wire Line
	5850 1000 5850 1450
Wire Wire Line
	4400 3650 4050 3650
Wire Wire Line
	4400 3050 3750 3050
Wire Wire Line
	4400 2850 3550 2850
Wire Wire Line
	4400 2650 3550 2650
Wire Wire Line
	4400 2450 3550 2450
Wire Wire Line
	4400 2150 3550 2150
$Comp
L CM108AH:CM108AH U?
U 1 1 5F858505
P 5100 3250
F 0 "U?" H 5100 5315 50  0000 C CNN
F 1 "CM108AH" H 5100 5224 50  0000 C CNN
F 2 "QFP50P900X900X160-48N" H 5100 3250 50  0001 L BNN
F 3 "1.9" H 5100 3250 50  0001 L BNN
F 4 "Cmedia" H 5100 3250 50  0001 L BNN "Field4"
F 5 "IPC-7351B" H 5100 3250 50  0001 L BNN "Field5"
	1    5100 3250
	1    0    0    -1  
$EndComp
Wire Wire Line
	4400 2750 3550 2750
Connection ~ 3550 2750
Wire Wire Line
	3550 2750 3550 2850
NoConn ~ 4400 2550
$Comp
L Device:Ferrite_Bead FB?
U 1 1 5FA7A21F
P 3800 1000
AR Path="/5F79FE6E/5FA7A21F" Ref="FB?"  Part="1" 
AR Path="/5F79FE77/5FA7A21F" Ref="FB?"  Part="1" 
F 0 "FB?" V 3526 1000 50  0000 C CNN
F 1 "Ferrite_Bead" V 3617 1000 50  0000 C CNN
F 2 "" V 3730 1000 50  0001 C CNN
F 3 "~" H 3800 1000 50  0001 C CNN
	1    3800 1000
	0    -1   1    0   
$EndComp
$Comp
L Device:C C?
U 1 1 5FA7A225
P 3550 1200
AR Path="/5F79FE6E/5FA7A225" Ref="C?"  Part="1" 
AR Path="/5F79FE77/5FA7A225" Ref="C?"  Part="1" 
F 0 "C?" H 3435 1154 50  0000 R CNN
F 1 "10n" H 3435 1245 50  0000 R CNN
F 2 "" H 3588 1050 50  0001 C CNN
F 3 "~" H 3550 1200 50  0001 C CNN
	1    3550 1200
	1    0    0    1   
$EndComp
Text GLabel 3450 1000 0    50   Input ~ 0
USB2_PWR
Wire Wire Line
	3650 1000 3550 1000
Wire Wire Line
	3550 1050 3550 1000
Connection ~ 3550 1000
Wire Wire Line
	3550 1000 3450 1000
Wire Wire Line
	3550 1350 3550 2150
Connection ~ 3550 2150
Wire Wire Line
	3950 1000 5850 1000
Wire Wire Line
	5800 2250 5850 2250
Wire Wire Line
	5850 2250 5850 2050
Wire Wire Line
	5850 2050 6500 2050
Wire Wire Line
	6500 2050 6500 1850
Connection ~ 6500 1850
Wire Wire Line
	6500 1850 6750 1850
$EndSCHEMATC
