EESchema Schematic File Version 4
EELAYER 30 0
EELAYER END
$Descr A4 11693 8268
encoding utf-8
Sheet 1 4
Title ""
Date ""
Rev ""
Comp ""
Comment1 ""
Comment2 ""
Comment3 ""
Comment4 ""
$EndDescr
$Comp
L Connector:AudioJack3 J?
U 1 1 5F79727B
P 4200 1300
F 0 "J?" H 4180 1625 50  0000 C CNN
F 1 "AudioJack3" H 4180 1534 50  0000 C CNN
F 2 "" H 4200 1300 50  0001 C CNN
F 3 "~" H 4200 1300 50  0001 C CNN
	1    4200 1300
	-1   0    0    1   
$EndComp
$Comp
L Connector:AudioJack4 J?
U 1 1 5F797355
P 8950 1200
F 0 "J?" H 8905 1525 50  0000 C CNN
F 1 "AudioJack4" H 8905 1434 50  0000 C CNN
F 2 "" H 8950 1200 50  0001 C CNN
F 3 "~" H 8950 1200 50  0001 C CNN
	1    8950 1200
	-1   0    0    -1  
$EndComp
$Comp
L Connector:AudioJack2 J?
U 1 1 5F797435
P 5900 3650
F 0 "J?" H 5930 3975 50  0000 C CNN
F 1 "MIC_RAW" H 5930 3884 50  0000 C CNN
F 2 "" H 5900 3650 50  0001 C CNN
F 3 "~" H 5900 3650 50  0001 C CNN
	1    5900 3650
	-1   0    0    1   
$EndComp
$Sheet
S 1100 4850 1400 1000
U 5F79FCA2
F0 "USB Hub" 50
F1 "usb-hub.sch" 50
$EndSheet
$Sheet
S 4000 5350 1950 1000
U 5F79FE6E
F0 "Serial" 50
F1 "serial.sch" 50
$EndSheet
$Sheet
S 6550 5300 2100 950 
U 5F79FE77
F0 "Audio" 50
F1 "audio.sch" 50
$EndSheet
Text GLabel 5700 3650 0    50   Output ~ 0
MIC_IN
$Comp
L power:GND #PWR?
U 1 1 5FB25806
P 5550 3800
F 0 "#PWR?" H 5550 3550 50  0001 C CNN
F 1 "GND" H 5555 3627 50  0000 C CNN
F 2 "" H 5550 3800 50  0001 C CNN
F 3 "" H 5550 3800 50  0001 C CNN
	1    5550 3800
	-1   0    0    -1  
$EndComp
Wire Wire Line
	5700 3750 5550 3750
Wire Wire Line
	5550 3750 5550 3800
Wire Wire Line
	2800 1600 2650 1600
Wire Wire Line
	2650 1600 2650 1650
$Comp
L power:GND #PWR?
U 1 1 5FB281C3
P 2650 1650
F 0 "#PWR?" H 2650 1400 50  0001 C CNN
F 1 "GND" H 2655 1477 50  0000 C CNN
F 2 "" H 2650 1650 50  0001 C CNN
F 3 "" H 2650 1650 50  0001 C CNN
	1    2650 1650
	1    0    0    -1  
$EndComp
Text GLabel 2800 1200 0    50   Input ~ 0
L_OUT
Text GLabel 2800 2000 0    50   Input ~ 0
R_OUT
$Comp
L Device:Transformer_1P_1S T?
U 1 1 5F837936
P 3200 1400
F 0 "T?" H 3200 1781 50  0000 C CNN
F 1 "Transformer_1P_1S" H 3200 1690 50  0000 C CNN
F 2 "" H 3200 1400 50  0001 C CNN
F 3 "~" H 3200 1400 50  0001 C CNN
	1    3200 1400
	1    0    0    -1  
$EndComp
$Comp
L Device:Transformer_1P_1S T?
U 1 1 5F83814C
P 3200 2200
F 0 "T?" H 3200 2581 50  0000 C CNN
F 1 "Transformer_1P_1S" H 3200 2490 50  0000 C CNN
F 2 "" H 3200 2200 50  0001 C CNN
F 3 "~" H 3200 2200 50  0001 C CNN
	1    3200 2200
	1    0    0    -1  
$EndComp
$Comp
L Device:Transformer_1P_1S T?
U 1 1 5F8386CC
P 5750 2950
F 0 "T?" H 5750 3331 50  0000 C CNN
F 1 "Transformer_1P_1S" H 5750 3240 50  0000 C CNN
F 2 "" H 5750 2950 50  0001 C CNN
F 3 "~" H 5750 2950 50  0001 C CNN
	1    5750 2950
	1    0    0    -1  
$EndComp
Wire Wire Line
	2800 2400 2650 2400
Wire Wire Line
	2650 2400 2650 2450
$Comp
L power:GND #PWR?
U 1 1 5F842976
P 2650 2450
F 0 "#PWR?" H 2650 2200 50  0001 C CNN
F 1 "GND" H 2655 2277 50  0000 C CNN
F 2 "" H 2650 2450 50  0001 C CNN
F 3 "" H 2650 2450 50  0001 C CNN
	1    2650 2450
	1    0    0    -1  
$EndComp
Wire Wire Line
	3600 1200 4000 1200
Wire Wire Line
	3600 2000 3750 2000
Wire Wire Line
	3750 2000 3750 1300
Wire Wire Line
	3750 1300 4000 1300
Wire Wire Line
	3600 1600 3650 1600
Wire Wire Line
	3650 1600 3650 2400
Wire Wire Line
	3650 2400 3600 2400
Wire Wire Line
	3650 1600 3650 1400
Wire Wire Line
	3650 1400 4000 1400
Connection ~ 3650 1600
Text GLabel 5350 2750 0    50   Output ~ 0
MIC_IN
$Comp
L power:GND #PWR?
U 1 1 5F85AE3D
P 5200 3200
F 0 "#PWR?" H 5200 2950 50  0001 C CNN
F 1 "GND" H 5205 3027 50  0000 C CNN
F 2 "" H 5200 3200 50  0001 C CNN
F 3 "" H 5200 3200 50  0001 C CNN
	1    5200 3200
	-1   0    0    -1  
$EndComp
Wire Wire Line
	5350 3150 5200 3150
Wire Wire Line
	5200 3150 5200 3200
$Comp
L Connector:AudioJack2 J?
U 1 1 5F85B0B0
P 6500 2750
F 0 "J?" H 6530 3075 50  0000 C CNN
F 1 "MIC_ISO" H 6530 2984 50  0000 C CNN
F 2 "" H 6500 2750 50  0001 C CNN
F 3 "~" H 6500 2750 50  0001 C CNN
	1    6500 2750
	-1   0    0    1   
$EndComp
Wire Wire Line
	6150 2750 6300 2750
Wire Wire Line
	6300 2850 6200 2850
Wire Wire Line
	6200 2850 6200 3150
Wire Wire Line
	6200 3150 6150 3150
Text GLabel 6900 1600 0    50   Input ~ 0
PTT
$EndSCHEMATC
