EESchema Schematic File Version 4
EELAYER 30 0
EELAYER END
$Descr A4 11693 8268
encoding utf-8
Sheet 3 4
Title ""
Date ""
Rev ""
Comp ""
Comment1 ""
Comment2 ""
Comment3 ""
Comment4 ""
$EndDescr
$Comp
L dk_Interface-Controllers:FT232RL-REEL U?
U 1 1 5F79FFB0
P 6350 4450
AR Path="/5F79FFB0" Ref="U?"  Part="1" 
AR Path="/5F79FE6E/5F79FFB0" Ref="U?"  Part="1" 
F 0 "U?" H 6200 5150 60  0000 C CNN
F 1 "FT232RL-REEL" H 6200 5044 60  0000 C CNN
F 2 "digikey-footprints:SSOP-28_W5.30mm" H 6550 4650 60  0001 L CNN
F 3 "https://www.ftdichip.com/Support/Documents/DataSheets/ICs/DS_FT232R.pdf" H 6550 4750 60  0001 L CNN
F 4 "768-1007-1-ND" H 6550 4850 60  0001 L CNN "Digi-Key_PN"
F 5 "FT232RL-REEL" H 6550 4950 60  0001 L CNN "MPN"
F 6 "Integrated Circuits (ICs)" H 6550 5050 60  0001 L CNN "Category"
F 7 "Interface - Controllers" H 6550 5150 60  0001 L CNN "Family"
F 8 "https://www.ftdichip.com/Support/Documents/DataSheets/ICs/DS_FT232R.pdf" H 6550 5250 60  0001 L CNN "DK_Datasheet_Link"
F 9 "/product-detail/en/ftdi-future-technology-devices-international-ltd/FT232RL-REEL/768-1007-1-ND/1836402" H 6550 5350 60  0001 L CNN "DK_Detail_Page"
F 10 "IC USB FS SERIAL UART 28-SSOP" H 6550 5450 60  0001 L CNN "Description"
F 11 "FTDI, Future Technology Devices International Ltd" H 6550 5550 60  0001 L CNN "Manufacturer"
F 12 "Active" H 6550 5650 60  0001 L CNN "Status"
	1    6350 4450
	-1   0    0    -1  
$EndComp
Text GLabel 7050 4150 2    50   BiDi ~ 0
USB1_P
Text GLabel 7050 4250 2    50   BiDi ~ 0
USB1_M
$Comp
L Device:Ferrite_Bead FB?
U 1 1 5F7A6B44
P 6100 3500
F 0 "FB?" V 5826 3500 50  0000 C CNN
F 1 "Ferrite_Bead" V 5917 3500 50  0000 C CNN
F 2 "" V 6030 3500 50  0001 C CNN
F 3 "~" H 6100 3500 50  0001 C CNN
	1    6100 3500
	0    -1   1    0   
$EndComp
$Comp
L Device:C C?
U 1 1 5F7A838F
P 5850 3700
F 0 "C?" H 5735 3654 50  0000 R CNN
F 1 "10n" H 5735 3745 50  0000 R CNN
F 2 "" H 5888 3550 50  0001 C CNN
F 3 "~" H 5850 3700 50  0001 C CNN
	1    5850 3700
	1    0    0    1   
$EndComp
$Comp
L power:GND #PWR?
U 1 1 5F7A9E81
P 5850 3850
F 0 "#PWR?" H 5850 3600 50  0001 C CNN
F 1 "GND" H 5855 3677 50  0000 C CNN
F 2 "" H 5850 3850 50  0001 C CNN
F 3 "" H 5850 3850 50  0001 C CNN
	1    5850 3850
	-1   0    0    -1  
$EndComp
Text GLabel 5750 3500 0    50   Input ~ 0
USB1_PWR
Wire Wire Line
	5950 3500 5850 3500
Wire Wire Line
	6250 3500 6450 3500
Wire Wire Line
	6450 3500 6450 3950
Wire Wire Line
	5850 3550 5850 3500
Connection ~ 5850 3500
Wire Wire Line
	5850 3500 5750 3500
$Comp
L 2020-10-04_22-13-22:MAX3243ECPWR U?
U 1 1 5F7C0914
P 4900 1200
F 0 "U?" H 6300 1587 60  0000 C CNN
F 1 "MAX3243ECPWR" H 6300 1481 60  0000 C CNN
F 2 "PW28" H 6300 1440 60  0001 C CNN
F 3 "" H 4900 1200 60  0000 C CNN
	1    4900 1200
	1    0    0    -1  
$EndComp
$Comp
L Device:C C?
U 1 1 5F7CBB6C
P 4700 1200
F 0 "C?" V 4650 1300 50  0000 C CNN
F 1 "0.33u" V 4650 1050 50  0000 C CNN
F 2 "" H 4738 1050 50  0001 C CNN
F 3 "~" H 4700 1200 50  0001 C CNN
	1    4700 1200
	0    1    1    0   
$EndComp
Wire Wire Line
	4850 1200 4900 1200
Wire Wire Line
	4550 1200 4550 1300
Wire Wire Line
	4550 1300 4900 1300
Wire Wire Line
	8100 1200 8100 1600
Wire Wire Line
	8100 1600 7700 1600
$Comp
L Device:C C?
U 1 1 5F7D7FF0
P 4700 1400
F 0 "C?" V 4650 1500 50  0000 C CNN
F 1 "0.33u" V 4650 1250 50  0000 C CNN
F 2 "" H 4738 1250 50  0001 C CNN
F 3 "~" H 4700 1400 50  0001 C CNN
	1    4700 1400
	0    1    1    0   
$EndComp
Wire Wire Line
	4850 1400 4900 1400
$Comp
L power:GND #PWR?
U 1 1 5F7D9BEF
P 3550 1550
F 0 "#PWR?" H 3550 1300 50  0001 C CNN
F 1 "GND" H 3555 1377 50  0000 C CNN
F 2 "" H 3550 1550 50  0001 C CNN
F 3 "" H 3550 1550 50  0001 C CNN
	1    3550 1550
	1    0    0    -1  
$EndComp
Wire Wire Line
	4550 1400 3550 1400
Wire Wire Line
	3550 1400 3550 1550
$Comp
L Device:C C?
U 1 1 5F7DCB10
P 8400 1300
F 0 "C?" V 8350 1400 50  0000 C CNN
F 1 "0.33u" V 8350 1150 50  0000 C CNN
F 2 "" H 8438 1150 50  0001 C CNN
F 3 "~" H 8400 1300 50  0001 C CNN
	1    8400 1300
	0    1    1    0   
$EndComp
Wire Wire Line
	7700 1300 8250 1300
$Comp
L power:GND #PWR?
U 1 1 5F7DED40
P 8600 1850
F 0 "#PWR?" H 8600 1600 50  0001 C CNN
F 1 "GND" H 8605 1677 50  0000 C CNN
F 2 "" H 8600 1850 50  0001 C CNN
F 3 "" H 8600 1850 50  0001 C CNN
	1    8600 1850
	1    0    0    -1  
$EndComp
Wire Wire Line
	8550 1300 8600 1300
Wire Wire Line
	8600 1300 8600 1500
Text Label 3650 3550 1    50   ~ 0
DCD
Text Label 4150 3550 1    50   ~ 0
DSR
Text Label 3750 3550 1    50   ~ 0
RXDATA
Text Label 4250 3550 1    50   ~ 0
RTS
Text Label 4350 3550 1    50   ~ 0
CTS
Text Label 3950 3550 1    50   ~ 0
DTR
Text Label 4050 3550 1    50   ~ 0
GND
$Comp
L power:GND #PWR?
U 1 1 5F816DDF
P 3450 3850
F 0 "#PWR?" H 3450 3600 50  0001 C CNN
F 1 "GND" H 3455 3677 50  0000 C CNN
F 2 "" H 3450 3850 50  0001 C CNN
F 3 "" H 3450 3850 50  0001 C CNN
	1    3450 3850
	1    0    0    -1  
$EndComp
Text Label 3850 3550 1    50   ~ 0
TXDATA
NoConn ~ 7700 2000
Wire Wire Line
	4900 2100 3950 2100
Wire Wire Line
	4900 2200 4250 2200
Wire Wire Line
	4050 3200 3450 3200
Wire Wire Line
	3450 3200 3450 3850
Wire Wire Line
	5950 4750 4650 4750
Wire Wire Line
	4650 2300 4900 2300
Wire Wire Line
	4650 2300 4650 4750
Wire Wire Line
	5950 4650 4750 4650
Wire Wire Line
	4750 4650 4750 2400
Wire Wire Line
	4750 2400 4900 2400
Wire Wire Line
	5950 4550 4850 4550
Wire Wire Line
	4850 4550 4850 2500
Wire Wire Line
	4850 2500 4900 2500
Wire Wire Line
	4900 2000 3850 2000
Wire Wire Line
	4350 3550 4350 1800
Wire Wire Line
	4250 2200 4250 3550
Wire Wire Line
	4150 3550 4150 1700
Wire Wire Line
	4050 3550 4050 3200
Wire Wire Line
	3950 2100 3950 3550
Wire Wire Line
	3850 2000 3850 3550
Wire Wire Line
	3750 3550 3750 1600
Text Label 4450 3550 1    50   ~ 0
RI
$Comp
L D09P13A4GV00LF:D09P13A4GV00LF J?
U 1 1 5F79FFA0
P 3650 3550
AR Path="/5F79FFA0" Ref="J?"  Part="1" 
AR Path="/5F79FE6E/5F79FFA0" Ref="J?"  Part="1" 
F 0 "J?" V 4350 3100 60  0000 L CNN
F 1 "D09P13A4GV00LF" V 4250 2750 60  0000 L CNN
F 2 "CONN_D09P13A4GV00LF_AMP" H 4050 3090 60  0001 C CNN
F 3 "" H 3650 3550 60  0000 C CNN
	1    3650 3550
	0    -1   1    0   
$EndComp
Wire Wire Line
	4450 3550 4450 1900
Wire Wire Line
	3650 1500 4900 1500
Wire Wire Line
	3750 1600 4900 1600
Wire Wire Line
	4150 1700 4900 1700
Wire Wire Line
	4350 1800 4900 1800
Wire Wire Line
	4450 1900 4900 1900
Wire Wire Line
	3650 1500 3650 3550
Wire Wire Line
	7050 4850 8150 4850
Wire Wire Line
	8150 4850 8150 2100
Wire Wire Line
	8150 2100 7700 2100
Wire Wire Line
	7050 4550 8050 4550
Wire Wire Line
	8050 4550 8050 2200
Wire Wire Line
	8050 2200 7700 2200
Wire Wire Line
	7050 4750 7950 4750
Wire Wire Line
	7950 4750 7950 2300
Wire Wire Line
	7950 2300 7700 2300
Wire Wire Line
	7050 4950 7850 4950
Wire Wire Line
	7850 4950 7850 2400
Wire Wire Line
	7850 2400 7700 2400
Wire Wire Line
	7050 4650 7750 4650
Wire Wire Line
	7750 4650 7750 2500
Wire Wire Line
	7750 2500 7700 2500
Wire Wire Line
	7700 1500 8600 1500
Connection ~ 8600 1500
Wire Wire Line
	7050 4350 8250 4350
Wire Wire Line
	8250 4350 8250 3500
Wire Wire Line
	8250 3500 6550 3500
Connection ~ 6450 3500
Wire Wire Line
	6150 5650 6250 5650
Connection ~ 6250 5650
Wire Wire Line
	6250 5650 6350 5650
Connection ~ 6350 5650
Wire Wire Line
	6350 5650 6450 5650
Connection ~ 6450 5650
Wire Wire Line
	6450 5650 6550 5650
$Comp
L power:GND #PWR?
U 1 1 5F93DA48
P 6550 5650
F 0 "#PWR?" H 6550 5400 50  0001 C CNN
F 1 "GND" H 6555 5477 50  0000 C CNN
F 2 "" H 6550 5650 50  0001 C CNN
F 3 "" H 6550 5650 50  0001 C CNN
	1    6550 5650
	1    0    0    -1  
$EndComp
Connection ~ 6550 5650
NoConn ~ 7050 4450
NoConn ~ 5950 4450
$Comp
L Device:LED D?
U 1 1 5F941E28
P 7450 5450
F 0 "D?" H 7550 5500 50  0000 C CNN
F 1 "LED" H 7600 5400 50  0000 C CNN
F 2 "" H 7450 5450 50  0001 C CNN
F 3 "~" H 7450 5450 50  0001 C CNN
	1    7450 5450
	1    0    0    -1  
$EndComp
$Comp
L Device:LED D?
U 1 1 5F942DD0
P 8200 5350
F 0 "D?" H 8300 5400 50  0000 C CNN
F 1 "LED" H 8350 5300 50  0000 C CNN
F 2 "" H 8200 5350 50  0001 C CNN
F 3 "~" H 8200 5350 50  0001 C CNN
	1    8200 5350
	1    0    0    -1  
$EndComp
$Comp
L Device:R R?
U 1 1 5F953C8F
P 8550 5350
F 0 "R?" V 8500 5500 50  0000 C CNN
F 1 "270" V 8550 5350 50  0000 C CNN
F 2 "" V 8480 5350 50  0001 C CNN
F 3 "~" H 8550 5350 50  0001 C CNN
	1    8550 5350
	0    1    1    0   
$EndComp
$Comp
L Device:R R?
U 1 1 5F9592C4
P 7800 5450
F 0 "R?" V 7750 5600 50  0000 C CNN
F 1 "270" V 7800 5450 50  0000 C CNN
F 2 "" V 7730 5450 50  0001 C CNN
F 3 "~" H 7800 5450 50  0001 C CNN
	1    7800 5450
	0    1    1    0   
$EndComp
Wire Wire Line
	7600 5450 7650 5450
Wire Wire Line
	8350 5350 8400 5350
Wire Wire Line
	8700 5350 8800 5350
Wire Wire Line
	7700 1400 8250 1400
Connection ~ 8250 3500
NoConn ~ 5950 4350
NoConn ~ 7700 1900
Wire Wire Line
	7700 1200 7800 1200
$Comp
L Device:C C?
U 1 1 5F7D1B29
P 7950 1200
F 0 "C?" V 7900 1300 50  0000 C CNN
F 1 "47n" V 7900 1050 50  0000 C CNN
F 2 "" H 7988 1050 50  0001 C CNN
F 3 "~" H 7950 1200 50  0001 C CNN
	1    7950 1200
	0    1    1    0   
$EndComp
NoConn ~ 7050 5150
Text Label 7050 5050 0    50   ~ 0
SLEEP#
Text Label 7050 5450 0    50   ~ 0
TXLED#
Text Label 7050 5350 0    50   ~ 0
RXLED#
Text Label 7050 5250 0    50   ~ 0
PWREN#
Text Label 7050 5150 0    50   ~ 0
TXDEN#
Wire Wire Line
	7050 5450 7300 5450
Wire Wire Line
	7050 5350 8050 5350
Wire Wire Line
	8800 5350 8800 4350
Wire Wire Line
	8800 4350 8250 4350
Connection ~ 8250 4350
Wire Wire Line
	7950 5450 8800 5450
Wire Wire Line
	8800 5450 8800 5350
Connection ~ 8800 5350
Wire Wire Line
	8600 1500 8600 1850
Wire Wire Line
	8250 1400 8250 3500
Wire Wire Line
	7050 5050 8450 5050
Wire Wire Line
	8450 5050 8450 1700
Wire Wire Line
	8450 1700 7700 1700
Wire Wire Line
	7700 1800 8350 1800
Wire Wire Line
	8350 1800 8350 5250
Wire Wire Line
	8350 5250 7050 5250
Text Notes 6900 5850 0    50   ~ 0
Default configuration of CBUS3 – Power enable. Low after USB enumeration, high during USB suspend mode.\nDefault configuration of CBUS4 – Low during USB suspend mode.
Text Notes 8900 1650 0    50   ~ 0
When FORCEOFF* is LOW, the device shuts down.\nWhen FORCEON is HIGH auto-powerdown is disabled.
Wire Wire Line
	6550 3950 6550 3500
Connection ~ 6550 3500
Wire Wire Line
	6550 3500 6450 3500
Text Notes 8750 3800 0    50   ~ 0
Per the FT232R datasheet, 3V3 levels are recommended\nfor bus-powered applications. This would require an\nexternal regulator, however.
$Comp
L Device:D D?
U 1 1 5F8675DF
P 4200 4650
F 0 "D?" H 4350 4700 50  0000 C CNN
F 1 "D" H 4100 4700 50  0000 C CNN
F 2 "" H 4200 4650 50  0001 C CNN
F 3 "~" H 4200 4650 50  0001 C CNN
	1    4200 4650
	1    0    0    -1  
$EndComp
$Comp
L Device:D D?
U 1 1 5F8680E9
P 4200 4750
F 0 "D?" H 4350 4800 50  0000 C CNN
F 1 "D" H 4100 4800 50  0000 C CNN
F 2 "" H 4200 4750 50  0001 C CNN
F 3 "~" H 4200 4750 50  0001 C CNN
	1    4200 4750
	1    0    0    -1  
$EndComp
Wire Wire Line
	4350 4650 4750 4650
Connection ~ 4750 4650
Wire Wire Line
	4350 4750 4650 4750
Connection ~ 4650 4750
Wire Wire Line
	4050 4650 4050 4750
$Comp
L Device:Q_NPN_BCE Q?
U 1 1 5F878CBE
P 3100 4650
F 0 "Q?" H 3291 4696 50  0000 L CNN
F 1 "Q_NPN_BCE" H 3291 4605 50  0000 L CNN
F 2 "" H 3300 4750 50  0001 C CNN
F 3 "~" H 3100 4650 50  0001 C CNN
	1    3100 4650
	-1   0    0    -1  
$EndComp
Wire Wire Line
	4050 4650 3300 4650
Connection ~ 4050 4650
Text GLabel 2950 4350 0    50   Input ~ 0
PTT
Wire Wire Line
	2950 4350 3000 4350
Wire Wire Line
	3000 4350 3000 4450
$Comp
L power:GND #PWR?
U 1 1 5F887D62
P 3000 4850
F 0 "#PWR?" H 3000 4600 50  0001 C CNN
F 1 "GND" H 3005 4677 50  0000 C CNN
F 2 "" H 3000 4850 50  0001 C CNN
F 3 "" H 3000 4850 50  0001 C CNN
	1    3000 4850
	1    0    0    -1  
$EndComp
$EndSCHEMATC
