EESchema Schematic File Version 4
EELAYER 30 0
EELAYER END
$Descr A4 11693 8268
encoding utf-8
Sheet 4 7
Title ""
Date ""
Rev ""
Comp ""
Comment1 ""
Comment2 ""
Comment3 ""
Comment4 ""
$EndDescr
$Comp
L 2020-09-24_18-24-02:AD7904BRUZ-REEL7 U401
U 1 1 5F6E45B8
P 4350 2500
F 0 "U401" H 5250 2887 60  0000 C CNN
F 1 "AD7904" H 5250 2781 60  0000 C CNN
F 2 "AD7904:AD7904BRUZ-REEL7" H 5250 2740 60  0001 C CNN
F 3 "" H 4350 2500 60  0000 C CNN
	1    4350 2500
	1    0    0    -1  
$EndComp
Text GLabel 6150 2900 2    50   Input ~ 0
ADC0
Text GLabel 6150 3000 2    50   Input ~ 0
ADC1
Text GLabel 4350 2500 0    50   Input ~ 0
SPI_SCLK
Text GLabel 6150 2700 2    50   Output ~ 0
SPI_MOSI
Text GLabel 4350 2600 0    50   Input ~ 0
SPI_MISO
Text GLabel 4350 2700 0    50   Input ~ 0
SPI_CE0
$Comp
L power:Earth #PWR0406
U 1 1 5F6E5758
P 6600 3350
F 0 "#PWR0406" H 6600 3100 50  0001 C CNN
F 1 "Earth" H 6600 3200 50  0001 C CNN
F 2 "" H 6600 3350 50  0001 C CNN
F 3 "~" H 6600 3350 50  0001 C CNN
	1    6600 3350
	1    0    0    -1  
$EndComp
Wire Wire Line
	6150 2500 6600 2500
Wire Wire Line
	6600 2500 6600 2800
Wire Wire Line
	6150 3200 6600 3200
Connection ~ 6600 3200
Wire Wire Line
	6150 2800 6600 2800
Connection ~ 6600 2800
Wire Wire Line
	6600 2800 6600 3100
Wire Wire Line
	6150 3100 6600 3100
Connection ~ 6600 3100
Wire Wire Line
	6600 3100 6600 3200
$Comp
L power:Earth #PWR0404
U 1 1 5F6E64D4
P 4300 3350
F 0 "#PWR0404" H 4300 3100 50  0001 C CNN
F 1 "Earth" H 4300 3200 50  0001 C CNN
F 2 "" H 4300 3350 50  0001 C CNN
F 3 "~" H 4300 3350 50  0001 C CNN
	1    4300 3350
	1    0    0    -1  
$EndComp
Wire Wire Line
	6600 3200 6600 3350
Wire Wire Line
	4350 2800 4300 2800
Wire Wire Line
	4300 2800 4300 3200
Wire Wire Line
	4350 3200 4300 3200
Connection ~ 4300 3200
Wire Wire Line
	4300 3200 4300 3350
$Comp
L Device:C C401
U 1 1 5F6E81F1
P 2850 2600
F 0 "C401" H 2550 2650 50  0000 L CNN
F 1 "0.1u" H 2550 2550 50  0000 L CNN
F 2 "Capacitor_SMD:C_0805_2012Metric" H 2888 2450 50  0001 C CNN
F 3 "~" H 2850 2600 50  0001 C CNN
	1    2850 2600
	1    0    0    -1  
$EndComp
$Comp
L Device:C C402
U 1 1 5F6E887D
P 3150 2600
F 0 "C402" H 3265 2646 50  0000 L CNN
F 1 "10u" H 3265 2555 50  0000 L CNN
F 2 "Capacitor_SMD:C_0805_2012Metric" H 3188 2450 50  0001 C CNN
F 3 "~" H 3150 2600 50  0001 C CNN
	1    3150 2600
	1    0    0    -1  
$EndComp
Wire Wire Line
	4350 3000 3500 3000
Wire Wire Line
	3500 3000 3500 2900
$Comp
L Device:R R402
U 1 1 5F6F375F
P 4100 3200
F 0 "R402" V 4200 3200 50  0000 C CNN
F 1 "10k" V 4300 3200 50  0000 C CNN
F 2 "Resistor_SMD:R_0805_2012Metric" V 4030 3200 50  0001 C CNN
F 3 "~" H 4100 3200 50  0001 C CNN
	1    4100 3200
	0    1    1    0   
$EndComp
$Comp
L Device:R R401
U 1 1 5F6F4BB3
P 3700 3200
F 0 "R401" V 3800 3200 50  0000 C CNN
F 1 "10k" V 3900 3200 50  0000 C CNN
F 2 "Resistor_SMD:R_0805_2012Metric" V 3630 3200 50  0001 C CNN
F 3 "~" H 3700 3200 50  0001 C CNN
	1    3700 3200
	0    1    1    0   
$EndComp
Wire Wire Line
	3850 3200 3900 3200
Wire Wire Line
	4250 3200 4300 3200
Wire Wire Line
	3550 3200 3500 3200
Connection ~ 3500 3000
Wire Wire Line
	3900 3200 3900 3100
Wire Wire Line
	3900 3100 4350 3100
Connection ~ 3900 3200
Wire Wire Line
	3900 3200 3950 3200
$Comp
L power:+3V3 #PWR0405
U 1 1 5F6F61E8
P 6200 2350
F 0 "#PWR0405" H 6200 2200 50  0001 C CNN
F 1 "+3V3" H 6215 2523 50  0000 C CNN
F 2 "" H 6200 2350 50  0001 C CNN
F 3 "" H 6200 2350 50  0001 C CNN
	1    6200 2350
	1    0    0    -1  
$EndComp
Wire Wire Line
	6150 2600 6200 2600
Wire Wire Line
	6200 2600 6200 2350
Connection ~ 3500 2900
Wire Wire Line
	3500 2900 4350 2900
Wire Wire Line
	3500 2350 3500 2450
Wire Wire Line
	2850 2450 3150 2450
Wire Wire Line
	3150 2750 3000 2750
Wire Wire Line
	3150 2450 3500 2450
Connection ~ 3150 2450
Connection ~ 3500 2450
Wire Wire Line
	3500 2450 3500 2900
$Comp
L power:Earth #PWR0401
U 1 1 5F6E53AA
P 3000 2750
F 0 "#PWR0401" H 3000 2500 50  0001 C CNN
F 1 "Earth" H 3000 2600 50  0001 C CNN
F 2 "" H 3000 2750 50  0001 C CNN
F 3 "~" H 3000 2750 50  0001 C CNN
	1    3000 2750
	1    0    0    -1  
$EndComp
Connection ~ 3000 2750
Wire Wire Line
	3000 2750 2850 2750
$Comp
L Device:C C403
U 1 1 5F6E94DB
P 3150 3250
F 0 "C403" H 3265 3296 50  0000 L CNN
F 1 "10u" H 3265 3205 50  0000 L CNN
F 2 "Capacitor_SMD:C_0805_2012Metric" H 3188 3100 50  0001 C CNN
F 3 "~" H 3150 3250 50  0001 C CNN
	1    3150 3250
	1    0    0    -1  
$EndComp
Wire Wire Line
	3900 3100 3150 3100
Connection ~ 3900 3100
$Comp
L power:Earth #PWR0402
U 1 1 5F6EA1D6
P 3150 3400
F 0 "#PWR0402" H 3150 3150 50  0001 C CNN
F 1 "Earth" H 3150 3250 50  0001 C CNN
F 2 "" H 3150 3400 50  0001 C CNN
F 3 "~" H 3150 3400 50  0001 C CNN
	1    3150 3400
	1    0    0    -1  
$EndComp
Text GLabel 3050 3100 0    50   Output ~ 0
ADC_REF
Wire Wire Line
	3150 3100 3050 3100
Connection ~ 3150 3100
$Comp
L power:+3V3 #PWR0403
U 1 1 5F708080
P 3500 2350
F 0 "#PWR0403" H 3500 2200 50  0001 C CNN
F 1 "+3V3" H 3515 2523 50  0000 C CNN
F 2 "" H 3500 2350 50  0001 C CNN
F 3 "" H 3500 2350 50  0001 C CNN
	1    3500 2350
	1    0    0    -1  
$EndComp
Wire Wire Line
	3500 3000 3500 3200
$EndSCHEMATC
