EESchema Schematic File Version 4
EELAYER 30 0
EELAYER END
$Descr A4 11693 8268
encoding utf-8
Sheet 6 7
Title ""
Date ""
Rev ""
Comp ""
Comment1 ""
Comment2 ""
Comment3 ""
Comment4 ""
$EndDescr
$Comp
L Analog_Switch:SN74CBT3253 U?
U 1 1 5F764417
P 6100 3750
AR Path="/5F764417" Ref="U?"  Part="1" 
AR Path="/5F9B9AC0/5F764417" Ref="U?"  Part="1" 
AR Path="/5F747973/5F764417" Ref="U601"  Part="1" 
F 0 "U601" H 6100 4531 50  0000 C CNN
F 1 "SN74CBT3253" H 6100 4440 50  0000 C CNN
F 2 "Package_SO:TSSOP-16_4.4x5mm_P0.65mm" H 6100 3750 50  0001 C CNN
F 3 "http://www.ti.com/lit/gpn/sn74cbt3253" H 6100 3750 50  0001 C CNN
	1    6100 3750
	1    0    0    -1  
$EndComp
$Comp
L power:+5V #PWR?
U 1 1 5F76441D
P 6100 2850
AR Path="/5F76441D" Ref="#PWR?"  Part="1" 
AR Path="/5F9B9AC0/5F76441D" Ref="#PWR?"  Part="1" 
AR Path="/5F747973/5F76441D" Ref="#PWR0605"  Part="1" 
F 0 "#PWR0605" H 6100 2700 50  0001 C CNN
F 1 "+5V" H 6115 3023 50  0000 C CNN
F 2 "" H 6100 2850 50  0001 C CNN
F 3 "" H 6100 2850 50  0001 C CNN
	1    6100 2850
	1    0    0    -1  
$EndComp
Wire Wire Line
	6100 2850 6100 3150
$Comp
L power:Earth #PWR?
U 1 1 5F764424
P 6100 4350
AR Path="/5F764424" Ref="#PWR?"  Part="1" 
AR Path="/5F9B9AC0/5F764424" Ref="#PWR?"  Part="1" 
AR Path="/5F747973/5F764424" Ref="#PWR0606"  Part="1" 
F 0 "#PWR0606" H 6100 4100 50  0001 C CNN
F 1 "Earth" H 6100 4200 50  0001 C CNN
F 2 "" H 6100 4350 50  0001 C CNN
F 3 "~" H 6100 4350 50  0001 C CNN
	1    6100 4350
	1    0    0    -1  
$EndComp
NoConn ~ 6500 3350
NoConn ~ 6500 3450
NoConn ~ 6500 3650
NoConn ~ 6500 3550
Connection ~ 6100 4350
Wire Wire Line
	5600 3150 6100 3150
Connection ~ 6100 3150
Wire Wire Line
	5600 4350 6100 4350
$Comp
L dk_Transistors-FETs-MOSFETs-Single:BS170 Q?
U 1 1 5F76443B
P 5500 5250
AR Path="/5F9B9AC0/5F76443B" Ref="Q?"  Part="1" 
AR Path="/5F747973/5F76443B" Ref="Q601"  Part="1" 
F 0 "Q601" H 5607 5197 60  0000 L CNN
F 1 "BS170" H 5607 5303 60  0000 L CNN
F 2 "digikey-footprints:TO-92-3" H 5700 5450 60  0001 L CNN
F 3 "https://www.onsemi.com/pub/Collateral/BS170-D.PDF" H 5700 5550 60  0001 L CNN
F 4 "BS170-ND" H 5700 5650 60  0001 L CNN "Digi-Key_PN"
F 5 "BS170" H 5700 5750 60  0001 L CNN "MPN"
F 6 "Discrete Semiconductor Products" H 5700 5850 60  0001 L CNN "Category"
F 7 "Transistors - FETs, MOSFETs - Single" H 5700 5950 60  0001 L CNN "Family"
F 8 "https://www.onsemi.com/pub/Collateral/BS170-D.PDF" H 5700 6050 60  0001 L CNN "DK_Datasheet_Link"
F 9 "/product-detail/en/on-semiconductor/BS170/BS170-ND/244280" H 5700 6150 60  0001 L CNN "DK_Detail_Page"
F 10 "MOSFET N-CH 60V 500MA TO-92" H 5700 6250 60  0001 L CNN "Description"
F 11 "ON Semiconductor" H 5700 6350 60  0001 L CNN "Manufacturer"
F 12 "Active" H 5700 6450 60  0001 L CNN "Status"
	1    5500 5250
	-1   0    0    1   
$EndComp
$Comp
L Device:C C?
U 1 1 5F764441
P 5900 5300
AR Path="/5F9B9AC0/5F764441" Ref="C?"  Part="1" 
AR Path="/5F747973/5F764441" Ref="C604"  Part="1" 
F 0 "C604" H 6015 5346 50  0000 L CNN
F 1 "10n" H 6015 5255 50  0000 L CNN
F 2 "Capacitor_SMD:C_0805_2012Metric" H 5938 5150 50  0001 C CNN
F 3 "~" H 5900 5300 50  0001 C CNN
	1    5900 5300
	1    0    0    -1  
$EndComp
Text GLabel 6200 5150 2    50   Input ~ 0
RX_EN
Wire Wire Line
	6200 5150 5900 5150
Connection ~ 5900 5150
Wire Wire Line
	5900 5150 5800 5150
$Comp
L Amplifier_Operational:LM4562 U?
U 1 1 5F76444B
P 8750 2350
AR Path="/5F9B9AC0/5F76444B" Ref="U?"  Part="1" 
AR Path="/5F747973/5F76444B" Ref="U602"  Part="1" 
F 0 "U602" H 8800 2650 50  0000 C CNN
F 1 "LM4562" H 8800 2550 50  0000 C CNN
F 2 "Package_SO:SOIC-8_3.9x4.9mm_P1.27mm" H 8750 2350 50  0001 C CNN
F 3 "http://www.ti.com/lit/ds/symlink/lm4562.pdf" H 8750 2350 50  0001 C CNN
	1    8750 2350
	1    0    0    -1  
$EndComp
$Comp
L Amplifier_Operational:LM4562 U?
U 2 1 5F764451
P 8750 4050
AR Path="/5F9B9AC0/5F764451" Ref="U?"  Part="2" 
AR Path="/5F747973/5F764451" Ref="U602"  Part="2" 
F 0 "U602" H 8750 4417 50  0000 C CNN
F 1 "LM4562" H 8750 4326 50  0000 C CNN
F 2 "Package_SO:SOIC-8_3.9x4.9mm_P1.27mm" H 8750 4050 50  0001 C CNN
F 3 "http://www.ti.com/lit/ds/symlink/lm4562.pdf" H 8750 4050 50  0001 C CNN
	2    8750 4050
	1    0    0    -1  
$EndComp
$Comp
L Device:R R?
U 1 1 5F764457
P 8200 2250
AR Path="/5F9B9AC0/5F764457" Ref="R?"  Part="1" 
AR Path="/5F747973/5F764457" Ref="R605"  Part="1" 
F 0 "R605" V 7993 2250 50  0000 C CNN
F 1 "100" V 8084 2250 50  0000 C CNN
F 2 "Resistor_SMD:R_0805_2012Metric" V 8130 2250 50  0001 C CNN
F 3 "~" H 8200 2250 50  0001 C CNN
	1    8200 2250
	0    1    1    0   
$EndComp
Wire Wire Line
	8350 2250 8450 2250
$Comp
L Device:R R?
U 1 1 5F76445E
P 8200 2450
AR Path="/5F9B9AC0/5F76445E" Ref="R?"  Part="1" 
AR Path="/5F747973/5F76445E" Ref="R606"  Part="1" 
F 0 "R606" V 8300 2450 50  0000 C CNN
F 1 "100" V 8400 2450 50  0000 C CNN
F 2 "Resistor_SMD:R_0805_2012Metric" V 8130 2450 50  0001 C CNN
F 3 "~" H 8200 2450 50  0001 C CNN
	1    8200 2450
	0    1    1    0   
$EndComp
Wire Wire Line
	8350 2450 8400 2450
$Comp
L Amplifier_Operational:LM4562 U?
U 3 1 5F764465
P 8750 2350
AR Path="/5F9B9AC0/5F764465" Ref="U?"  Part="3" 
AR Path="/5F747973/5F764465" Ref="U602"  Part="3" 
F 0 "U602" H 8708 2396 50  0000 L CNN
F 1 "LM4562" H 8708 2305 50  0000 L CNN
F 2 "Package_SO:SOIC-8_3.9x4.9mm_P1.27mm" H 8750 2350 50  0001 C CNN
F 3 "http://www.ti.com/lit/ds/symlink/lm4562.pdf" H 8750 2350 50  0001 C CNN
	3    8750 2350
	1    0    0    -1  
$EndComp
$Comp
L power:+12V #PWR?
U 1 1 5F76446B
P 8650 1950
AR Path="/5F9B9AC0/5F76446B" Ref="#PWR?"  Part="1" 
AR Path="/5F747973/5F76446B" Ref="#PWR0612"  Part="1" 
F 0 "#PWR0612" H 8650 1800 50  0001 C CNN
F 1 "+12V" H 8665 2123 50  0000 C CNN
F 2 "" H 8650 1950 50  0001 C CNN
F 3 "" H 8650 1950 50  0001 C CNN
	1    8650 1950
	1    0    0    -1  
$EndComp
Wire Wire Line
	8650 1950 8650 2050
$Comp
L Device:C C?
U 1 1 5F764472
P 9000 1950
AR Path="/5F9B9AC0/5F764472" Ref="C?"  Part="1" 
AR Path="/5F747973/5F764472" Ref="C611"  Part="1" 
F 0 "C611" V 8748 1950 50  0000 C CNN
F 1 "100n" V 8839 1950 50  0000 C CNN
F 2 "Capacitor_SMD:C_0805_2012Metric" H 9038 1800 50  0001 C CNN
F 3 "~" H 9000 1950 50  0001 C CNN
	1    9000 1950
	0    1    1    0   
$EndComp
$Comp
L power:Earth #PWR?
U 1 1 5F764478
P 9150 1950
AR Path="/5F9B9AC0/5F764478" Ref="#PWR?"  Part="1" 
AR Path="/5F747973/5F764478" Ref="#PWR0615"  Part="1" 
F 0 "#PWR0615" H 9150 1700 50  0001 C CNN
F 1 "Earth" H 9150 1800 50  0001 C CNN
F 2 "" H 9150 1950 50  0001 C CNN
F 3 "~" H 9150 1950 50  0001 C CNN
	1    9150 1950
	1    0    0    -1  
$EndComp
Wire Wire Line
	8850 1950 8650 1950
Connection ~ 8650 1950
$Comp
L power:Earth #PWR?
U 1 1 5F764480
P 8650 2650
AR Path="/5F9B9AC0/5F764480" Ref="#PWR?"  Part="1" 
AR Path="/5F747973/5F764480" Ref="#PWR0613"  Part="1" 
F 0 "#PWR0613" H 8650 2400 50  0001 C CNN
F 1 "Earth" H 8650 2500 50  0001 C CNN
F 2 "" H 8650 2650 50  0001 C CNN
F 3 "~" H 8650 2650 50  0001 C CNN
	1    8650 2650
	1    0    0    -1  
$EndComp
$Comp
L Device:C C?
U 1 1 5F764486
P 7600 2900
AR Path="/5F9B9AC0/5F764486" Ref="C?"  Part="1" 
AR Path="/5F747973/5F764486" Ref="C605"  Part="1" 
F 0 "C605" H 7715 2946 50  0000 L CNN
F 1 "470n" H 7715 2855 50  0000 L CNN
F 2 "Capacitor_SMD:C_0805_2012Metric" H 7638 2750 50  0001 C CNN
F 3 "~" H 7600 2900 50  0001 C CNN
	1    7600 2900
	1    0    0    -1  
$EndComp
$Comp
L power:Earth #PWR?
U 1 1 5F76448C
P 7600 3050
AR Path="/5F9B9AC0/5F76448C" Ref="#PWR?"  Part="1" 
AR Path="/5F747973/5F76448C" Ref="#PWR0608"  Part="1" 
F 0 "#PWR0608" H 7600 2800 50  0001 C CNN
F 1 "Earth" H 7600 2900 50  0001 C CNN
F 2 "" H 7600 3050 50  0001 C CNN
F 3 "~" H 7600 3050 50  0001 C CNN
	1    7600 3050
	1    0    0    -1  
$EndComp
$Comp
L Device:C C?
U 1 1 5F764492
P 8000 2900
AR Path="/5F9B9AC0/5F764492" Ref="C?"  Part="1" 
AR Path="/5F747973/5F764492" Ref="C607"  Part="1" 
F 0 "C607" H 8115 2946 50  0000 L CNN
F 1 "470n" H 8115 2855 50  0000 L CNN
F 2 "Capacitor_SMD:C_0805_2012Metric" H 8038 2750 50  0001 C CNN
F 3 "~" H 8000 2900 50  0001 C CNN
	1    8000 2900
	1    0    0    -1  
$EndComp
$Comp
L power:Earth #PWR?
U 1 1 5F764498
P 8000 3050
AR Path="/5F9B9AC0/5F764498" Ref="#PWR?"  Part="1" 
AR Path="/5F747973/5F764498" Ref="#PWR0610"  Part="1" 
F 0 "#PWR0610" H 8000 2800 50  0001 C CNN
F 1 "Earth" H 8000 2900 50  0001 C CNN
F 2 "" H 8000 3050 50  0001 C CNN
F 3 "~" H 8000 3050 50  0001 C CNN
	1    8000 3050
	1    0    0    -1  
$EndComp
Wire Wire Line
	8000 2750 8000 2450
Wire Wire Line
	8000 2450 8050 2450
Wire Wire Line
	7600 2750 7600 2250
Wire Wire Line
	7600 2250 8050 2250
$Comp
L Device:R R?
U 1 1 5F7644A2
P 8750 3500
AR Path="/5F9B9AC0/5F7644A2" Ref="R?"  Part="1" 
AR Path="/5F747973/5F7644A2" Ref="R609"  Part="1" 
F 0 "R609" V 8543 3500 50  0000 C CNN
F 1 "82k" V 8634 3500 50  0000 C CNN
F 2 "Resistor_SMD:R_0805_2012Metric" V 8680 3500 50  0001 C CNN
F 3 "~" H 8750 3500 50  0001 C CNN
	1    8750 3500
	0    1    1    0   
$EndComp
$Comp
L Device:C C?
U 1 1 5F7644A8
P 8750 3100
AR Path="/5F9B9AC0/5F7644A8" Ref="C?"  Part="1" 
AR Path="/5F747973/5F7644A8" Ref="C609"  Part="1" 
F 0 "C609" V 8498 3100 50  0000 C CNN
F 1 "1n" V 8589 3100 50  0000 C CNN
F 2 "Capacitor_SMD:C_0805_2012Metric" H 8788 2950 50  0001 C CNN
F 3 "~" H 8750 3100 50  0001 C CNN
	1    8750 3100
	0    1    1    0   
$EndComp
Wire Wire Line
	8400 2450 8400 3100
Wire Wire Line
	8400 3500 8600 3500
Connection ~ 8400 2450
Wire Wire Line
	8400 2450 8450 2450
Wire Wire Line
	9100 2350 9100 3100
Wire Wire Line
	9100 3500 8900 3500
Wire Wire Line
	8900 3100 9100 3100
Connection ~ 9100 3100
Wire Wire Line
	9100 3100 9100 3500
Wire Wire Line
	8600 3100 8400 3100
Connection ~ 8400 3100
Wire Wire Line
	8400 3100 8400 3500
$Comp
L Device:C C?
U 1 1 5F7644BA
P 9300 2350
AR Path="/5F9B9AC0/5F7644BA" Ref="C?"  Part="1" 
AR Path="/5F747973/5F7644BA" Ref="C612"  Part="1" 
F 0 "C612" V 9048 2350 50  0000 C CNN
F 1 "100n" V 9139 2350 50  0000 C CNN
F 2 "Capacitor_SMD:C_0805_2012Metric" H 9338 2200 50  0001 C CNN
F 3 "~" H 9300 2350 50  0001 C CNN
	1    9300 2350
	0    1    1    0   
$EndComp
Wire Wire Line
	9050 2350 9100 2350
Connection ~ 9100 2350
Wire Wire Line
	9100 2350 9150 2350
$Comp
L Device:R R?
U 1 1 5F7644C3
P 8200 3950
AR Path="/5F9B9AC0/5F7644C3" Ref="R?"  Part="1" 
AR Path="/5F747973/5F7644C3" Ref="R607"  Part="1" 
F 0 "R607" V 7993 3950 50  0000 C CNN
F 1 "100" V 8084 3950 50  0000 C CNN
F 2 "Resistor_SMD:R_0805_2012Metric" V 8130 3950 50  0001 C CNN
F 3 "~" H 8200 3950 50  0001 C CNN
	1    8200 3950
	0    1    1    0   
$EndComp
Wire Wire Line
	8350 3950 8450 3950
$Comp
L Device:R R?
U 1 1 5F7644CA
P 8200 4150
AR Path="/5F9B9AC0/5F7644CA" Ref="R?"  Part="1" 
AR Path="/5F747973/5F7644CA" Ref="R608"  Part="1" 
F 0 "R608" V 8300 4150 50  0000 C CNN
F 1 "100" V 8400 4150 50  0000 C CNN
F 2 "Resistor_SMD:R_0805_2012Metric" V 8130 4150 50  0001 C CNN
F 3 "~" H 8200 4150 50  0001 C CNN
	1    8200 4150
	0    1    1    0   
$EndComp
Wire Wire Line
	8350 4150 8400 4150
Wire Wire Line
	6500 4150 8000 4150
$Comp
L Device:C C?
U 1 1 5F7644D8
P 7600 4600
AR Path="/5F9B9AC0/5F7644D8" Ref="C?"  Part="1" 
AR Path="/5F747973/5F7644D8" Ref="C606"  Part="1" 
F 0 "C606" H 7715 4646 50  0000 L CNN
F 1 "470n" H 7715 4555 50  0000 L CNN
F 2 "Capacitor_SMD:C_0805_2012Metric" H 7638 4450 50  0001 C CNN
F 3 "~" H 7600 4600 50  0001 C CNN
	1    7600 4600
	1    0    0    -1  
$EndComp
$Comp
L power:Earth #PWR?
U 1 1 5F7644DE
P 7600 4750
AR Path="/5F9B9AC0/5F7644DE" Ref="#PWR?"  Part="1" 
AR Path="/5F747973/5F7644DE" Ref="#PWR0609"  Part="1" 
F 0 "#PWR0609" H 7600 4500 50  0001 C CNN
F 1 "Earth" H 7600 4600 50  0001 C CNN
F 2 "" H 7600 4750 50  0001 C CNN
F 3 "~" H 7600 4750 50  0001 C CNN
	1    7600 4750
	1    0    0    -1  
$EndComp
$Comp
L Device:C C?
U 1 1 5F7644E4
P 8000 4600
AR Path="/5F9B9AC0/5F7644E4" Ref="C?"  Part="1" 
AR Path="/5F747973/5F7644E4" Ref="C608"  Part="1" 
F 0 "C608" H 8115 4646 50  0000 L CNN
F 1 "470n" H 8115 4555 50  0000 L CNN
F 2 "Capacitor_SMD:C_0805_2012Metric" H 8038 4450 50  0001 C CNN
F 3 "~" H 8000 4600 50  0001 C CNN
	1    8000 4600
	1    0    0    -1  
$EndComp
$Comp
L power:Earth #PWR?
U 1 1 5F7644EA
P 8000 4750
AR Path="/5F9B9AC0/5F7644EA" Ref="#PWR?"  Part="1" 
AR Path="/5F747973/5F7644EA" Ref="#PWR0611"  Part="1" 
F 0 "#PWR0611" H 8000 4500 50  0001 C CNN
F 1 "Earth" H 8000 4600 50  0001 C CNN
F 2 "" H 8000 4750 50  0001 C CNN
F 3 "~" H 8000 4750 50  0001 C CNN
	1    8000 4750
	1    0    0    -1  
$EndComp
Wire Wire Line
	8000 4450 8000 4150
Connection ~ 8000 4150
Wire Wire Line
	8000 4150 8050 4150
Wire Wire Line
	7600 4450 7600 3950
Wire Wire Line
	7600 3950 8050 3950
$Comp
L Device:R R?
U 1 1 5F7644F5
P 8750 5200
AR Path="/5F9B9AC0/5F7644F5" Ref="R?"  Part="1" 
AR Path="/5F747973/5F7644F5" Ref="R610"  Part="1" 
F 0 "R610" V 8543 5200 50  0000 C CNN
F 1 "82k" V 8634 5200 50  0000 C CNN
F 2 "Resistor_SMD:R_0805_2012Metric" V 8680 5200 50  0001 C CNN
F 3 "~" H 8750 5200 50  0001 C CNN
	1    8750 5200
	0    1    1    0   
$EndComp
$Comp
L Device:C C?
U 1 1 5F7644FB
P 8750 4800
AR Path="/5F9B9AC0/5F7644FB" Ref="C?"  Part="1" 
AR Path="/5F747973/5F7644FB" Ref="C610"  Part="1" 
F 0 "C610" V 8498 4800 50  0000 C CNN
F 1 "1n" V 8589 4800 50  0000 C CNN
F 2 "Capacitor_SMD:C_0805_2012Metric" H 8788 4650 50  0001 C CNN
F 3 "~" H 8750 4800 50  0001 C CNN
	1    8750 4800
	0    1    1    0   
$EndComp
Wire Wire Line
	8400 4150 8400 4800
Wire Wire Line
	8400 5200 8600 5200
Connection ~ 8400 4150
Wire Wire Line
	8400 4150 8450 4150
Wire Wire Line
	9100 4050 9100 4800
Wire Wire Line
	9100 5200 8900 5200
Wire Wire Line
	8900 4800 9100 4800
Connection ~ 9100 4800
Wire Wire Line
	9100 4800 9100 5200
Wire Wire Line
	8600 4800 8400 4800
Connection ~ 8400 4800
Wire Wire Line
	8400 4800 8400 5200
$Comp
L Device:C C?
U 1 1 5F76450D
P 9300 4050
AR Path="/5F9B9AC0/5F76450D" Ref="C?"  Part="1" 
AR Path="/5F747973/5F76450D" Ref="C613"  Part="1" 
F 0 "C613" V 9048 4050 50  0000 C CNN
F 1 "100n" V 9139 4050 50  0000 C CNN
F 2 "Capacitor_SMD:C_0805_2012Metric" H 9338 3900 50  0001 C CNN
F 3 "~" H 9300 4050 50  0001 C CNN
	1    9300 4050
	0    1    1    0   
$EndComp
Wire Wire Line
	9050 4050 9100 4050
Connection ~ 9100 4050
Wire Wire Line
	9100 4050 9150 4050
Wire Wire Line
	6550 2250 7600 2250
Connection ~ 7600 2250
Wire Wire Line
	6650 2450 8000 2450
Connection ~ 8000 2450
Wire Wire Line
	7600 3850 6500 3850
Wire Wire Line
	7600 3850 7600 3950
Connection ~ 7600 3950
Wire Wire Line
	6550 2250 6550 3950
Wire Wire Line
	6550 3950 6500 3950
Wire Wire Line
	6650 2450 6650 4050
Wire Wire Line
	6650 4050 6500 4050
$Comp
L Device:R R?
U 1 1 5F764521
P 9500 3850
AR Path="/5F9B9AC0/5F764521" Ref="R?"  Part="1" 
AR Path="/5F747973/5F764521" Ref="R613"  Part="1" 
F 0 "R613" H 9570 3896 50  0000 L CNN
F 1 "10k" H 9570 3805 50  0000 L CNN
F 2 "Resistor_SMD:R_0805_2012Metric" V 9430 3850 50  0001 C CNN
F 3 "~" H 9500 3850 50  0001 C CNN
	1    9500 3850
	1    0    0    -1  
$EndComp
$Comp
L Device:R R?
U 1 1 5F764527
P 9500 4250
AR Path="/5F9B9AC0/5F764527" Ref="R?"  Part="1" 
AR Path="/5F747973/5F764527" Ref="R614"  Part="1" 
F 0 "R614" H 9570 4296 50  0000 L CNN
F 1 "10k" H 9570 4205 50  0000 L CNN
F 2 "Resistor_SMD:R_0805_2012Metric" V 9430 4250 50  0001 C CNN
F 3 "~" H 9500 4250 50  0001 C CNN
	1    9500 4250
	1    0    0    -1  
$EndComp
$Comp
L power:Earth #PWR?
U 1 1 5F76452D
P 9500 4400
AR Path="/5F9B9AC0/5F76452D" Ref="#PWR?"  Part="1" 
AR Path="/5F747973/5F76452D" Ref="#PWR0617"  Part="1" 
F 0 "#PWR0617" H 9500 4150 50  0001 C CNN
F 1 "Earth" H 9500 4250 50  0001 C CNN
F 2 "" H 9500 4400 50  0001 C CNN
F 3 "~" H 9500 4400 50  0001 C CNN
	1    9500 4400
	1    0    0    -1  
$EndComp
Wire Wire Line
	9500 4000 9500 4050
Wire Wire Line
	9450 4050 9500 4050
Connection ~ 9500 4050
Wire Wire Line
	9500 4050 9500 4100
$Comp
L Device:R R?
U 1 1 5F764537
P 9500 2150
AR Path="/5F9B9AC0/5F764537" Ref="R?"  Part="1" 
AR Path="/5F747973/5F764537" Ref="R611"  Part="1" 
F 0 "R611" H 9570 2196 50  0000 L CNN
F 1 "10k" H 9570 2105 50  0000 L CNN
F 2 "Resistor_SMD:R_0805_2012Metric" V 9430 2150 50  0001 C CNN
F 3 "~" H 9500 2150 50  0001 C CNN
	1    9500 2150
	1    0    0    -1  
$EndComp
$Comp
L Device:R R?
U 1 1 5F76453D
P 9500 2550
AR Path="/5F9B9AC0/5F76453D" Ref="R?"  Part="1" 
AR Path="/5F747973/5F76453D" Ref="R612"  Part="1" 
F 0 "R612" H 9570 2596 50  0000 L CNN
F 1 "10k" H 9570 2505 50  0000 L CNN
F 2 "Resistor_SMD:R_0805_2012Metric" V 9430 2550 50  0001 C CNN
F 3 "~" H 9500 2550 50  0001 C CNN
	1    9500 2550
	1    0    0    -1  
$EndComp
$Comp
L power:Earth #PWR?
U 1 1 5F764543
P 9500 2700
AR Path="/5F9B9AC0/5F764543" Ref="#PWR?"  Part="1" 
AR Path="/5F747973/5F764543" Ref="#PWR0616"  Part="1" 
F 0 "#PWR0616" H 9500 2450 50  0001 C CNN
F 1 "Earth" H 9500 2550 50  0001 C CNN
F 2 "" H 9500 2700 50  0001 C CNN
F 3 "~" H 9500 2700 50  0001 C CNN
	1    9500 2700
	1    0    0    -1  
$EndComp
Wire Wire Line
	9500 2300 9500 2350
Wire Wire Line
	9450 2350 9500 2350
Connection ~ 9500 2350
Wire Wire Line
	9500 2350 9500 2400
Text GLabel 9750 2350 2    50   Output ~ 0
ADC0
Text GLabel 9750 4050 2    50   Output ~ 0
ADC1
Wire Wire Line
	9500 4050 9750 4050
Wire Wire Line
	9500 2350 9750 2350
$Comp
L power:Earth #PWR?
U 1 1 5F764551
P 6100 4350
AR Path="/5F764551" Ref="#PWR?"  Part="1" 
AR Path="/5F9B9AC0/5F764551" Ref="#PWR?"  Part="1" 
AR Path="/5F747973/5F764551" Ref="#PWR0607"  Part="1" 
F 0 "#PWR0607" H 6100 4100 50  0001 C CNN
F 1 "Earth" H 6100 4200 50  0001 C CNN
F 2 "" H 6100 4350 50  0001 C CNN
F 3 "~" H 6100 4350 50  0001 C CNN
	1    6100 4350
	1    0    0    -1  
$EndComp
$Comp
L power:Earth #PWR?
U 1 1 5F764557
P 5900 5450
AR Path="/5F764557" Ref="#PWR?"  Part="1" 
AR Path="/5F9B9AC0/5F764557" Ref="#PWR?"  Part="1" 
AR Path="/5F747973/5F764557" Ref="#PWR0604"  Part="1" 
F 0 "#PWR0604" H 5900 5200 50  0001 C CNN
F 1 "Earth" H 5900 5300 50  0001 C CNN
F 2 "" H 5900 5450 50  0001 C CNN
F 3 "~" H 5900 5450 50  0001 C CNN
	1    5900 5450
	1    0    0    -1  
$EndComp
Text GLabel 9550 3600 2    50   Input ~ 0
ADC_REF
Wire Wire Line
	9550 3600 9500 3600
Wire Wire Line
	9500 3600 9500 3700
Text GLabel 9550 1900 2    50   Input ~ 0
ADC_REF
Wire Wire Line
	9550 1900 9500 1900
Wire Wire Line
	9500 1900 9500 2000
Wire Wire Line
	5700 4050 5600 4050
Wire Wire Line
	5600 4050 5600 3150
Wire Wire Line
	5700 4150 5600 4150
Wire Wire Line
	5600 4150 5600 4350
$Comp
L Device:C C?
U 1 1 5F77426F
P 5500 5600
AR Path="/5F9B9AC0/5F77426F" Ref="C?"  Part="1" 
AR Path="/5F747973/5F77426F" Ref="C603"  Part="1" 
F 0 "C603" H 5615 5646 50  0000 L CNN
F 1 "10n" H 5615 5555 50  0000 L CNN
F 2 "Capacitor_SMD:C_0805_2012Metric" H 5538 5450 50  0001 C CNN
F 3 "~" H 5500 5600 50  0001 C CNN
	1    5500 5600
	1    0    0    -1  
$EndComp
Text GLabel 5500 5750 3    50   Input ~ 0
FILTER_RX
$Comp
L Device:C C?
U 1 1 5F774276
P 5500 4550
AR Path="/5F9B9AC0/5F774276" Ref="C?"  Part="1" 
AR Path="/5F747973/5F774276" Ref="C602"  Part="1" 
F 0 "C602" H 5615 4596 50  0000 L CNN
F 1 "10n" H 5615 4505 50  0000 L CNN
F 2 "Capacitor_SMD:C_0805_2012Metric" H 5538 4400 50  0001 C CNN
F 3 "~" H 5500 4550 50  0001 C CNN
	1    5500 4550
	1    0    0    -1  
$EndComp
$Comp
L power:+5V #PWR?
U 1 1 5F77427C
P 4250 4050
AR Path="/5F9B9AC0/5F77427C" Ref="#PWR?"  Part="1" 
AR Path="/5F747973/5F77427C" Ref="#PWR0601"  Part="1" 
F 0 "#PWR0601" H 4250 3900 50  0001 C CNN
F 1 "+5V" H 4265 4223 50  0000 C CNN
F 2 "" H 4250 4050 50  0001 C CNN
F 3 "" H 4250 4050 50  0001 C CNN
	1    4250 4050
	1    0    0    -1  
$EndComp
$Comp
L Device:R R?
U 1 1 5F774282
P 4250 4200
AR Path="/5F9B9AC0/5F774282" Ref="R?"  Part="1" 
AR Path="/5F747973/5F774282" Ref="R601"  Part="1" 
F 0 "R601" H 4320 4246 50  0000 L CNN
F 1 "10k" H 4320 4155 50  0000 L CNN
F 2 "Resistor_SMD:R_0805_2012Metric" V 4180 4200 50  0001 C CNN
F 3 "~" H 4250 4200 50  0001 C CNN
	1    4250 4200
	1    0    0    -1  
$EndComp
$Comp
L Device:R R?
U 1 1 5F774288
P 4250 4500
AR Path="/5F9B9AC0/5F774288" Ref="R?"  Part="1" 
AR Path="/5F747973/5F774288" Ref="R602"  Part="1" 
F 0 "R602" H 4320 4546 50  0000 L CNN
F 1 "10k" H 4320 4455 50  0000 L CNN
F 2 "Resistor_SMD:R_0805_2012Metric" V 4180 4500 50  0001 C CNN
F 3 "~" H 4250 4500 50  0001 C CNN
	1    4250 4500
	1    0    0    -1  
$EndComp
$Comp
L Device:C C?
U 1 1 5F77428E
P 3850 4500
AR Path="/5F9B9AC0/5F77428E" Ref="C?"  Part="1" 
AR Path="/5F747973/5F77428E" Ref="C601"  Part="1" 
F 0 "C601" H 3965 4546 50  0000 L CNN
F 1 "100n" H 3965 4455 50  0000 L CNN
F 2 "Capacitor_SMD:C_0805_2012Metric" H 3888 4350 50  0001 C CNN
F 3 "~" H 3850 4500 50  0001 C CNN
	1    3850 4500
	1    0    0    -1  
$EndComp
Wire Wire Line
	4250 4350 3850 4350
Connection ~ 4250 4350
Wire Wire Line
	4250 4650 3850 4650
$Comp
L power:Earth #PWR?
U 1 1 5F774297
P 4250 4650
AR Path="/5F9B9AC0/5F774297" Ref="#PWR?"  Part="1" 
AR Path="/5F747973/5F774297" Ref="#PWR0602"  Part="1" 
F 0 "#PWR0602" H 4250 4400 50  0001 C CNN
F 1 "Earth" H 4250 4500 50  0001 C CNN
F 2 "" H 4250 4650 50  0001 C CNN
F 3 "~" H 4250 4650 50  0001 C CNN
	1    4250 4650
	1    0    0    -1  
$EndComp
Connection ~ 4250 4650
$Comp
L Device:R R?
U 1 1 5F77429E
P 4600 4350
AR Path="/5F9B9AC0/5F77429E" Ref="R?"  Part="1" 
AR Path="/5F747973/5F77429E" Ref="R603"  Part="1" 
F 0 "R603" V 4393 4350 50  0000 C CNN
F 1 "1k" V 4484 4350 50  0000 C CNN
F 2 "Resistor_SMD:R_0805_2012Metric" V 4530 4350 50  0001 C CNN
F 3 "~" H 4600 4350 50  0001 C CNN
	1    4600 4350
	0    1    1    0   
$EndComp
Wire Wire Line
	4250 4350 4450 4350
Wire Wire Line
	4750 4350 5500 4350
Wire Wire Line
	5500 3450 5500 4350
$Comp
L Device:R R?
U 1 1 5F7742A7
P 5300 4750
AR Path="/5F9B9AC0/5F7742A7" Ref="R?"  Part="1" 
AR Path="/5F747973/5F7742A7" Ref="R604"  Part="1" 
F 0 "R604" V 5093 4750 50  0000 C CNN
F 1 "1k" V 5184 4750 50  0000 C CNN
F 2 "Resistor_SMD:R_0805_2012Metric" V 5230 4750 50  0001 C CNN
F 3 "~" H 5300 4750 50  0001 C CNN
	1    5300 4750
	0    1    1    0   
$EndComp
$Comp
L power:Earth #PWR?
U 1 1 5F7742AD
P 5100 4800
AR Path="/5F9B9AC0/5F7742AD" Ref="#PWR?"  Part="1" 
AR Path="/5F747973/5F7742AD" Ref="#PWR0603"  Part="1" 
F 0 "#PWR0603" H 5100 4550 50  0001 C CNN
F 1 "Earth" H 5100 4650 50  0001 C CNN
F 2 "" H 5100 4800 50  0001 C CNN
F 3 "~" H 5100 4800 50  0001 C CNN
	1    5100 4800
	1    0    0    -1  
$EndComp
Wire Wire Line
	5100 4800 5100 4750
Wire Wire Line
	5100 4750 5150 4750
Wire Wire Line
	5450 4750 5500 4750
Wire Wire Line
	5500 4750 5500 4700
Wire Wire Line
	5500 5050 5500 4750
Connection ~ 5500 4750
Wire Wire Line
	5500 4400 5500 4350
Connection ~ 5500 4350
Wire Wire Line
	5400 3850 5700 3850
Wire Wire Line
	5400 3750 5700 3750
Wire Notes Line
	3700 3800 3700 4800
Wire Notes Line
	3700 4800 4800 4800
Wire Notes Line
	4800 4800 4800 3800
Wire Notes Line
	4800 3800 3700 3800
Text Notes 3700 4900 0    50   ~ 0
Receive Signal Bias
NoConn ~ 5700 3350
Wire Wire Line
	5700 3450 5500 3450
Text GLabel 5400 3750 0    50   Input ~ 0
Si5351_0
Text GLabel 5400 3850 0    50   Input ~ 0
Si5351_1
$EndSCHEMATC
