(module PCM1804DBR (layer F.Cu)
  (fp_text reference REF** (at 0 0) (layer F.SilkS)
    (effects (font (size 1 1) (thickness .15)))
  )
  (fp_text value DB28 (at 0 0) (layer F.SilkS)
    (effects (font (size 1 1) (thickness .15)))
  )
  (fp_text user "Copyright 2016 Accelerated Designs. All rights reserved." (at 0 0) (layer Cmts.User)
    (effects (font (size .127 .127) (thickness .002)))
  )
  (fp_text user "*" (at -3.683 -5.7998) (layer F.SilkS)
    (effects (font (size 1 1) (thickness .15)))
  )
  (fp_text user "*" (at -3.683 -5.7998) (layer F.Fab)
    (effects (font (size 1 1) (thickness .15)))
  )
  (fp_text user "2.559055E-02in/.65mm" (at -6.477 -3.9) (layer Dwgs.User)
    (effects (font (size 1 1) (thickness .15)))
  )
  (fp_text user ".017in/.432mm" (at 6.477 -4.225) (layer Dwgs.User)
    (effects (font (size 1 1) (thickness .15)))
  )
  (fp_text user ".27in/6.858mm" (at 0 -7.6581) (layer Dwgs.User)
    (effects (font (size 1 1) (thickness .15)))
  )
  (fp_text user ".081in/2.057mm" (at -3.429 7.6581) (layer Dwgs.User)
    (effects (font (size 1 1) (thickness .15)))
  )
  (fp_text user "*" (at -3.683 -5.7998) (layer F.Fab)
    (effects (font (size 1 1) (thickness .15)))
  )
  (fp_text user "*" (at -3.683 -5.7998) (layer F.SilkS)
    (effects (font (size 1 1) (thickness .15)))
  )
  (fp_line (start -2.794 -4.0345) (end -2.794 -4.4155) (layer F.Fab) (width .1524))
  (fp_line (start -2.794 -4.4155) (end -4.1021 -4.4155) (layer F.Fab) (width .1524))
  (fp_line (start -4.1021 -4.4155) (end -4.1021 -4.0345) (layer F.Fab) (width .1524))
  (fp_line (start -4.1021 -4.0345) (end -2.794 -4.0345) (layer F.Fab) (width .1524))
  (fp_line (start -2.794 -3.3845) (end -2.794 -3.7655) (layer F.Fab) (width .1524))
  (fp_line (start -2.794 -3.7655) (end -4.1021 -3.7655) (layer F.Fab) (width .1524))
  (fp_line (start -4.1021 -3.7655) (end -4.1021 -3.3845) (layer F.Fab) (width .1524))
  (fp_line (start -4.1021 -3.3845) (end -2.794 -3.3845) (layer F.Fab) (width .1524))
  (fp_line (start -2.794 -2.7345) (end -2.794 -3.1155) (layer F.Fab) (width .1524))
  (fp_line (start -2.794 -3.1155) (end -4.1021 -3.1155) (layer F.Fab) (width .1524))
  (fp_line (start -4.1021 -3.1155) (end -4.1021 -2.7345) (layer F.Fab) (width .1524))
  (fp_line (start -4.1021 -2.7345) (end -2.794 -2.7345) (layer F.Fab) (width .1524))
  (fp_line (start -2.794 -2.0845) (end -2.794 -2.4655) (layer F.Fab) (width .1524))
  (fp_line (start -2.794 -2.4655) (end -4.1021 -2.4655) (layer F.Fab) (width .1524))
  (fp_line (start -4.1021 -2.4655) (end -4.1021 -2.0845) (layer F.Fab) (width .1524))
  (fp_line (start -4.1021 -2.0845) (end -2.794 -2.0845) (layer F.Fab) (width .1524))
  (fp_line (start -2.794 -1.434501) (end -2.794 -1.815501) (layer F.Fab) (width .1524))
  (fp_line (start -2.794 -1.815501) (end -4.1021 -1.815501) (layer F.Fab) (width .1524))
  (fp_line (start -4.1021 -1.815501) (end -4.1021 -1.434501) (layer F.Fab) (width .1524))
  (fp_line (start -4.1021 -1.434501) (end -2.794 -1.434501) (layer F.Fab) (width .1524))
  (fp_line (start -2.794 -.784501) (end -2.794 -1.165501) (layer F.Fab) (width .1524))
  (fp_line (start -2.794 -1.165501) (end -4.1021 -1.165501) (layer F.Fab) (width .1524))
  (fp_line (start -4.1021 -1.165501) (end -4.1021 -.784501) (layer F.Fab) (width .1524))
  (fp_line (start -4.1021 -.784501) (end -2.794 -.784501) (layer F.Fab) (width .1524))
  (fp_line (start -2.794 -.134501) (end -2.794 -.515501) (layer F.Fab) (width .1524))
  (fp_line (start -2.794 -.515501) (end -4.1021 -.515501) (layer F.Fab) (width .1524))
  (fp_line (start -4.1021 -.515501) (end -4.1021 -.134501) (layer F.Fab) (width .1524))
  (fp_line (start -4.1021 -.134501) (end -2.794 -.134501) (layer F.Fab) (width .1524))
  (fp_line (start -2.794 .515499) (end -2.794 .134499) (layer F.Fab) (width .1524))
  (fp_line (start -2.794 .134499) (end -4.1021 .134499) (layer F.Fab) (width .1524))
  (fp_line (start -4.1021 .134499) (end -4.1021 .515499) (layer F.Fab) (width .1524))
  (fp_line (start -4.1021 .515499) (end -2.794 .515499) (layer F.Fab) (width .1524))
  (fp_line (start -2.794 1.165499) (end -2.794 .784499) (layer F.Fab) (width .1524))
  (fp_line (start -2.794 .784499) (end -4.1021 .784499) (layer F.Fab) (width .1524))
  (fp_line (start -4.1021 .784499) (end -4.1021 1.165499) (layer F.Fab) (width .1524))
  (fp_line (start -4.1021 1.165499) (end -2.794 1.165499) (layer F.Fab) (width .1524))
  (fp_line (start -2.794 1.815499) (end -2.794 1.434499) (layer F.Fab) (width .1524))
  (fp_line (start -2.794 1.434499) (end -4.1021 1.434499) (layer F.Fab) (width .1524))
  (fp_line (start -4.1021 1.434499) (end -4.1021 1.815499) (layer F.Fab) (width .1524))
  (fp_line (start -4.1021 1.815499) (end -2.794 1.815499) (layer F.Fab) (width .1524))
  (fp_line (start -2.794 2.465499) (end -2.794 2.084499) (layer F.Fab) (width .1524))
  (fp_line (start -2.794 2.084499) (end -4.1021 2.084499) (layer F.Fab) (width .1524))
  (fp_line (start -4.1021 2.084499) (end -4.1021 2.465499) (layer F.Fab) (width .1524))
  (fp_line (start -4.1021 2.465499) (end -2.794 2.465499) (layer F.Fab) (width .1524))
  (fp_line (start -2.794 3.115499) (end -2.794 2.734499) (layer F.Fab) (width .1524))
  (fp_line (start -2.794 2.734499) (end -4.1021 2.734499) (layer F.Fab) (width .1524))
  (fp_line (start -4.1021 2.734499) (end -4.1021 3.115499) (layer F.Fab) (width .1524))
  (fp_line (start -4.1021 3.115499) (end -2.794 3.115499) (layer F.Fab) (width .1524))
  (fp_line (start -2.794 3.765499) (end -2.794 3.384499) (layer F.Fab) (width .1524))
  (fp_line (start -2.794 3.384499) (end -4.1021 3.384499) (layer F.Fab) (width .1524))
  (fp_line (start -4.1021 3.384499) (end -4.1021 3.765499) (layer F.Fab) (width .1524))
  (fp_line (start -4.1021 3.765499) (end -2.794 3.765499) (layer F.Fab) (width .1524))
  (fp_line (start -2.794 4.415499) (end -2.794 4.034499) (layer F.Fab) (width .1524))
  (fp_line (start -2.794 4.034499) (end -4.1021 4.034499) (layer F.Fab) (width .1524))
  (fp_line (start -4.1021 4.034499) (end -4.1021 4.415499) (layer F.Fab) (width .1524))
  (fp_line (start -4.1021 4.415499) (end -2.794 4.415499) (layer F.Fab) (width .1524))
  (fp_line (start 2.794 4.0345) (end 2.794 4.4155) (layer F.Fab) (width .1524))
  (fp_line (start 2.794 4.4155) (end 4.1021 4.4155) (layer F.Fab) (width .1524))
  (fp_line (start 4.1021 4.4155) (end 4.1021 4.0345) (layer F.Fab) (width .1524))
  (fp_line (start 4.1021 4.0345) (end 2.794 4.0345) (layer F.Fab) (width .1524))
  (fp_line (start 2.794 3.3845) (end 2.794 3.7655) (layer F.Fab) (width .1524))
  (fp_line (start 2.794 3.7655) (end 4.1021 3.7655) (layer F.Fab) (width .1524))
  (fp_line (start 4.1021 3.7655) (end 4.1021 3.3845) (layer F.Fab) (width .1524))
  (fp_line (start 4.1021 3.3845) (end 2.794 3.3845) (layer F.Fab) (width .1524))
  (fp_line (start 2.794 2.7345) (end 2.794 3.1155) (layer F.Fab) (width .1524))
  (fp_line (start 2.794 3.1155) (end 4.1021 3.1155) (layer F.Fab) (width .1524))
  (fp_line (start 4.1021 3.1155) (end 4.1021 2.7345) (layer F.Fab) (width .1524))
  (fp_line (start 4.1021 2.7345) (end 2.794 2.7345) (layer F.Fab) (width .1524))
  (fp_line (start 2.794 2.0845) (end 2.794 2.4655) (layer F.Fab) (width .1524))
  (fp_line (start 2.794 2.4655) (end 4.1021 2.4655) (layer F.Fab) (width .1524))
  (fp_line (start 4.1021 2.4655) (end 4.1021 2.0845) (layer F.Fab) (width .1524))
  (fp_line (start 4.1021 2.0845) (end 2.794 2.0845) (layer F.Fab) (width .1524))
  (fp_line (start 2.794 1.4345) (end 2.794 1.8155) (layer F.Fab) (width .1524))
  (fp_line (start 2.794 1.8155) (end 4.1021 1.8155) (layer F.Fab) (width .1524))
  (fp_line (start 4.1021 1.8155) (end 4.1021 1.4345) (layer F.Fab) (width .1524))
  (fp_line (start 4.1021 1.4345) (end 2.794 1.4345) (layer F.Fab) (width .1524))
  (fp_line (start 2.794 .7845) (end 2.794 1.1655) (layer F.Fab) (width .1524))
  (fp_line (start 2.794 1.1655) (end 4.1021 1.1655) (layer F.Fab) (width .1524))
  (fp_line (start 4.1021 1.1655) (end 4.1021 .7845) (layer F.Fab) (width .1524))
  (fp_line (start 4.1021 .7845) (end 2.794 .7845) (layer F.Fab) (width .1524))
  (fp_line (start 2.794 .134501) (end 2.794 .515501) (layer F.Fab) (width .1524))
  (fp_line (start 2.794 .515501) (end 4.1021 .515501) (layer F.Fab) (width .1524))
  (fp_line (start 4.1021 .515501) (end 4.1021 .134501) (layer F.Fab) (width .1524))
  (fp_line (start 4.1021 .134501) (end 2.794 .134501) (layer F.Fab) (width .1524))
  (fp_line (start 2.794 -.515499) (end 2.794 -.134499) (layer F.Fab) (width .1524))
  (fp_line (start 2.794 -.134499) (end 4.1021 -.134499) (layer F.Fab) (width .1524))
  (fp_line (start 4.1021 -.134499) (end 4.1021 -.515499) (layer F.Fab) (width .1524))
  (fp_line (start 4.1021 -.515499) (end 2.794 -.515499) (layer F.Fab) (width .1524))
  (fp_line (start 2.794 -1.165499) (end 2.794 -.784499) (layer F.Fab) (width .1524))
  (fp_line (start 2.794 -.784499) (end 4.1021 -.784499) (layer F.Fab) (width .1524))
  (fp_line (start 4.1021 -.784499) (end 4.1021 -1.165499) (layer F.Fab) (width .1524))
  (fp_line (start 4.1021 -1.165499) (end 2.794 -1.165499) (layer F.Fab) (width .1524))
  (fp_line (start 2.794 -1.815499) (end 2.794 -1.434499) (layer F.Fab) (width .1524))
  (fp_line (start 2.794 -1.434499) (end 4.1021 -1.434499) (layer F.Fab) (width .1524))
  (fp_line (start 4.1021 -1.434499) (end 4.1021 -1.815499) (layer F.Fab) (width .1524))
  (fp_line (start 4.1021 -1.815499) (end 2.794 -1.815499) (layer F.Fab) (width .1524))
  (fp_line (start 2.794 -2.465499) (end 2.794 -2.084499) (layer F.Fab) (width .1524))
  (fp_line (start 2.794 -2.084499) (end 4.1021 -2.084499) (layer F.Fab) (width .1524))
  (fp_line (start 4.1021 -2.084499) (end 4.1021 -2.465499) (layer F.Fab) (width .1524))
  (fp_line (start 4.1021 -2.465499) (end 2.794 -2.465499) (layer F.Fab) (width .1524))
  (fp_line (start 2.794 -3.115499) (end 2.794 -2.734499) (layer F.Fab) (width .1524))
  (fp_line (start 2.794 -2.734499) (end 4.1021 -2.734499) (layer F.Fab) (width .1524))
  (fp_line (start 4.1021 -2.734499) (end 4.1021 -3.115499) (layer F.Fab) (width .1524))
  (fp_line (start 4.1021 -3.115499) (end 2.794 -3.115499) (layer F.Fab) (width .1524))
  (fp_line (start 2.794 -3.765499) (end 2.794 -3.384499) (layer F.Fab) (width .1524))
  (fp_line (start 2.794 -3.384499) (end 4.1021 -3.384499) (layer F.Fab) (width .1524))
  (fp_line (start 4.1021 -3.384499) (end 4.1021 -3.765499) (layer F.Fab) (width .1524))
  (fp_line (start 4.1021 -3.765499) (end 2.794 -3.765499) (layer F.Fab) (width .1524))
  (fp_line (start 2.794 -4.415499) (end 2.794 -4.034499) (layer F.Fab) (width .1524))
  (fp_line (start 2.794 -4.034499) (end 4.1021 -4.034499) (layer F.Fab) (width .1524))
  (fp_line (start 4.1021 -4.034499) (end 4.1021 -4.415499) (layer F.Fab) (width .1524))
  (fp_line (start 4.1021 -4.415499) (end 2.794 -4.415499) (layer F.Fab) (width .1524))
  (fp_line (start -2.794 5.2451) (end 2.794 5.2451) (layer F.SilkS) (width .1524))
  (fp_line (start 2.794 5.2451) (end 2.794 4.77364) (layer F.SilkS) (width .1524))
  (fp_line (start 2.794 -5.2451) (end -2.794 -5.2451) (layer F.SilkS) (width .1524))
  (fp_line (start -2.794 -5.2451) (end -2.794 -4.77364) (layer F.SilkS) (width .1524))
  (fp_line (start -2.794 5.2451) (end 2.794 5.2451) (layer F.Fab) (width .1524))
  (fp_line (start 2.794 5.2451) (end 2.794 -5.2451) (layer F.Fab) (width .1524))
  (fp_line (start 2.794 -5.2451) (end -2.794 -5.2451) (layer F.Fab) (width .1524))
  (fp_line (start -2.794 -5.2451) (end -2.794 5.2451) (layer F.Fab) (width .1524))
  (fp_line (start -2.794 4.773638) (end -2.794 5.2451) (layer F.SilkS) (width .1524))
  (fp_line (start 2.794 -4.77364) (end 2.794 -5.2451) (layer F.SilkS) (width .1524))
  (fp_line (start -4.9657 1.434498) (end -4.9657 1.815498) (layer F.SilkS) (width .1524))
  (fp_line (start -4.9657 1.815498) (end -4.7117 1.815498) (layer F.SilkS) (width .1524))
  (fp_line (start -4.7117 1.815498) (end -4.7117 1.434498) (layer F.SilkS) (width .1524))
  (fp_line (start -4.7117 1.434498) (end -4.9657 1.434498) (layer F.SilkS) (width .1524))
  (fp_line (start 4.9657 .784499) (end 4.9657 1.165499) (layer F.SilkS) (width .1524))
  (fp_line (start 4.9657 1.165499) (end 4.7117 1.165499) (layer F.SilkS) (width .1524))
  (fp_line (start 4.7117 1.165499) (end 4.7117 .784499) (layer F.SilkS) (width .1524))
  (fp_line (start 4.7117 .784499) (end 4.9657 .784499) (layer F.SilkS) (width .1524))
  (fp_line (start -4.7117 5.4991) (end -4.7117 -5.4991) (layer F.CrtYd) (width .1524))
  (fp_line (start -4.7117 -5.4991) (end 4.7117 -5.4991) (layer F.CrtYd) (width .1524))
  (fp_line (start 4.7117 -5.4991) (end 4.7117 5.4991) (layer F.CrtYd) (width .1524))
  (fp_line (start 4.7117 5.4991) (end -4.7117 5.4991) (layer F.CrtYd) (width .1524))
  (fp_arc (start 0 -5.2451) (end .3048 -5.2451) (angle 180)(layer F.SilkS) (width .1524))
  (fp_arc (start 0 -5.2451) (end .3048 -5.2451) (angle 180)(layer F.Fab) (width .1524))
  (pad 1 smd rect (at -3.429 -4.225) (size 2.0574 .4318) (layers F.Cu F.Paste F.Mask))
  (pad 2 smd rect (at -3.429 -3.574999) (size 2.0574 .4318) (layers F.Cu F.Paste F.Mask))
  (pad 3 smd rect (at -3.429 -2.925) (size 2.0574 .4318) (layers F.Cu F.Paste F.Mask))
  (pad 4 smd rect (at -3.429 -2.274999) (size 2.0574 .4318) (layers F.Cu F.Paste F.Mask))
  (pad 5 smd rect (at -3.429 -1.625001) (size 2.0574 .4318) (layers F.Cu F.Paste F.Mask))
  (pad 6 smd rect (at -3.429 -.974999) (size 2.0574 .4318) (layers F.Cu F.Paste F.Mask))
  (pad 7 smd rect (at -3.429 -.325001) (size 2.0574 .4318) (layers F.Cu F.Paste F.Mask))
  (pad 8 smd rect (at -3.429 .324998) (size 2.0574 .4318) (layers F.Cu F.Paste F.Mask))
  (pad 9 smd rect (at -3.429 .974999) (size 2.0574 .4318) (layers F.Cu F.Paste F.Mask))
  (pad 10 smd rect (at -3.429 1.624998) (size 2.0574 .4318) (layers F.Cu F.Paste F.Mask))
  (pad 11 smd rect (at -3.429 2.274999) (size 2.0574 .4318) (layers F.Cu F.Paste F.Mask))
  (pad 12 smd rect (at -3.429 2.924998) (size 2.0574 .4318) (layers F.Cu F.Paste F.Mask))
  (pad 13 smd rect (at -3.429 3.574999) (size 2.0574 .4318) (layers F.Cu F.Paste F.Mask))
  (pad 14 smd rect (at -3.429 4.224998) (size 2.0574 .4318) (layers F.Cu F.Paste F.Mask))
  (pad 15 smd rect (at 3.429 4.225) (size 2.0574 .4318) (layers F.Cu F.Paste F.Mask))
  (pad 16 smd rect (at 3.429 3.574999) (size 2.0574 .4318) (layers F.Cu F.Paste F.Mask))
  (pad 17 smd rect (at 3.429 2.925) (size 2.0574 .4318) (layers F.Cu F.Paste F.Mask))
  (pad 18 smd rect (at 3.429 2.274999) (size 2.0574 .4318) (layers F.Cu F.Paste F.Mask))
  (pad 19 smd rect (at 3.429 1.625001) (size 2.0574 .4318) (layers F.Cu F.Paste F.Mask))
  (pad 20 smd rect (at 3.429 .974999) (size 2.0574 .4318) (layers F.Cu F.Paste F.Mask))
  (pad 21 smd rect (at 3.429 .325001) (size 2.0574 .4318) (layers F.Cu F.Paste F.Mask))
  (pad 22 smd rect (at 3.429 -.325001) (size 2.0574 .4318) (layers F.Cu F.Paste F.Mask))
  (pad 23 smd rect (at 3.429 -.974999) (size 2.0574 .4318) (layers F.Cu F.Paste F.Mask))
  (pad 24 smd rect (at 3.429 -1.625001) (size 2.0574 .4318) (layers F.Cu F.Paste F.Mask))
  (pad 25 smd rect (at 3.429 -2.274999) (size 2.0574 .4318) (layers F.Cu F.Paste F.Mask))
  (pad 26 smd rect (at 3.429 -2.925) (size 2.0574 .4318) (layers F.Cu F.Paste F.Mask))
  (pad 27 smd rect (at 3.429 -3.574999) (size 2.0574 .4318) (layers F.Cu F.Paste F.Mask))
  (pad 28 smd rect (at 3.429 -4.225) (size 2.0574 .4318) (layers F.Cu F.Paste F.Mask))
)
