{
  "imagePartialView": "﻿\r\n\r\n<div class=\"col-md-6\">\r\n    <div class=\"prod-info-container\">\r\n        <div class=\"prod-info\">\r\n            <!-- product image -->\r\n                <div class=\"prod-imgs text-center\">\r\n                    <div class=\"monowrap\">\r\n                        \r\n                        <a class=\"setUrl gallery\" data-alt=\"Monoprice FLEXboot Cat6 Ethernet Patch Cable - Snagless RJ45, Stranded, 550MHz, UTP, Pure Bare Copper Wire, 24AWG, 50ft, Yellow - main image\" href=\"https://images.monoprice.com/productlargeimages/98571.jpg\">\r\n                            <img id=\"mono4\" alt=\"Monoprice FLEXboot Cat6 Ethernet Patch Cable - Snagless RJ45, Stranded, 550MHz, UTP, Pure Bare Copper Wire, 24AWG, 50ft, Yellow - main image\" class=\"img-responsive\" src=\"https://images.monoprice.com/productlargeimages/98571.jpg\"   />\r\n                        </a>\r\n\r\n\r\n                        <div class=\"mainImgHover\"></div>\r\n                    </div>\r\n                    <!-- monowrap -->\r\n\r\n                    <div class=\"elastislide-container\">\r\n                        <div id=\"mono4carousel\">\r\n                                                            <div class=\"item lihidable col text-center\">\r\n                                    <input type=\"hidden\" class=\"qtyimgval\" id=\"imgqtyval\" value=\"2\"/>\r\n                                    <a href=\"https://images.monoprice.com/productlargeimages/98571.jpg\" target=\"_blank\">\r\n                                        <img class=\"img-thumb\" alt=\"View product image Monoprice FLEXboot Cat6 Ethernet Patch Cable - Snagless RJ45, Stranded, 550MHz, UTP, Pure Bare Copper Wire, 24AWG, 50ft, Yellow - image 1 of 2\" src=\"https://images.monoprice.com/productsmallimages/98571.jpg\" data-largeimg=\"https://images.monoprice.com/productlargeimages/98571.jpg\" data-mediumimg=\"https://images.monoprice.com/productmediumimages/98571.jpg\" />\r\n                                    </a>\r\n                                </div>\r\n                                <div class=\"item lihidable col text-center\">\r\n                                    <input type=\"hidden\" class=\"qtyimgval\" id=\"imgqtyval\" value=\"2\"/>\r\n                                    <a href=\"https://images.monoprice.com/productlargeimages/98572.jpg\" target=\"_blank\">\r\n                                        <img class=\"img-thumb\" alt=\"View product image Monoprice FLEXboot Cat6 Ethernet Patch Cable - Snagless RJ45, Stranded, 550MHz, UTP, Pure Bare Copper Wire, 24AWG, 50ft, Yellow - image 2 of 2\" src=\"https://images.monoprice.com/productsmallimages/98572.jpg\" data-largeimg=\"https://images.monoprice.com/productlargeimages/98572.jpg\" data-mediumimg=\"https://images.monoprice.com/productmediumimages/98572.jpg\" />\r\n                                    </a>\r\n                                </div>\r\n                        </div>\r\n                        <!-- elastislide-wrapper elastislide-horizontal -->\r\n                    </div>\r\n\r\n                    <div class=\"lightbox-gallerylist\">\r\n                            <a href=\"https://images.monoprice.com/productlargeimages/98571.jpg\" class=\"gallery\"></a>\r\n                            <a href=\"https://images.monoprice.com/productlargeimages/98572.jpg\" class=\"gallery\"></a>\r\n                    </div>\r\n                    <!-- lightbox-gallerylist -->\r\n                </div>\r\n                <!-- prod-imgs text-center -->\r\n                <!--Remove tab for social medai on product page* -->\r\n                <!-- social-share -->\r\n        </div>\r\n        <!-- prod-info -->\r\n    </div>\r\n    <!-- prod-info-container -->\r\n</div>\r\n\r\n\r\n",
  "infoPartialView": "<script>\r\n    _affirm_config = {\r\n        public_api_key: \"6DMB8XTVCV0XXSVS\",\r\n        script: \"https://cdn1.affirm.com/js/v2/affirm.js\"\r\n    };\r\n    (function (m, g, n, d, a, e, h, c) {\r\n        var b = m[n] || {}, k = document.createElement(e), p = document.getElementsByTagName(e)[0], l = function (a, b, c) { return function () { a[b]._.push([c, arguments]) } }; b[d] = l(b, d, \"set\"); var f = b[d]; b[a] = {}; b[a]._ = []; f._ = []; b._ = []; b[a][h] = l(b, a, h); b[c] = function () { b._.push([h, arguments]) }; a = 0; for (c = \"set add save post open empty reset on off trigger ready setProduct\".split(\" \"); a < c.length; a++)f[c[a]] = l(b, d, c[a]); a = 0; for (c = [\"get\", \"token\", \"url\", \"items\"]; a < c.length; a++)f[c[a]] = function () { }; k.async =\r\n            !0; k.src = g[e]; p.parentNode.insertBefore(k, p); delete g[e]; f(g); m[n] = b\r\n    })(window, _affirm_config, \"affirm\", \"checkout\", \"ui\", \"script\", \"ready\", \"jsReady\");\r\n</script>\r\n\r\n<style>\r\n    .promo-modules li {\r\n        width: 100% !important;\r\n    }\r\n    .message-box {\r\n        background-color: #e8e8e8;\r\n        color: #0098aa;\r\n        font-size: 15px;\r\n        font-weight: 600;\r\n        padding: 10px;\r\n        text-align: center;\r\n    }\r\n    a:hover {\r\n        color: black !important;\r\n    }\r\n</style>\r\n<script>\r\n    // Measures product impressions and also tracks a standard\r\n    // pageview for the tag configuration.\r\n    // Product impressions are sent by pushing an impressions object\r\n    // containing one or more impressionFieldObjects.\r\n    dataLayer.push({ ecommerce: null });  // Clear the previous ecommerce object.\r\n    dataLayer.push({\r\n        'ecommerce': {\r\n            'detail': {\r\n                'products': [{\r\n                    'name': 'Monoprice FLEXboot Cat6 Ethernet Patch Cable - Snagless RJ45, Stranded, 550MHz, UTP, Pure Bare Copper Wire, 24AWG, 50ft, Yellow', // Name or ID is required.\r\n                    'id': '9857',\r\n                    'price': '12.99',\r\n                    'brand': 'Monoprice',\r\n                    'category': 'Networking Patch Cables',\r\n                    'variant': ''\r\n                }]\r\n            }\r\n        }\r\n    });\r\n</script>\r\n<script type=\"text/javascript\">\r\n\r\n\r\n                digitalData.page.category = {\r\n        pageType: 'product',\r\n        primaryCategory: 'product',\r\n        subCategory1: '301',\r\n        subCategory2: '30102',\r\n        subCategory3: '3010202'\r\n    };\r\n            digitalData.page.pageInfo.pageName = 'mp:us:product:301:30102:3010202';\r\n    digitalData.product = [{\r\n        productInfo: {\r\n            productID: '9857',\r\n            productGroupID: '1881',\r\n            category: 'Cables',\r\n            merchandising: 'Networking Patch Cables',\r\n            productSubcategory2: 'Cat6 Ethernet Cables',\r\n            stock: 'NA',\r\n            sale: 'NA',\r\n            freeShippingItemLimit: '-1',\r\n            name: 'Monoprice FLEXboot Cat6 Ethernet Patch Cable - Snagless RJ45 Stranded 550MHz UTP Pure Bare Copper Wire 24AWG 50ft Yellow',\r\n            price: '12.99',\r\n            sku: '109857'\r\n        }\r\n    }];\r\n</script>\r\n\r\n\r\n<script type=\"application/ld+json\">\r\n    {\"@context\":\"https://schema.org/\",\"@type\":\"Product\",\"brand\":\"Monoprice\",\"name\":\"Monoprice FLEXboot Cat6 Ethernet Patch Cable - Snagless RJ45 Stranded 550MHz UTP Pure Bare Copper Wire 24AWG 50ft Yellow\",\"@id\":\"https://www.monoprice.com/product?p_id=9857\",\"url\":\"https://www.monoprice.com/product?p_id=9857\",\"description\":\"Save the time and hassle of building Ethernet cables by using fixed length UTP Cat6 Ethernet Network Cables from Monoprice™!The FLEXboot™ Series of cables feature a thinner cable boot protecting the plug retaining clip, which makes it much easier to depress the clip and protective cover.Features: Unshielded Twisted Pair (UTP) Category 6 Ethernet cable24AWG stranded, pure bare copper conductors550MHz bandwidthSnagless cable boot protects the plug retaining clipThinner cable boot makes it easier to depress the clip and protective cover50µm gold plated contactsMonoprice™ Ethernet cables are made of 100% pure bare copper wire, as opposed to copper clad aluminum (CCA) wire, and are therefore fully compliant with UL® Code 444 and National Electrical Code® (NEC®) TIA‑568‑C.2 fire and safety standards, which require pure bare copper wire in communications cables. Support Files: Specification Sheet (Apr 24, 2017)Monoprice™, FLEXboot™, and all Monoprice logos are trademarks of Monoprice Inc. UL® and the UL logo are registered trademarks of UL LLC. NEC® and National Electrical Code® are registered trademarks of the National Fire Protection Association. Updated May 24, 2021  \",\"image\":\"[\\\"https://images.monoprice.com/productlargeimages/98571.jpg\\\",\\\"https://images.monoprice.com/productlargeimages/98572.jpg\\\"]\",\"offers\":{\"@type\":\"Offer\",\"priceCurrency\":\"USD\",\"price\":12.99,\"sku\":\"9857\",\"availability\":\"https://schema.org/InStock\",\"url\":\"https://www.monoprice.com/product?p_id=9857\",\"gtin14\":\"18446600985771\"},\"aggregateRating\":{\"@type\":\"AggregateRating\",\"name\":\"Monoprice FLEXboot Cat6 Ethernet Patch Cable - Snagless RJ45 Stranded 550MHz UTP Pure Bare Copper Wire 24AWG 50ft Yellow\",\"ratingCount\":\"1353\",\"reviewCount\":\"5\",\"ratingValue\":\"4.9\",\"bestRating\":\"5\",\"worstRating\":\"1\"}}\r\n</script>\r\n\r\n<link href=\"//static.www.turnto.com/tra4_3/tra-en_US.css\" rel=\"stylesheet\" />\r\n<link rel=\"StyleSheet\" href=\"/assets/stylesheets/monoprice_turnto.css\" type=\"text/css\" />\r\n\r\n<style type=\"text/css\">\r\n    .couponcode li {\r\n        width: 100% !important;\r\n    }\r\n\r\n    #TTpartnerRegWindow {\r\n        width: 750px;\r\n        height: 500px;\r\n    }\r\n\r\n    #TTpartnerRegFrame {\r\n        height: 90% !important;\r\n    }\r\n\r\n    div.TT4QProductImg.TTrespDesktopLandscapeDisp {\r\n        width: 80px;\r\n        height: 80px;\r\n        top: -25px !important;\r\n    }\r\n\r\n    .TT4QProductImg.TTrespDesktopLandscapeDisp a {\r\n        width: 80px !important;\r\n        height: 80px !important;\r\n    }\r\n\r\n    .TT4QProductImg.TTrespDesktopLandscapeDisp img {\r\n        width: 80px !important;\r\n        height: 80px !important;\r\n    }\r\n</style>\r\n<script type=\"text/javascript\">\r\n    var turnToConfig = {\r\n        siteKey: \"Fbh1j7KwMmRh9Cvsite\",\r\n        setupType: \"staticEmbed\",\r\n        reviewsSetupType: \"staticEmbed\",\r\n        skipCssLoad: true,\r\n        reviewsTeaserFunc: reviewsTeaser,\r\n        iTeaserFunc: qaTeaser,\r\n        reviewsTruncateLineLength: 100,\r\n        chatter: {\r\n            minimumCommentCount: 1\r\n        },\r\n        registration: {\r\n            localGetLoginStatusFunction: localGetLoginStatusFunction,\r\n            localRegistrationUrl: '/TurnToSSO/Index',\r\n            localGetUserInfoFunction: localGetUserInfoFunction,\r\n            localLogoutFunction: localLogoutFunction\r\n        }\r\n    };\r\n    (function () {\r\n        var tt = document.createElement('script'); tt.type = 'text/javascript'; tt.async = true;\r\n        tt.src = document.location.protocol + \"//static.www.turnto.com/traServer4_3/trajs/\" + turnToConfig.siteKey + \"/tra.js\";\r\n        $(document.body).append(tt);\r\n    })();\r\n    function qaTeaser() {\r\n        if (typeof (TurnToItemData) == 'undefined' || typeof (TurnToItemData.counts) == 'undefined') {\r\n            return '';\r\n        } else {\r\n            var answerCount = TurnToItemData.counts.a;\r\n            var questionCount = TurnToItemData.counts.q;\r\n            var teaserContainer = TurnTojQuery(\".TurnToItemTeaser\");\r\n            var teaserHtml = ' | ';\r\n            if (questionCount == 0) {\r\n                teaserHtml = teaserHtml + '<a id=\"askQuestion\"title=\"Ask a Question\" href=\"#questionstab\">Ask a Question</a>';\r\n            } else {\r\n                teaserHtml = teaserHtml + '<a id=\"readQuestions\" title=\"Questions & Answers\" href=\"#QuestionsandAnswers\">' + questionCount + ' Question' + (questionCount == 1 ? '' : 's') + ', ' + answerCount + ' Answer' + (answerCount == 1 ? '' : 's') + '</a>';\r\n            }\r\n            var reviewCount = TurnToItemData.counts.r;\r\n            //if( reviewCount == 0 && questionCount == 0 ) {\r\n            //    teaserHtml += \" [ no review or questions]\";\r\n            //}\r\n            // Fill container with Q&A content\r\n            teaserContainer.html(teaserHtml);\r\n            // Add the appropriate listeners to the links\r\n\r\n            if ($(window).width() > 1200) {\r\n                teaserContainer.find('#readQuestions').click(function (e) {\r\n                    toggleTab('qaTab');\r\n                    infoH = $('.info-row').outerHeight();\r\n                    $(\"html, body\").animate({ scrollTop: $('#QuestionsandAnswers').offset().top - infoH }, 500);\r\n                });\r\n            } else {\r\n                teaserContainer.find('#readQuestions').click(function (e) {\r\n                    $('html, body').animate({\r\n                        scrollTop: $(\"#qnaTab\").offset().top\r\n                    }, 500);\r\n                    $('#qnaTab').trigger('click');\r\n                });\r\n            }\r\n\r\n            if ($(window).width() > 1200) {\r\n                teaserContainer.find('#askQuestion').click(function (e) {\r\n                    toggleTab('qaTab');\r\n                    infoH = $('.info-row').outerHeight();\r\n                    $(\"html, body\").animate({ scrollTop: $('#QuestionsandAnswers').offset().top - infoH }, 500);\r\n                });\r\n            }\r\n            else {\r\n                teaserContainer.find('#askQuestion').click(function (e) {\r\n                    $('html, body').animate({\r\n                        scrollTop: $(\"#qnaTab\").offset().top\r\n                    }, 500);\r\n                    $('#qnaTab').trigger('click');\r\n                });\r\n            }\r\n        }\r\n    }\r\n    function reviewsTeaser() {\r\n        if (typeof (TurnToItemData) == 'undefined' || typeof (TurnToItemData.counts) == 'undefined') {\r\n            return '';\r\n            teaserContainer.find('#readReviews').click(function (e) {\r\n                toggleTab('reviewsTab');\r\n                infoH = $('.info-row').outerHeight();\r\n                $(\"html, body\").animate({ scrollTop: $('#reviews').offset().top - infoH }, 500);\r\n            });\r\n        } else {\r\n            var reviewCount = TurnToItemData.counts.r;\r\n            var teaserContainer = TurnTojQuery(\".TurnToReviewsTeaser\");\r\n            var teaserHtml = '';\r\n            var isUserLogin = \"False\";\r\n            // round the average rating to the nearest tenth\r\n            var rating = Math.round((TurnToItemData.counts.ar + 0.25) * 100.0) / 100.0;\r\n            rating = rating.toString();\r\n            var decimal = parseInt(rating.substring(2, 3))\r\n            rating = rating.substring(0, 1) + \"-\" + (decimal >= 5 ? '5' : '0')\r\n            if (reviewCount == 0) {\r\n                teaserHtml = '<div class=\"TT2center TTratingBox TTrating-0-0\"></div> ';\r\n                teaserHtml += '<a id=\"writeReview\" title=\"Review\" href=\"javascript:void(0)\">Write a Review</a>';\r\n            } else {\r\n                teaserHtml = '<div class=\"TTratingBox TTrating-' + rating + '\"></div><a id=\"readReviews\" title=\"Reviews\"href=\"javascript:void(0)\">' + reviewCount + ' Review' + (reviewCount == 1 ? '' : 's') + '</a>';\r\n            }\r\n            teaserContainer.html(teaserHtml);\r\n            // Listener on 'read reviews' link\r\n            if ($(window).width() > 1200) {\r\n                teaserContainer.find('#readReviews').click(function (e) {\r\n                    toggleTab('reviewsTab');\r\n                    infoH = $('.info-row').outerHeight();\r\n                    $(\"html, body\").animate({ scrollTop: $('#reviews').offset().top - infoH }, 500);\r\n                });\r\n            } else {\r\n                teaserContainer.find('#readReviews').click(function (e) {\r\n                    $('html, body').animate({\r\n                        scrollTop: $(\"#revTab\").offset().top\r\n                    }, 500);\r\n                    $('#revTab').trigger('click');\r\n                });\r\n            }\r\n\r\n            // Listener on 'write review' link\r\n            teaserContainer.find('#writeReview').click(function (e) {\r\n                TurnTo.writeReview();\r\n            });\r\n        }\r\n    }\r\n    function toggleTab(tab) {\r\n        $('.infotabs.responsive a[href=\"#' + tab + '\"]').tab('show');\r\n    }\r\n    function localGetLoginStatusFunction(callbackFn) {\r\n\r\n        getTurnToSSOInfo(callbackFn);\r\n    }\r\n    function localGetUserInfoFunction(callbackFn) {\r\n\r\n        getTurnToSSOInfo(callbackFn);\r\n    }\r\n    function localLogoutFunction(callbackFn) {\r\n\r\n        $.ajax({\r\n            type: \"POST\",\r\n            url: \"/product/logoutTurnToSSO\",\r\n            contentType: \"application/json; charset=utf-8\",\r\n            dataType: \"json\",\r\n            success: function (data) {\r\n                callbackFn({ user_auth_token: null });\r\n            },\r\n            error: function () {\r\n                location.href = '/StaticContent/generalerror';\r\n            }\r\n        });\r\n    }\r\n\r\n    function getTurnToSSOInfo(callbackFn) {\r\n        var isLogin = false, turnto_token = \"\", turnto_first_name = \"\", turnto_last_name = \"\", turnto_email_address = \"\", turnto_signature = \"\";\r\n\r\n        $.ajax({\r\n            type: \"POST\",\r\n            url: \"/product/getTurnToSSOinfo\",\r\n            contentType: \"application/json; charset=utf-8\",\r\n            dataType: \"json\",\r\n            success: function (data) {\r\n                if (data != null) {\r\n                    isLogin = data.IsLogin;\r\n\r\n                    turnto_token = data.turnto_token;\r\n                    turnto_first_name = data.turnto_first_name;\r\n                    turnto_last_name = data.turnto_last_name;\r\n                    turnto_email_address = data.turnto_email_address;\r\n                    turnto_signature = data.turnto_signature;\r\n\r\n                    if (isLogin) {\r\n\r\n                        var obj = {};\r\n                        obj.user_auth_token = turnto_token;\r\n                        obj.first_name = turnto_first_name;\r\n                        obj.last_name = turnto_last_name;\r\n                        obj.email = turnto_email_address;\r\n                        obj.email_confirmed = true;\r\n\r\n\r\n                        callbackFn(obj, turnto_signature);\r\n                    }\r\n                    else {\r\n                        callbackFn({ user_auth_token: null });\r\n                    }\r\n                }\r\n            },\r\n            error: function () {\r\n                location.href = '/StaticContent/generalerror';\r\n            }\r\n        });\r\n    }\r\n\r\n\r\n</script>\r\n\r\n<div class=\"cart-right col-md-6\" unbxdparam_sku=\"9857\">\r\n    <div id=\"addCart\">\r\n        <div class=\"cart-sec-1 clear1\">\r\n            <div class=\"cart-copy\">\r\n                <div class=\"product-name\" itemprop=\"name\"> Monoprice FLEXboot Cat6 Ethernet Patch Cable - Snagless RJ45, Stranded, 550MHz, UTP, Pure Bare Copper Wire, 24AWG, 50ft, Yellow </div>\r\n                <div class=\"product-code\" data-modelid=\"9857\">Product # 9857</div>               \r\n                        <div class=\"product-barcode\">UPC # 18446600985771</div>\r\n                <div class=\"top-cols\">\r\n                    <div class=\"col\">\r\n                        <div class=\"icon-sec\">\r\n                            <script type=\"text/javascript\">\r\n                                var TurnToItemSku = \"9857\";\r\n                                var IsMobile = \"False\";\r\n                            </script>\r\n                            <script type=\"text/javascript\" src=\"//static.www.turnto.com/sitedata/Fbh1j7KwMmRh9Cvsite/v4_3/9857/d/itemjs\"></script>\r\n                            <span class=\"TurnToReviewsTeaser\"></span>\r\n                            <span class=\"TurnToItemTeaser\"></span>\r\n                            \r\n                            \r\n                        </div>\r\n                    </div>\r\n                    \r\n                </div>\r\n                                <div class=\"review-sec clear1\">\r\n                    <div class=\"sec-part-left pull-left\">\r\n                        <div class=\"price-sec\">\r\n                            <span class=\"sale-price\">\r\n$12.99                            </span>                            \r\n\r\n                            \r\n                        </div><!-- price-sec-->\r\n                        <div class=\"mpselectmini\"></div>\r\n                        <script type=\"text/javascript\">\r\n                            var pid = $('.product-code').data('modelid');\r\n                                                                             //if (pid == 15365 || pid == 21711) {\r\n                                                                                                                                                                                                                                                                                                    //    $(\".mpselectmini\").html(\"<p>*Save An Extra $40 With Code 'MINI40' + Free Standard US Shipping*</p>\");\r\n                                                                                                                                                                                                                                                                                                    //    $(\".mpselectmini p\").css({\r\n                                                                                                                                                                                                                                                                                                    //        margin: \"10px 0\",\r\n                                                                                                                                                                                                                                                                                                    //        fontSize: \"18px\",\r\n                                                                                                                                                                                                                                                                                                    //        color: \"#00a7bb\",\r\n                                                                                                                                                                                                                                                                                                    //        fontWeight: \"600\"\r\n                                                                                                                                                                                                                                                                                                    //    });\r\n                                                                                                                                                                                                                                                                                                   //}\r\n                        </script>\r\n                    </div>\r\n                    \r\n                    \r\n                </div>\r\n              \r\n                    <p style=\"font-size:14px\"class=\"affirm-as-low-as\" data-page-type=\"product\" data-amount=1299></p>\r\n                    <p style=\"font-size:11px\">*Affirm is not available for business or international orders</p>\r\n            </div>\r\n            <!-- cart-price-->\r\n        </div>\r\n        <!-- cart-sec-1 clear1-->\r\n        <div class=\"cart-section\">\r\n<div class=\"mp-prod-attrform-container\">\r\n\r\n      <form class=\"mp-prod-attrform\" data-mp-attrname=\"Length\" data-mp-attrselval=\"50ft\">\r\n\r\n          <span class=\"mp-prod-attrform-label\">\r\n              <span class=\"mp-prod-attrform-attr-name \">Length:</span>\r\n              <span class=\"mp-prod-attrform-attr-value\">50ft</span>\r\n          </span>\r\n          <div class=\"mp-prod-attrform-attr-values\">\r\n                              <span class=\"size-attr attr-responsive\"\r\n                                    data-mp-attrval=\"0.5ft\"\r\n                                    data-html=\"\" data-trigger=\"\" data-title=\"\" title=\"0.5ft\">0.5ft</span>\r\n                              <span class=\"size-attr attr-responsive\"\r\n                                    data-mp-attrval=\"1ft\"\r\n                                    data-html=\"\" data-trigger=\"\" data-title=\"\" title=\"1ft\">1ft</span>\r\n                              <span class=\"size-attr attr-responsive\"\r\n                                    data-mp-attrval=\"2ft\"\r\n                                    data-html=\"\" data-trigger=\"\" data-title=\"\" title=\"2ft\">2ft</span>\r\n                              <span class=\"size-attr attr-responsive\"\r\n                                    data-mp-attrval=\"3ft\"\r\n                                    data-html=\"\" data-trigger=\"\" data-title=\"\" title=\"3ft\">3ft</span>\r\n                              <span class=\"size-attr attr-responsive\"\r\n                                    data-mp-attrval=\"5ft\"\r\n                                    data-html=\"\" data-trigger=\"\" data-title=\"\" title=\"5ft\">5ft</span>\r\n                              <span class=\"size-attr attr-responsive na\"\r\n                                    data-mp-attrval=\"2m\"\r\n                                    data-html=\"true\" data-trigger=\"hover focus\" data-title=\"&lt;i class=&quot;fa fa-exclamation-circle&quot;&gt;&lt;/i&gt; Not Available\" title=\"2m\">2m</span>\r\n                              <span class=\"size-attr attr-responsive outofstock\"\r\n                                    data-mp-attrval=\"7ft\"\r\n                                    data-html=\"true\" data-trigger=\"hover focus\" data-title=\"&lt;i class=&quot;fa fa-exclamation-circle&quot;&gt;&lt;/i&gt; Out of Stock\" title=\"7ft\">7ft</span>\r\n                              <span class=\"size-attr attr-responsive na\"\r\n                                    data-mp-attrval=\"3m\"\r\n                                    data-html=\"true\" data-trigger=\"hover focus\" data-title=\"&lt;i class=&quot;fa fa-exclamation-circle&quot;&gt;&lt;/i&gt; Not Available\" title=\"3m\">3m</span>\r\n                              <span class=\"size-attr attr-responsive outofstock\"\r\n                                    data-mp-attrval=\"10ft\"\r\n                                    data-html=\"true\" data-trigger=\"hover focus\" data-title=\"&lt;i class=&quot;fa fa-exclamation-circle&quot;&gt;&lt;/i&gt; Out of Stock\" title=\"10ft\">10ft</span>\r\n                              <span class=\"size-attr attr-responsive outofstock\"\r\n                                    data-mp-attrval=\"14ft\"\r\n                                    data-html=\"true\" data-trigger=\"hover focus\" data-title=\"&lt;i class=&quot;fa fa-exclamation-circle&quot;&gt;&lt;/i&gt; Out of Stock\" title=\"14ft\">14ft</span>\r\n                              <span class=\"size-attr attr-responsive na\"\r\n                                    data-mp-attrval=\"5m\"\r\n                                    data-html=\"true\" data-trigger=\"hover focus\" data-title=\"&lt;i class=&quot;fa fa-exclamation-circle&quot;&gt;&lt;/i&gt; Not Available\" title=\"5m\">5m</span>\r\n                              <span class=\"size-attr attr-responsive\"\r\n                                    data-mp-attrval=\"20ft\"\r\n                                    data-html=\"\" data-trigger=\"\" data-title=\"\" title=\"20ft\">20ft</span>\r\n                              <span class=\"size-attr attr-responsive na\"\r\n                                    data-mp-attrval=\"7m\"\r\n                                    data-html=\"true\" data-trigger=\"hover focus\" data-title=\"&lt;i class=&quot;fa fa-exclamation-circle&quot;&gt;&lt;/i&gt; Not Available\" title=\"7m\">7m</span>\r\n                              <span class=\"size-attr attr-responsive\"\r\n                                    data-mp-attrval=\"25ft\"\r\n                                    data-html=\"\" data-trigger=\"\" data-title=\"\" title=\"25ft\">25ft</span>\r\n                              <span class=\"size-attr attr-responsive\"\r\n                                    data-mp-attrval=\"30ft\"\r\n                                    data-html=\"\" data-trigger=\"\" data-title=\"\" title=\"30ft\">30ft</span>\r\n                              <span class=\"size-attr attr-responsive na\"\r\n                                    data-mp-attrval=\"10m\"\r\n                                    data-html=\"true\" data-trigger=\"hover focus\" data-title=\"&lt;i class=&quot;fa fa-exclamation-circle&quot;&gt;&lt;/i&gt; Not Available\" title=\"10m\">10m</span>\r\n                              <span class=\"size-attr attr-responsive na\"\r\n                                    data-mp-attrval=\"15m\"\r\n                                    data-html=\"true\" data-trigger=\"hover focus\" data-title=\"&lt;i class=&quot;fa fa-exclamation-circle&quot;&gt;&lt;/i&gt; Not Available\" title=\"15m\">15m</span>\r\n                              <span class=\"size-attr attr-responsive selected\"\r\n                                    data-mp-attrval=\"50ft\"\r\n                                    data-html=\"\" data-trigger=\"\" data-title=\"\" title=\"50ft\">50ft</span>\r\n                              <span class=\"size-attr attr-responsive\"\r\n                                    data-mp-attrval=\"75ft\"\r\n                                    data-html=\"\" data-trigger=\"\" data-title=\"\" title=\"75ft\">75ft</span>\r\n                              <span class=\"size-attr attr-responsive\"\r\n                                    data-mp-attrval=\"100ft\"\r\n                                    data-html=\"\" data-trigger=\"\" data-title=\"\" title=\"100ft\">100ft</span>\r\n\r\n          </div>\r\n      </form>\r\n      <form class=\"mp-prod-attrform\" data-mp-attrname=\"Color\" data-mp-attrselval=\"Yellow\">\r\n\r\n          <span class=\"mp-prod-attrform-label\">\r\n              <span class=\"mp-prod-attrform-attr-name \">Color:</span>\r\n              <span class=\"mp-prod-attrform-attr-value\">Yellow</span>\r\n          </span>\r\n          <div class=\"mp-prod-attrform-attr-values\">\r\n                              <span class=\"color-attr attr-responsive-color black\"\r\n                                    data-mp-attrval=\"Black\"\r\n                                    data-mp-eta=\"\"\r\n                                    data-html=\"\" data-trigger=\"\" data-title=\"\" title=\"black\">\r\n                                  <span class=\"color-val\" style=\"background:black\"></span>\r\n                                  <span class=\"sr-only\" style=\"text-transform:capitalize\">black </span>\r\n                              </span>\r\n                              <span class=\"color-attr attr-responsive-color blue outofstock\"\r\n                                    data-mp-attrval=\"Blue\"\r\n                                    data-mp-eta=\"\"\r\n                                    data-html=\"true\" data-trigger=\"hover focus\" data-title=\"&lt;i class=&quot;fa fa-exclamation-circle&quot;&gt;&lt;/i&gt; Out of Stock\" title=\"blue\">\r\n                                  <span class=\"color-val\" style=\"background:blue\"></span>\r\n                                  <span class=\"sr-only\" style=\"text-transform:capitalize\">blue </span>\r\n                                      <span class=\"slash\"></span>\r\n                              </span>\r\n                              <span class=\"color-attr attr-responsive-color gray\"\r\n                                    data-mp-attrval=\"Gray\"\r\n                                    data-mp-eta=\"\"\r\n                                    data-html=\"\" data-trigger=\"\" data-title=\"\" title=\"gray\">\r\n                                  <span class=\"color-val\" style=\"background:gray\"></span>\r\n                                  <span class=\"sr-only\" style=\"text-transform:capitalize\">gray </span>\r\n                              </span>\r\n                              <span class=\"color-attr attr-responsive-color green\"\r\n                                    data-mp-attrval=\"Green\"\r\n                                    data-mp-eta=\"\"\r\n                                    data-html=\"\" data-trigger=\"\" data-title=\"\" title=\"green\">\r\n                                  <span class=\"color-val\" style=\"background:green\"></span>\r\n                                  <span class=\"sr-only\" style=\"text-transform:capitalize\">green </span>\r\n                              </span>\r\n                              <span class=\"color-attr attr-responsive-color orange\"\r\n                                    data-mp-attrval=\"Orange\"\r\n                                    data-mp-eta=\"\"\r\n                                    data-html=\"\" data-trigger=\"\" data-title=\"\" title=\"orange\">\r\n                                  <span class=\"color-val\" style=\"background:orange\"></span>\r\n                                  <span class=\"sr-only\" style=\"text-transform:capitalize\">orange </span>\r\n                              </span>\r\n                              <span class=\"color-attr attr-responsive-color pink na\"\r\n                                    data-mp-attrval=\"Pink\"\r\n                                    data-mp-eta=\"\"\r\n                                    data-html=\"true\" data-trigger=\"hover focus\" data-title=\"&lt;i class=&quot;fa fa-exclamation-circle&quot;&gt;&lt;/i&gt; Not Available\" title=\"pink\">\r\n                                  <span class=\"color-val\" style=\"background:pink\"></span>\r\n                                  <span class=\"sr-only\" style=\"text-transform:capitalize\">pink </span>\r\n                                      <span class=\"slash\"></span>\r\n                              </span>\r\n                              <span class=\"color-attr attr-responsive-color purple\"\r\n                                    data-mp-attrval=\"Purple\"\r\n                                    data-mp-eta=\"\"\r\n                                    data-html=\"\" data-trigger=\"\" data-title=\"\" title=\"purple\">\r\n                                  <span class=\"color-val\" style=\"background:purple\"></span>\r\n                                  <span class=\"sr-only\" style=\"text-transform:capitalize\">purple </span>\r\n                              </span>\r\n                              <span class=\"color-attr attr-responsive-color red\"\r\n                                    data-mp-attrval=\"Red\"\r\n                                    data-mp-eta=\"\"\r\n                                    data-html=\"\" data-trigger=\"\" data-title=\"\" title=\"red\">\r\n                                  <span class=\"color-val\" style=\"background:red\"></span>\r\n                                  <span class=\"sr-only\" style=\"text-transform:capitalize\">red </span>\r\n                              </span>\r\n                              <span class=\"color-attr attr-responsive-color white\"\r\n                                    data-mp-attrval=\"White\"\r\n                                    data-mp-eta=\"\"\r\n                                    data-html=\"\" data-trigger=\"\" data-title=\"\" title=\"white\">\r\n                                  <span class=\"color-val\" style=\"background:white\"></span>\r\n                                  <span class=\"sr-only\" style=\"text-transform:capitalize\">white </span>\r\n                              </span>\r\n                              <span class=\"color-attr attr-responsive-color yellow selected\"\r\n                                    data-mp-attrval=\"Yellow\"\r\n                                    data-mp-eta=\"\"\r\n                                    data-html=\"\" data-trigger=\"\" data-title=\"\" title=\"yellow  - selected\">\r\n                                  <span class=\"color-val color-selected\" style=\"background:yellow\"></span>\r\n                                  <span class=\"sr-only\" style=\"text-transform:capitalize\">yellow  - selected</span>\r\n                              </span>\r\n\r\n          </div>\r\n      </form>\r\n      <form class=\"mp-prod-attrform\" data-mp-attrname=\"Pack Size\" data-mp-attrselval=\"1 Pack\">\r\n\r\n          <span class=\"mp-prod-attrform-label\">\r\n              <span class=\"mp-prod-attrform-attr-name \">Pack Size:</span>\r\n              <span class=\"mp-prod-attrform-attr-value\">1 Pack</span>\r\n          </span>\r\n          <div class=\"mp-prod-attrform-attr-values\">\r\n                              <span class=\"size-attr attr-responsive selected\"\r\n                                    data-mp-attrval=\"1 Pack\"\r\n                                    data-html=\"\" data-trigger=\"\" data-title=\"\" title=\"1 Pack\">1 Pack</span>\r\n                              <span class=\"size-attr attr-responsive na\"\r\n                                    data-mp-attrval=\"12 Pack\"\r\n                                    data-html=\"true\" data-trigger=\"hover focus\" data-title=\"&lt;i class=&quot;fa fa-exclamation-circle&quot;&gt;&lt;/i&gt; Not Available\" title=\"12 Pack\">12 Pack</span>\r\n                              <span class=\"size-attr attr-responsive na\"\r\n                                    data-mp-attrval=\"5 Pack\"\r\n                                    data-html=\"true\" data-trigger=\"hover focus\" data-title=\"&lt;i class=&quot;fa fa-exclamation-circle&quot;&gt;&lt;/i&gt; Not Available\" title=\"5 Pack\">5 Pack</span>\r\n\r\n          </div>\r\n      </form>\r\n\r\n\r\n</div>\r\n\r\n<script>\r\n  var MPI = window.MPI = window.MPI || {};\r\n  MPI.ProductAttributes = MPI.ProductAttributes || {};\r\n  MPI.ProductAttributes.pid = 9857; // current PID. This may be different with the one in the URL if the page was loaded in ajax.\r\n</script>            <div class=\"qty-tools tool\">\r\n\r\n<style type=\"text/css\">\r\n    .imgContainer {\r\n        float: left;\r\n        display: inline-block;\r\n    }\r\n    .wrapper {        \r\n        display:none !important;\r\n    }    \r\n</style>\r\n<script>    \r\n    $(function() {\r\n        var $select=$(\".qty-scroll\");\r\n        for(i=1;i<=1000;i++) {\r\n            $select.append($('<option></option>').val(i).html(i))\r\n        }\r\n    });\r\n</script>\r\n\r\n<div class=\"add-to-cart-form-container\">\r\n\r\n    <form class=\"add-to-cart-form\" method=\"post\" action=\"https://www.monoprice.com/cart\">\r\n\r\n        <div class=\"qty-tool-opts clear1\">\r\n            <div class=\"qty-text pull-left\">\r\n                <span class=\"id-icons-qty-label\">Qty:</span>\r\n                <span id=\"qty-default-section\">\r\n                    <button id=\"qtyminus\" class=\"id-icons minus\" title=\"Decrease Quantity\">-</button>\r\n                    <input type=\"text\" value=\"1\" class=\"text-center\" size=\"2\" maxlength=\"5\" id=\"add-to-cart-qty\" name=\"qty\" onchange=\" GetQtyValue(this.value);\" onkeypress=\"return blockEvent(event);\">\r\n                    <button id=\"qtyplus\" class=\"id-icons plus\" title=\"Increase Quantity\">+</button>\r\n                </span>\r\n                <!---Mobile/Tablet view scroll section start-->\r\n                <span id=\"qty-scroll-section\" style=\"position: relative;z-index: 100;\">\r\n                    <select class=\"qty-scroll\" onchange=\"GetQtyValue2(this.value);\" style=\"height:33px;border:0px;background-color:#e8e8e8;width:62px;\"></select>                    \r\n                </span>\r\n                <!---Mobile/Tablet view scroll section end-->\r\n            </div>            \r\n            <!-- qty-text-->\r\n            <div class=\"cart-btns\">\r\n                <div class=\"btn-module module-prod\">\r\n                    <div class=\"addtocart-btn \">\r\n                        <input type=\"hidden\" id=\"add-to-cart-pid\" name=\"p_id\" value=\"9857\" />\r\n                            <a href=\"#\" id=\"addtocartqty\" title=\"Add to Cart\" class=\"btn-add-to-cart fw-bld-700 prod-addto\" onclick=\"$('.add-to-cart-form').submit(); return false;\" modelparam_pid=\"9857\" unbxdparam_qty=\"1\" unbxdattr=\"AddToCart\" unbxdparam_sku=\"9789\" data-action=\"product_page\" data-product-label='9857 - Monoprice FLEXboot Cat6 Ethernet Patch Cable - Snagless RJ45, Stranded, 550MHz, UTP, Pure Bare Copper Wire, 24AWG, 50ft, Yellow'>Add to Cart</a>\r\n                    </div>\r\n                    <!-- addtocart-btn-->\r\n                </div>\r\n\r\n                <div class=\"btn-module \">\r\n                    <a id=\"addtowishlist\" title=\"Add to Wishlist\" href=\"https://www.monoprice.com/product/productsavedlistupdate?p_id=9857&p_quantity=1\" class=\"btn btn-add-to-wishlist prod-cartbutton\"\r\n                      onclick=\"linkTrack('addToWishlist'); _gaq.push(['_trackEvent', 'Live Chat', 'Linked Clicked', 'Product Detail Page']);\"><i class=\"fa fa-heart-o fa-1\" aria-hidden=\"true\"></i>Add to Wishlist</a>\r\n                </div>\r\n                <!-- btn-module-->\r\n            </div>\r\n        </div>\r\n\r\n        <!-- qty-tool-opts-->\r\n        <div id=\"ShipDate\" class=\"stock-msg\">\r\n                <i class=\"fa fa-check clr-link\"></i> <span class=\"in-stock fw-bld-700\"> <span>In Stock</span> </span>\r\n            This item should ship today (1/6/2022) if ordered <span class='fw-bld-700'>within  36 minutes</span>\r\n        </div>\r\n        <!-- ShipDate-->\r\n\r\n        <div id=\"wallmount_icons\">\r\n            <div>\r\n                                                            </div>\r\n        </div>\r\n    </form>\r\n\r\n</div>\r\n\r\n<script>     \r\n    function GetQtyValue(value) {\r\n        $('#addtocartqty').attr(\"unbxdparam_qty\", value);\r\n        return false;\r\n    }\r\n    $(\"#qtyminus\").on('click', function () {\r\n        var qty = $('#add-to-cart-qty').val();\r\n        $('#addtocartqty').attr(\"unbxdparam_qty\", qty);\r\n    });\r\n    $(\"#qtyplus\").on('click', function () {\r\n        var qty = $('#add-to-cart-qty').val();\r\n        $('#addtocartqty').attr(\"unbxdparam_qty\", qty);\r\n    });\r\n\r\n    function blockEvent(event) {\r\n        if (event.keyCode == 13)\r\n            return false;\r\n    }\r\n\r\n    function GetQtyValue2(value) {\r\n        var dropdownvalue=$('.qty-scroll').val();\r\n        $('#add-to-cart-qty').val(dropdownvalue);\r\n        $('#addtocartqty').attr(\"unbxdparam_qty\",value);\r\n        return false;\r\n    }  \r\n</script>            </div>\r\n            <!-- qty-tools tool-->\r\n        </div>\r\n        <!-- cart-section bg-clr-gray -->\r\n        <div class=\"cart-sec-3\">\r\n            <div class=\"panel-group\" id=\"accordion\">\r\n                            </div>\r\n            <!-- panel-group -->\r\n        </div>\r\n        <!-- cart-sec-3-->\r\n        <!-- Pricing Module -->\r\n            <!-- Volume Pricing-->\r\n            <div class=\"text-right\">\r\n                <a class=\"clr-link login-link\" title=\"Member Pricing\" href=\"https://www.monoprice.com/myaccount/index?er=4&amp;return_page=memberprice&amp;p_id=9857&amp;c_id=301&amp;cp_id=30102&amp;cs_id=3010202\" role=\"link\" tabindex=\"0\">(Log In to see Member Pricing)</a>\r\n            </div>\r\n            <div id=\"volumePricing\" class=\"module-body\">\r\n                <div class=\"m-temp-wrapper logged-out\">\r\n                    <div class=\"cart-sec-3\">\r\n                        <div class=\"panel-group\" id=\"accordion\">\r\n                            <div class=\"panel panel-default\">\r\n                                <div class=\"panel-heading\">\r\n                                    <h4 class=\"panel-title\">\r\n                                        <a href=\"#collapseTwo\" title=\"Volume Pricing\" class=\"collapsed\">\r\n                                            Volume Pricing\r\n                                        </a>\r\n                                    </h4>\r\n                                </div>\r\n                                <div id=\"collapseTwo\" class=\"panel-collapse collapse \">\r\n                                    <div class=\"panel-body volume-table clear1\">\r\n                                            <div class=\"volume-info\">\r\n                                                <span class=\"qty\">Qty: 1 </span>\r\n                                                <span class=\"price\">$12.99</span>\r\n                                            </div>\r\n                                            <div class=\"volume-info\">\r\n                                                <span class=\"qty\">Qty: 2-9 </span>\r\n                                                <span class=\"price\">$12.73</span>\r\n                                            </div>\r\n                                            <div class=\"volume-info\">\r\n                                                <span class=\"qty\">Qty: 10-19 </span>\r\n                                                <span class=\"price\">$12.47</span>\r\n                                            </div>\r\n                                            <div class=\"volume-info\">\r\n                                                <span class=\"qty\">Qty: 20-49 </span>\r\n                                                <span class=\"price\">$12.21</span>\r\n                                            </div>\r\n                                            <div class=\"volume-info\">\r\n                                                <span class=\"qty\">Qty: 50+ </span>\r\n                                                <span class=\"price\">$11.69</span>\r\n                                            </div>\r\n\r\n                                    </div>\r\n                                </div>\r\n                            </div>\r\n                        </div>\r\n                        <div class=\"business-copy m-view-only\">\r\n                            <p>To see and take advantage of our member pricing <a href=\"https://www.monoprice.com/myaccount/myaccount\" class=\"clr-back fw-bld-700\">sign up for a business account</a> or <a href=\"https://www.monoprice.com/help/index?pn=contact\" class=\"clr-back fw-bld-700\">contact</a> our sales team.</p>\r\n                            <!-- removing link \"Learn more about Monoprice Business\"for mobile view-->\r\n\r\n                        </div>\r\n                    </div>\r\n                </div>\r\n            </div>\r\n        <!--End Pricing Module -->\r\n    </div>\r\n    <!-- #addCart -->\r\n        <div class=\"business-copy d-view-only hidden-xs\">\r\n            <p>To see and take advantage of our member pricing <a href=\"https://www.monoprice.com/myaccount/myaccount\" class=\"clr-back fw-bld-700\">sign up for a business account</a> or <a href=\"https://www.monoprice.com/help/index?pn=contact\" class=\"clr-back fw-bld-700\">contact</a> our sales team.</p>\r\n            \r\n        </div>\r\n    <!-- Price Module -->\r\n</div>\r\n",
  "descPartialView": "\r\n\r\n        <div class=\"n-prod-section mobile-accord\" id=\"description\">\r\n                    <div class=\"n-section-title\">\r\n                        <span class=\"hidden module-heading\">Description</span>\r\n                        <h3 class=\"fw-bld-700\"></h3>\r\n                        \r\n                    </div>\r\n                    <div class=\"clr-gray module-body mp-mobile-spin-container\">\r\n\r\n                        <div class=\"container\">\r\n\t<div class=\"row\">\r\n\t\t<div class=\"col-xs-12 col-sm-10 col-sm-offset-1 col-md-10\">\r\n\t\t\t<p>\r\n\t\t\t\tSave the time and hassle of building Ethernet cables by using fixed length UTP Cat6 Ethernet Network Cables from Monoprice&trade;!</p>\r\n\t\t\t<p>\r\n\t\t\t\tThe FLEXboot&trade; Series of cables feature a thinner cable boot protecting the plug retaining clip, which makes it much easier to depress the clip and protective cover.</p>\r\n\t\t\t<p>\r\n\t\t\t\t<span style=\"font-weight: bold;\">Features: </span></p>\r\n\t\t\t<ul>\r\n\t\t\t\t<li>\r\n\t\t\t\t\tUnshielded Twisted Pair (UTP) Category 6 Ethernet cable</li>\r\n\t\t\t\t<li>\r\n\t\t\t\t\t24AWG stranded, pure bare copper conductors</li>\r\n\t\t\t\t<li>\r\n\t\t\t\t\t550MHz bandwidth</li>\r\n\t\t\t\t<li>\r\n\t\t\t\t\tSnagless cable boot protects the plug retaining clip</li>\r\n\t\t\t\t<li>\r\n\t\t\t\t\tThinner cable boot makes it easier to depress the clip and protective cover</li>\r\n\t\t\t\t<li>\r\n\t\t\t\t\t50&micro;m gold plated contacts</li>\r\n\t\t\t</ul>\r\n\t\t\t<br />\r\n\t\t\t<p>\r\n\t\t\t\tMonoprice&trade; Ethernet cables are made of 100% pure bare copper wire, as opposed to copper clad aluminum (CCA) wire, and are therefore fully compliant with UL&reg; Code 444 and National Electrical Code&reg; (NEC&reg;) TIA&#8209;568&#8209;C.2 fire and safety standards, which require pure bare copper wire in communications cables.</p>\r\n\t\t\t<br />\r\n\t\t\t&nbsp;</div>\r\n\t</div>\r\n\t<div class=\"row\">\r\n\t\t<div class=\"col-xs-12 col-sm-10 col-sm-offset-1 col-md-8 col-md-offset-2 center-block\">\r\n\t\t\t<br />\r\n\t\t\t<br />\r\n\t\t\t<div class=\"row\">\r\n\t\t\t\t<div class=\"col-xs-3\">\r\n\t\t\t\t\t<img alt=\"Lifetime Warranty. With Monoprice's Lifetime Warranty, you can rest assured we stand behind our products and our customers. Additionally, we offer a 30 day money back guarantee as well! If the product you purchase does not satisfy your needs, send it back for a full refund.\" class=\"img-responsive center-block\" src=\"//downloads.monoprice.com/files/images/Lifetime400.jpg\" /></div>\r\n\t\t\t\t<div class=\"col-xs-3\">\r\n\t\t\t\t\t<img alt=\"30 Day Warranty. Monoprice stands behind every product we sell with a 30 day money back guarantee! If the product you purchase does not satisfy your needs, send it back for a full refund.\" class=\"img-responsive center-block\" src=\"//downloads.monoprice.com/files/images/30Day400.jpg\" /></div>\r\n\t\t\t\t<div class=\"col-xs-3\">\r\n\t\t\t\t\t<img alt=\"Quality at a Fair Price. Monoprice's rugged design and rigid quality control standards deliver high quality products at fair prices.\" class=\"img-responsive center-block\" src=\"//downloads.monoprice.com/files/images/Quality400.jpg\" /></div>\r\n\t\t\t\t<div class=\"col-xs-3\">\r\n\t\t\t\t\t<img alt=\"Service and Support. You're never on your own with Monoprice products! We have a full team of friendly and knowledgeable technicians available to answer your questions, both before and after the sale. Contact our technical support team for questions about our products, troubleshooting, or even suggestions for products to fit your particular needs. Not to be outdone, our friendly and helpful customer service team is here to make your ordering, delivery, and any possible returns a quick and painless operation, from start to finish!\" class=\"img-responsive center-block\" src=\"//downloads.monoprice.com/files/images/Service400.jpg\" /></div>\r\n\t\t\t</div>\r\n\t\t</div>\r\n\t</div>\r\n\t<br />\r\n\t<br />\r\n\t<br />\r\n\t<br />\r\n\t<p>\r\n\t\t<span style=\"font-weight: bold;\">Support Files: </span></p>\r\n\t<ul>\r\n\t\t<li>\r\n\t\t\t<a href=\"//downloads.monoprice.com/files/specsheets/FLEXboot_Cat6_UTP_Specsheet_170424.pdf\" style=\"color: #00a7bb;\" target=\"_blank\">Specification Sheet</a> (Apr 24, 2017)</li>\r\n\t</ul>\r\n\t<br />\r\n\t<br />\r\n\t<p class=\"text-muted\">\r\n\t\t<span style=\"font-style: italic;\">Monoprice&trade;, FLEXboot&trade;, and all Monoprice logos are trademarks of Monoprice Inc. </span></p>\r\n\t<p class=\"text-muted\">\r\n\t\t<span style=\"font-style: italic;\">UL&reg; and the UL logo are registered trademarks of UL LLC. </span></p>\r\n\t<p class=\"text-muted\">\r\n\t\t<span style=\"font-style: italic;\">NEC&reg; and National Electrical Code&reg; are registered trademarks of the National Fire Protection Association. </span></p>\r\n\t<br />\r\n\t<br />\r\n\t<p class=\"text-right\">\r\n\t\t<span style=\"font-weight: bold; font-size: small;\">Updated May 24, 2021 </span></p>\r\n\t<div class=\"row\">\r\n\t\t<div class=\"col-xs-12 col-sm-6 col-sm-offset-3 col-md-4 col-md-offset-4\">\r\n\t\t\t<br />\r\n\t\t\t<br />\r\n\t\t\t<img alt=\"Warning: Cancer and Reproductive Harm.\" class=\"img-responsive center-block\" src=\"//downloads.monoprice.com/files/images/P65_Cancer_Repro.jpg\" /></div>\r\n\t</div>\r\n\t<br />\r\n\t&nbsp;</div>\r\n\r\n\r\n                    </div>\r\n        </div>\r\n",
  "specPartialView": "\r\n"
}
