EESchema Schematic File Version 4
EELAYER 30 0
EELAYER END
$Descr A4 11693 8268
encoding utf-8
Sheet 5 7
Title ""
Date ""
Rev ""
Comp ""
Comment1 ""
Comment2 ""
Comment3 ""
Comment4 ""
$EndDescr
$Comp
L Device:C C?
U 1 1 5FD5E7B3
P 2950 4050
F 0 "C?" H 3065 4096 50  0000 L CNN
F 1 "220u" H 3065 4005 50  0000 L CNN
F 2 "" H 2988 3900 50  0001 C CNN
F 3 "~" H 2950 4050 50  0001 C CNN
	1    2950 4050
	1    0    0    -1  
$EndComp
$Comp
L Device:C C?
U 1 1 5FD5E7B9
P 2500 4050
F 0 "C?" H 2615 4096 50  0000 L CNN
F 1 "0.22" H 2615 4005 50  0000 L CNN
F 2 "" H 2538 3900 50  0001 C CNN
F 3 "~" H 2500 4050 50  0001 C CNN
	1    2500 4050
	1    0    0    -1  
$EndComp
$Comp
L Diode:B240 D?
U 1 1 5FD5E7BF
P 2350 3050
F 0 "D?" H 2350 2833 50  0000 C CNN
F 1 "B240" H 2350 2924 50  0000 C CNN
F 2 "Diode_SMD:D_SMB" H 2350 2875 50  0001 C CNN
F 3 "http://www.jameco.com/Jameco/Products/ProdDS/1538777.pdf" H 2350 3050 50  0001 C CNN
	1    2350 3050
	-1   0    0    1   
$EndComp
$Comp
L power:VCC #PWR?
U 1 1 5FD5E7C5
P 2150 2850
F 0 "#PWR?" H 2150 2700 50  0001 C CNN
F 1 "VCC" H 2165 3023 50  0000 C CNN
F 2 "" H 2150 2850 50  0001 C CNN
F 3 "" H 2150 2850 50  0001 C CNN
	1    2150 2850
	1    0    0    -1  
$EndComp
Wire Wire Line
	2150 2850 2150 3050
Wire Wire Line
	2150 3050 2200 3050
$Comp
L Connector:TestPoint TP?
U 1 1 5FD5E7CD
P 2500 4300
F 0 "TP?" H 2442 4326 50  0000 R CNN
F 1 "TestPoint" H 2442 4417 50  0000 R CNN
F 2 "" H 2700 4300 50  0001 C CNN
F 3 "~" H 2700 4300 50  0001 C CNN
	1    2500 4300
	-1   0    0    1   
$EndComp
$Comp
L LM2673T-ADJ:LM2673T-ADJ U?
U 1 1 5FD5E7D7
P 4400 3150
F 0 "U?" H 4400 3620 50  0000 C CNN
F 1 "LM2673T-ADJ" H 4400 3529 50  0000 C CNN
F 2 "TO127P457X1016X2052-7P" H 4400 3150 50  0001 L BNN
F 3 "TO-220-7" H 4400 3150 50  0001 L BNN
F 4 "9485724" H 4400 3150 50  0001 L BNN "Field4"
F 5 "NATIONAL SEMICONDUCTOR" H 4400 3150 50  0001 L BNN "Field5"
F 6 "LM2673T-ADJ" H 4400 3150 50  0001 L BNN "Field6"
F 7 "97K3273" H 4400 3150 50  0001 L BNN "Field7"
	1    4400 3150
	1    0    0    -1  
$EndComp
Wire Wire Line
	2500 3900 2500 3050
Wire Wire Line
	2950 3900 2950 3050
Wire Wire Line
	2500 4200 2500 4250
$Comp
L Device:C C?
U 1 1 5FD5E7E0
P 5150 3650
F 0 "C?" H 5035 3696 50  0000 R CNN
F 1 "0.001" H 5035 3605 50  0000 R CNN
F 2 "" H 5188 3500 50  0001 C CNN
F 3 "~" H 5150 3650 50  0001 C CNN
	1    5150 3650
	-1   0    0    -1  
$EndComp
$Comp
L Device:R R?
U 1 1 5FD5E7E6
P 3450 3550
F 0 "R?" H 3520 3596 50  0000 L CNN
F 1 "22k" H 3520 3505 50  0000 L CNN
F 2 "" V 3380 3550 50  0001 C CNN
F 3 "~" H 3450 3550 50  0001 C CNN
	1    3450 3550
	1    0    0    1   
$EndComp
Wire Wire Line
	3700 3550 3700 3850
Wire Wire Line
	3450 3400 3450 3350
Wire Wire Line
	3450 3350 3700 3350
Wire Wire Line
	2500 4300 2500 4250
Wire Wire Line
	3450 3700 3450 3850
Connection ~ 3450 3850
Wire Wire Line
	3100 3400 3100 3050
Wire Wire Line
	3100 3850 3100 3700
$Comp
L Device:C C?
U 1 1 5FD5E7F4
P 3100 3550
F 0 "C?" H 3215 3596 50  0000 L CNN
F 1 "4.7u" H 3215 3505 50  0000 L CNN
F 2 "" H 3138 3400 50  0001 C CNN
F 3 "~" H 3100 3550 50  0001 C CNN
	1    3100 3550
	1    0    0    1   
$EndComp
Wire Wire Line
	5100 3350 5150 3350
Wire Wire Line
	5150 3350 5150 3500
Wire Wire Line
	3450 3850 3700 3850
Wire Wire Line
	3700 3250 3650 3250
Wire Wire Line
	3650 2500 5150 2500
Wire Wire Line
	5150 2500 5150 3250
Wire Wire Line
	5150 3250 5100 3250
$Comp
L Device:C C?
U 1 1 5FD5E801
P 3650 2750
F 0 "C?" H 3535 2796 50  0000 R CNN
F 1 "0.01" H 3535 2705 50  0000 R CNN
F 2 "" H 3688 2600 50  0001 C CNN
F 3 "~" H 3650 2750 50  0001 C CNN
	1    3650 2750
	-1   0    0    -1  
$EndComp
Wire Wire Line
	3650 2500 3650 2600
Wire Wire Line
	3650 2900 3650 3250
Connection ~ 5150 3850
$Comp
L Device:C C?
U 1 1 5FD5E80A
P 5150 4050
F 0 "C?" H 5265 4096 50  0000 L CNN
F 1 "1000u" H 5265 4005 50  0000 L CNN
F 2 "" H 5188 3900 50  0001 C CNN
F 3 "~" H 5150 4050 50  0001 C CNN
	1    5150 4050
	1    0    0    -1  
$EndComp
Wire Wire Line
	5150 3900 5150 3850
Wire Wire Line
	5150 4250 5150 4200
Connection ~ 2950 3050
Wire Wire Line
	5150 3800 5150 3850
Connection ~ 5150 4250
Connection ~ 5150 3250
Wire Wire Line
	5600 3850 6400 3850
Connection ~ 6750 4250
Connection ~ 6350 4250
Wire Wire Line
	6350 4250 6750 4250
Wire Wire Line
	6750 3850 7200 3850
Wire Wire Line
	6700 3450 7200 3450
Connection ~ 7200 3450
Wire Wire Line
	7600 3450 7200 3450
Wire Wire Line
	7600 3750 7600 3450
Connection ~ 5600 3850
Wire Wire Line
	5600 3800 5600 3850
Wire Wire Line
	7550 3850 7600 3850
Wire Wire Line
	7200 3850 7250 3850
$Comp
L Device:R R?
U 1 1 5FD5E823
P 7400 3850
F 0 "R?" V 7193 3850 50  0000 C CNN
F 1 "R" V 7284 3850 50  0000 C CNN
F 2 "" V 7330 3850 50  0001 C CNN
F 3 "~" H 7400 3850 50  0001 C CNN
	1    7400 3850
	0    1    1    0   
$EndComp
Connection ~ 7200 4250
Wire Wire Line
	7600 4250 7200 4250
Wire Wire Line
	7600 4050 7600 4250
Wire Wire Line
	7200 3450 7200 3850
Connection ~ 7200 3850
Wire Wire Line
	6750 4200 6750 4250
Wire Wire Line
	7200 4250 6750 4250
Wire Wire Line
	7200 4200 7200 4250
Connection ~ 6750 3850
Wire Wire Line
	6750 3900 6750 3850
Wire Wire Line
	7200 3850 7200 3900
Wire Wire Line
	6700 3850 6750 3850
Connection ~ 6050 4250
Wire Wire Line
	6350 4250 6050 4250
Wire Wire Line
	6350 3800 6350 4250
Connection ~ 6350 3450
Wire Wire Line
	6350 3450 6400 3450
Wire Wire Line
	6350 3500 6350 3450
Wire Wire Line
	6050 3800 6050 4250
Connection ~ 5600 3250
Wire Wire Line
	6050 3250 6050 3500
Wire Wire Line
	5600 3250 6050 3250
$Comp
L Device:L L?
U 1 1 5FD5E83F
P 6050 3650
F 0 "L?" H 6102 3696 50  0000 L CNN
F 1 "22u" H 6102 3605 50  0000 L CNN
F 2 "" H 6050 3650 50  0001 C CNN
F 3 "~" H 6050 3650 50  0001 C CNN
	1    6050 3650
	1    0    0    -1  
$EndComp
Wire Wire Line
	5600 3250 5600 3500
Wire Wire Line
	7600 3850 7600 3950
$Comp
L Device:R R?
U 1 1 5FD5E847
P 6550 3450
F 0 "R?" V 6757 3450 50  0000 C CNN
F 1 "1.2k" V 6666 3450 50  0000 C CNN
F 2 "" V 6480 3450 50  0001 C CNN
F 3 "~" H 6550 3450 50  0001 C CNN
	1    6550 3450
	0    -1   -1   0   
$EndComp
$Comp
L Device:C C?
U 1 1 5FD5E84D
P 7200 4050
F 0 "C?" H 7315 4096 50  0000 L CNN
F 1 "0.22" H 7315 4005 50  0000 L CNN
F 2 "" H 7238 3900 50  0001 C CNN
F 3 "~" H 7200 4050 50  0001 C CNN
	1    7200 4050
	1    0    0    -1  
$EndComp
$Comp
L Device:C C?
U 1 1 5FD5E853
P 6750 4050
F 0 "C?" H 6865 4096 50  0000 L CNN
F 1 "100u" H 6865 4005 50  0000 L CNN
F 2 "" H 6788 3900 50  0001 C CNN
F 3 "~" H 6750 4050 50  0001 C CNN
	1    6750 4050
	1    0    0    -1  
$EndComp
$Comp
L Device:R R?
U 1 1 5FD5E859
P 6350 3650
F 0 "R?" H 6200 3600 50  0000 C CNN
F 1 "12k" H 6200 3700 50  0000 C CNN
F 2 "" V 6280 3650 50  0001 C CNN
F 3 "~" H 6350 3650 50  0001 C CNN
	1    6350 3650
	-1   0    0    1   
$EndComp
$Comp
L Device:L L?
U 1 1 5FD5E85F
P 6550 3850
F 0 "L?" V 6500 3850 50  0000 C CNN
F 1 "22u" V 6400 3850 50  0000 C CNN
F 2 "" H 6550 3850 50  0001 C CNN
F 3 "~" H 6550 3850 50  0001 C CNN
	1    6550 3850
	0    -1   -1   0   
$EndComp
$Comp
L Diode:1N5819 D?
U 1 1 5FD5E865
P 5600 3650
F 0 "D?" V 5554 3730 50  0000 L CNN
F 1 "1N5819" V 5645 3730 50  0000 L CNN
F 2 "Diode_THT:D_DO-41_SOD81_P10.16mm_Horizontal" H 5600 3475 50  0001 C CNN
F 3 "http://www.vishay.com/docs/88525/1n5817.pdf" H 5600 3650 50  0001 C CNN
	1    5600 3650
	0    1    1    0   
$EndComp
Wire Wire Line
	5100 3450 6350 3450
Wire Wire Line
	5150 3850 5600 3850
Wire Wire Line
	5150 4250 6050 4250
Wire Wire Line
	5150 3250 5600 3250
Wire Wire Line
	3700 3850 5150 3850
Connection ~ 3700 3850
Connection ~ 3100 3050
Wire Wire Line
	3100 3850 3450 3850
Wire Wire Line
	2950 3050 3100 3050
Wire Wire Line
	2950 4250 5150 4250
Connection ~ 2950 4250
Wire Wire Line
	2950 4200 2950 4250
Wire Wire Line
	3100 3050 3700 3050
Connection ~ 2500 3050
Wire Wire Line
	2500 3050 2950 3050
Connection ~ 2500 4250
Wire Wire Line
	2500 4250 2950 4250
Text Notes 8000 4100 0    50   ~ 0
Remote Sense
Text Notes 8000 3900 0    50   ~ 0
Voltage Measure
Text Notes 8000 3800 0    50   ~ 0
Current Measure
Text Notes 8000 4000 0    50   ~ 0
Power Output
Text GLabel 7700 3750 2    50   Output ~ 0
V3_Im
Text GLabel 7700 3850 2    50   Output ~ 0
V3_Vm
Text GLabel 7700 3950 2    50   Output ~ 0
V3_Vo
Text GLabel 7700 4050 2    50   Output ~ 0
V3_Rs
Wire Wire Line
	7600 3950 7700 3950
Wire Wire Line
	7600 4050 7700 4050
Wire Wire Line
	7600 3850 7700 3850
Connection ~ 7600 3850
Wire Wire Line
	7600 3750 7700 3750
$EndSCHEMATC
