<?xml version="1.0" encoding="UTF-8"?>
<session version="1.0">
<refactoring comment="Rename type &apos;com.ravi.lambda.functional_interface&apos; to &apos;lambda_expression&apos;&#x0D;&#x0A;- Original project: &apos;lamba_expretion&apos;&#x0D;&#x0A;- Original element: &apos;com.ravi.lambda.functional_interface&apos;&#x0D;&#x0A;- Renamed element: &apos;com.ravi.lambda.lambda_expression&apos;&#x0D;&#x0A;- Update references to refactored element&#x0D;&#x0A;- Update textual occurrences in comments and strings" description="Rename type &apos;functional_interface&apos;" flags="589830" id="org.eclipse.jdt.ui.rename.type" input="/src&lt;com.ravi.lambda{functional_interface.java[functional_interface" matchStrategy="1" name="lambda_expression" qualified="false" references="true" similarDeclarations="false" stamp="1662038582656" textual="false" version="1.0"/>
</session>