{
  "description": "Energy bar for rogue and druid",
  "version": "1.0.0",
  "author": "Noobsmoke",
  "import": "!WA:2!vA1ZpTXXxCS8xLVTBLQiUkKsvK6wQAeuf(raLePkHAyn2XocmK1MqsAQSNDNz9oL1ZSzMzXahQA8PCM)a6bxPEQN8FavrCPxxz1)c4sV0t8xqFZSgde1wPUsa77nV5nV59(85ZsUYf6uaxa)ML7lJrI92LIvH3Op1NZQZte(KBnH4GTccKevL3EJx)b928h)bXHN7G8B)8qNh)hdqm)qUyBoLP8kwQwJsUdnzZLRqkkNLl(6xXEtoM4S2on2A5eru8RcvQy5xT4ITPQiK3c(8olYdcO(uu0cmo3t2HVhzXU8UZVYcRSW9MVlbThkrGKZlvckRTCEFEueXxN6p3e2k)7b5OVFH9a)TBteYp82IrV(MBeF9ejPzBcJiO(1d5D3I1A4vmpvA(tropcZ7YCsyuLxCe6qIOpM4Lee04WyIOsPn2U8oBmWprQ4DAgsXexfTdb7YqDislhfeLx2QNkt8i7tyQTfKa6bU13U0gJ3Pjoj04sKNM5AD4APVgXLdsyMl0SZzBjiQebZEhOC2eXqZotwnnZC35CxBIo4sEvIeITfHHThF81HINEWGMfxREJM1BSMBdxJ)(f5D8qk7n4T7jJjrrvXsRHcckQU2QgCHYnu33KNB2k9toi3KxU8SHNiUpkYU5DSjS2ruzyXiKuENM2RAQAJ1ffOzh0GReR9QRApZ6U7uD9zSvHeMjMlYCax0bs2JiQ6HOyImKgOkd(MDUXbcj0e13VQ9kxnf6Nr9WauKKmEbDlYA0lwxkQ)7DArcZ0ptVPRFiXFpVKymsr6HhnqlC3J1DrLa5VxRJh3mZDCcBea1k(6iOLUpPrMTMj9lty4Rnb8nx848WZzarKiyOONcOBiVp5yjjkWWptVwppKOywOv(6)8wMNC5DWePF8hVjctS9o0U250oR9V7clTWsNy4Vz8(NNRpayCjTHml)YPsNEGMNbzTj8dWGkOihOAkdra94zzBj)XgF6FnZxehp5LIiRuYLlx(tZ8oUsF)4pY4bLayEO)4BeNCwdmpZSaGvjyJZxpmtc65zhxUtmR)DaBHgCy61sNwavS2xFZcx0PYQRaotfpzzb9i7NKGWWWaz3OXvUiJY8TMil17tLuVisRHgRUCbExbkU3UJEz440Q1cCQXzKrx6ljvEs1A1k52mtWm(Zg3HAQbOivZ4MA9IMXcIpvpfZhp9FtmzVKEZloY60JitpQHmQ)Nl(t)Nsp(qqpI6h6fsOTdvvE4dM4)9tVEP36eXr4NAWJ(AQxOiaziZwoaW0Fk3ojrkQLRzXPsF(TDn8YwUUB9ODk1Yrcvb426udYXjcG)AW6YRT(6XtczDnSE8qWemqwcpgXODmCG77cADcv5tiijPUsa0Fv4)pDAhg0ehEotXOkkKea3JL90HQB0PyNoikRCQpSHuCkjniTDk2lGYafK31Ti7(iVFQNvk1YbcszneqBqFBRyZswxg3)SCVBHtzH9fgEGrYFen4mpG(2wWty4XG7TZV0c3Z5ioVtUJnKvP(7bUvFuLgEGzaTT1aZrvHIXeMBTspTK7ipM5YQc9Slrq65erp6iKa72vJ8R8q6e5U2VoTxwL2ilO4zRQvaGjg5LfralG12bjE5ovN)cR5RBgmA2vR(kU)(zAfV3(VCgkoUW3yeC)w7sWN(AFOnSHbbcqmcgja9iVlkkoeL)Smywz9k6EGx9IULkvZ1umHz)pffhZ2GVdRpfs4Yju8Ga2Yv7wzUx8GDF1aUGc6IMrB)kB5w9fBvRXAB0xpEPztIbuwgWfSMk(JPTzCbz0yQKwuTKqWfYwW3GLW3kHIKewq6UcOED)c7)7p7Vo"
}