## Interface: 30300
## Author: Nu7a (Threk)
## Version: 3.1
## Title: CLC DK
## Notes: Death Knight Helper.
## SavedVariablesPerCharacter: CLCDK_Settings

localization.lua
localization.de.lua

CLC_DK.lua
CLC_DK_Options.xml
