## Interface: 30300
## Title: Icicle
## Notes: Adds enemy cooldowns to their nameplate
## SavedVariables: Icicledb
## Author: Thoth, Trolollolol - Sargeras - Molten-wow.com

Icicle.xml
settings.lua
Icicle.lua
IcicleCds.lua
IcicleBuffs.lua
sponsors.lua