## Interface: 30300
## X-Compatible-With: 40000
## Author: Xus (Xussie of Kazzak EU)
## Title: Forte|c0000ff00Xorcist|r II
## Version: 1.965.3
## Notes: Powerful Class AddOn for Raiders
## SavedVariables: FC_Saved
## OptionalDeps: LibSharedMedia-3.0, oRA3
## Dependencies:
## X-Category: Buffs & Debuffs, Combat, Class, Death Knight, Warlock
## X-Email: xuswow@hotmail.com
Forte_Core.xml
