## Interface: 30300
## Version: 10.06.27
## Title: InfoPanel
## Author: Aezay (Earthen Ring EU)
## Notes: Information Panel
## SavedVariablesPerCharacter: InfoPanel_Config
core.lua
shared.lua
plugins.xml