## Interface: 30300
## Title: Titan Panel [|cffeda55fGold Tracker|r] |cff00aa004.3.4.30300|r
## Notes: Keeps track of all gold held by a player's toons on a per server/faction basis.
## Author: Poena @ Area 52, Titan Development Team (http://www.titanpanel.org)
## SavedVariables: GoldArray
## OptionalDeps: 
## Dependencies: Titan
## Version: 4.3.4.30300
## X-Child-Of: Titan

locale\locale-enUS.lua
locale\locale-deDE.lua
locale\locale-frFR.lua
locale\locale-esES.lua
locale\locale-ruRU.lua
locale\locale-zhCN.lua
locale\locale-zhTW.lua

TitanGoldTracker.xml