## Interface: 30300
## Title: BindPad
## Version: 2.2.4
## Author: Tageshi
## Notes: BindPad - Keybinding UI for Items, Spells and Macroes. Drag anything into BindPad's slot and click it to bind a key.
## SavedVariables: BindPadVars
BindPad.xml
