## Interface: 20400
## Title: Lib: LibStub
## Notes: Universal Library Stub
## Credits: Kaelten, Cladhaire, ckknight, Mikk, Ammo, Nevcairiel
## X-Website: http://jira.wowace.com/browse/LS
## X-Category: Library
## X-License: Public Domain	
## X-Curse-Packaged-Version: WoW 3.1.2 Release
## X-Curse-Project-Name: LibTalentQuery-1.0
## X-Curse-Project-ID: libtalentquery-1-0
## X-Curse-Repository-ID: wow/libtalentquery-1-0/mainline

LibStub.lua
