## Interface: 30300
## X-Compatible-With: 40000
## Author: Xus (Xussie of Kazzak EU)
## Title: Forte|cA0c79c6eWarrior|r
## Notes: Forte Warrior Module
## SavedVariables:
## OptionalDeps:Forte_Casting, Forte_Timer, Forte_Cooldown
## Dependencies:Forte_Core
Localization.lua
Forte_Warrior.lua
