## Interface: 40000
## Title: NuttyRecruit
## Author: Nuttyprot
## Version: 6
## Notes: Automatic guild recruitment spam.
## SavedVariables: NuttyRecruitDB

NuttyRecruit.xml

Locale\locale.xml

NuttyRecruit.lua
