## Interface: 30300
## Title: Raeli's Spell Announcer
## Notes: Announces certain Paladin spells.
## Author: Raeli
## Version: 0.976
## SavedVariables: RSADB
## OptionalDeps: Ace3
embeds.xml

Locale-enUS.lua
RSA.lua


