## Interface: 30300
## Title: Titan Panel [|cffeda55fXP|r] |cff00aa004.3.7.30300|r
## Notes: Adds information to Titan Panel about XP earned and time to level
## Author: Titan Development Team (http://www.titanpanel.org)
## SavedVariables: 
## OptionalDeps: 
## Dependencies: Titan
## Version: 4.3.7.30300
## X-Child-Of: Titan
TitanXP.xml