## Interface: 30300
## Title: SaySapped
## Version: 2009-12-25
## Notes: Says "Sapped" to alert those around you whenever a rogue saps you. Great for Arenas, Battlegrounds and World PvP!
## Author: Bitbyte of Icecrown
## X-eMail: saysapped at orgplay dot com
## X-Category: Battlegrounds/PvP, Chat/Communication

SaySapped.lua
