## Interface: 40300
## Title: Multishot
## Author: dlui
## Version: 3.0.1
## Notes: Takes screenshots of memorable events in your World of Warcraft career.
## OptionalDeps: LibStub, CallbackHandler-1.0, Ace3, LibBossIDs-1.0, LibRareIds-1.0
## SavedVariables: MultishotConfig
## SavedVariablesPerCharacter: MultishotPlayerScreens
## X-WoWI-ID: 9590
## X-Curse-Packaged-Version: 3.0.1
## X-Curse-Project-Name: Multishot (Screenshot)
## X-Curse-Project-ID: multishot
## X-Curse-Repository-ID: wow/multishot/mainline

#@no-lib-strip@
libs\data.xml
#@end-no-lib-strip@

locales\data.xml

dbWhitelist.lua
dbBlacklist.lua

Multishot.lua
Config.lua