## Interface: 30300
## X-Compatible-With: 40000
## Author: Xus (Xussie of Kazzak EU)
## Title: Forte|c0400dd00Talent|r
## Notes: Forte Talent Module
## SavedVariables:
## OptionalDeps:
## Dependencies:Forte_Core
Localization.lua
Forte_Talent.lua
