## Interface: 30300
## X-Curse-Packaged-Version: 1.5
## X-Curse-Project-Name: HideHotKeys
## X-Curse-Project-ID: hidehotkeys
## X-Curse-Repository-ID: wow/hidehotkeys/mainline

## Title: HideHotKeys
## Notes: Hides the hotkey text on all action buttons
## SavedVariablesPerCharacter: HideHotKeys_HK_Hidden, HideHotKeys_MN_Hidden
## Version: 1.5

HideHotKeys.lua
HideHotKeys.xml
