## Interface: 30300
## Title: Lib: MapData-1.0
## Notes: Static library of wow map data
## Version: 1.0.52
## Author: kagaro
## OptionalDeps: LibStub
## X-Embeds: LibStub
## X-Curse-Packaged-Version: r52
## X-Curse-Project-Name: LibMapData-1.0
## X-Curse-Project-ID: libmapdata-1-0
## X-Curse-Repository-ID: wow/libmapdata-1-0/mainline

library.lua
Libs/LibStub/LibStub.lua
Lib/CallbackHandler-1.0/CallbackHandler-1.0.xml