﻿## Interface: 30300
## Title: GridManaBars |cff7fff7f -Ace2-|r
## Notes: Adds manabars to the sides of Grid frames.
## Notes-ruRU: Добовляет полоски маны в фрейм Gridа.
## Notes-zhTW: [Grid] 在 Grid 框架旁邊顯示法力條。
## Notes-zhCN: [Grid] 在 Grid 框体内设置法力条。
## Author: Adelea@EU-Bronzebeard, Julith
## Version: 1.02
## Grid Author: Pastamancer & Maia
## X-Website: http://wowace.com/wiki/Grid
## Dependencies: Grid
## OptionalDeps: Ace2
## X-Curse-Packaged-Version: v1.11
## X-Curse-Project-Name: GridManaBars
## X-Curse-Project-ID: grid-mana-bars
## X-Curse-Repository-ID: wow/grid-mana-bars/mainline

GMBLocale-enUS.lua
GMBLocale-ruRU.lua
GMBLocale-deDE.lua
GMBLocale-koKR.lua
GMBLocale-zhCN.lua
GMBLocale-zhTW.lua
GridManaBar.lua
GridStatusMana.lua
