## Interface: 30300
## Title: BLT
## Notes: Tracks specific cooldowns of players in a raid/party
## Version: 1.2
## OptionalDeps: Ace3, LibSharedMedia-3.0, AceGUI-3.0-SharedMediaWidgets, LibDualSpec-1.0
## SavedVariables: BLT_DB

#@no-lib-strip@
embeds.xml
#@end-no-lib-strip@

locale\enUS.lua
locale\deDE.lua
locale\itemNames.lua

Backend.lua
Cooldowns.lua
Core.lua
Config.lua