## Interface: 30300
## X-Compatible-With: 40000
## Author: Xus (Xussie of Kazzak EU)
## Title: Forte|c0500dd00Vehicle|r
## Notes: Forte Vehicle Module
## SavedVariables:
## OptionalDeps:Forte_Casting, Forte_Timer, Forte_Cooldown
## Dependencies:Forte_Core
Localization.lua
Forte_Vehicle.lua
