## Interface: 30300
## Title: Titan Panel [|cffeda55fPerformance|r] |cff00aa004.3.4.30300|r
## Notes: Adds FPS and Garbage collection information to Titan Panel
## Author: Titan Development Team (http://www.titanpanel.org)
## SavedVariables: 
## OptionalDeps: 
## Dependencies: Titan
## Version: 4.3.4.30300
## X-Child-Of: Titan
TitanPerformance.xml