## Interface: 40000
## LoadOnDemand: 1
## Notes: Configuration for kgPanels
## Title: kgPanelsConfig
## Author: kagaro, EvilElvis
## X-Category: Interface Enhancements
## Dependencies: kgPanels
## Version: 1.5.4.3
## X-License: All Rights Reserved
## X-Email: sal.scotto@gmail.com
## X-Compatible-With: 30300
## OptionalDeps: Ace3, LibSharedMedia-3.0, AceGUI-3.0-SharedMediaWidgets
## X-Curse-Packaged-Version: 1.5.4.3
## X-Curse-Project-Name: kgPanels
## X-Curse-Project-ID: kg-panels
## X-Curse-Repository-ID: wow/kg-panels/mainline

#@no-lib-strip@
embeds.xml
#@end-no-lib-strip@
Locales.xml
kgPanelsConfig.lua
kgPanelGuideFrame.lua
ArtHelper.lua
PanelHelper.lua
LayoutHelper.lua
