## Interface: 30300
## Title: Preform AV Enabler
## Notes: Synchronized solo queuing of battlegrounds
## Notes-deDE: Automatisiert synchronisiertes Betreten des Alteractals
## Author: Torrid
## SavedVariables: PreformAVEnabler_HideColumn, PreformAVEnabler_SizeLimit, PreformAVEnabler_Buttonize
## Version: 2.5

PreformAVEnabler.xml
