## Interface: 30300
## Title: Titan Panel [|cffeda55fCoords|r] |cff00aa004.3.7.30300|r
## Notes: Adds coordinates and location information to Titan Panel
## Author: Titan Development Team (http://www.titanpanel.org)
## SavedVariables: 
## OptionalDeps: 
## Dependencies: Titan
## Version: 4.3.7.30300
## X-Child-Of: Titan
TitanCoords.xml