## Interface: 30300
## X-Compatible-With: 40000
## Author: Xus (Xussie of Kazzak EU)
## Title: Forte|c0300dd00Timer|r
## Notes: Forte Timer Module
## SavedVariables:
## OptionalDeps:Forte_Cooldown
## Dependencies:Forte_Core, Forte_Casting
Localization.lua
Forte_Timer.lua
