## Interface: 40000
## Notes: Create panels for customizing your UI, sucessor to eePanels
## Title: kgPanels
## Author: kagaro
## SavedVariables: kgPanelsDB
## X-Category: Interface Enhancements
## Version: 1.5.4.3
## X-Email: sal.scotto@gmail.com
## X-License: All Rights Reserved
## X-Compatible-With: 30300
## OptionalDeps: Ace3, LibSharedMedia-3.0, LibDataBroker-1.1, LibDualSpec-1.0
## X-Curse-Packaged-Version: 1.5.4.3
## X-Curse-Project-Name: kgPanels
## X-Curse-Project-ID: kg-panels
## X-Curse-Repository-ID: wow/kg-panels/mainline

#@no-lib-strip@
embeds.xml
#@end-no-lib-strip@

kgPanels.lua
