## Interface: 30300
## Title: Spy
## Notes: Detects and alerts you to the presence of nearby enemy players.
## Author: Immolation
## OptionalDeps:  Ace3, LibSharedMedia-3.0, LibBabble-Class-3.0
## SavedVariables: SpyDB
## SavedVariablesPerCharacter: SpyPerCharDB

#@no-lib-strip@
Embeds.xml
#@end-no-lib-strip@

Spy.xml
Locales\Spy-enUS.lua
Spy.lua
Fonts.lua
Colors.lua
Widgets.lua
WindowOrder.lua
MainWindow.lua
List.lua
