## Interface: 30300
## Title: Titan Panel [|cffeda55fBag|r] |cff00aa004.3.7.30300|r
## Notes: Adds bag and free slot information to Titan Panel
## Author: Titan Development Team (http://www.titanpanel.org)
## SavedVariables: 
## OptionalDeps: 
## Dependencies: Titan
## Version: 4.3.7.30300
## X-Child-Of: Titan
TitanBag.xml