## Interface: 20400
## X-Curse-Packaged-Version: r3

## Title: Lib: CallbackHandler-1.0
## Notes: Callback handling Library
## Author: Ace3 Development Team
## X-Website: http://www.wowace.com/projects/callbackhandler/
## X-Category: Library
## X-License: BSD-2.0

LibStub\LibStub.lua
CallbackHandler-1.0\CallbackHandler-1.0.xml
