## Interface: 30300
## Title: InvisusRaidTools
## Version: 3.1
## Notes: Useful Tools for WotLK raids
## Author: Merfin @ https://invisus.shivtr.com/
## SavedVariables: InvisusRT_DB

embeds.xml
libs\IRT_Lib.lua
Media\media.lua

InvisusRaidTools.lua
Spell_Orders\spell_orders.xml
Useful_Tools\Useful_Tools.lua

InvisusRaidTools.xml