## Interface: 30300
## Title: Raid Browser
## Version: v1.2.3
## Notes: A raid finder that parses chat channel text and displays any found raids in the raid browser LFR frame.
## Author: Horsebreed, Noobsmoke (continued)
## SavedVariablesPerCharacter: raid_browser_character_raidsets, raid_browser_character_current_raidset
## OptionalDeps: GearScoreLite
## X-Embeds: Ace3

embeds.xml

core.lua
event.lua
timer.lua
stats.lua
gui.lua
raidset_frame.lua