## Interface: 20003
## Title: GridLayoutForHealers |cff7fff7f -Ace2-|r
## Notes: Adds common healer layouts for Grid
## Author: shadmar
## Version: 0.2
## Dependencies: Grid

GridLayoutForHealers.lua
