## Interface: 30300
## Title: Lib: QTip-1.0
## Notes: Library providing multi-column tooltips.
## Author: Torhal, Adirelle, Elkano, Tristanian
## Version: r139-release 
## LoadOnDemand: 1
## X-Date: 2010-11-01T10:39:15Z
## X-Credits: Kaelten (input on initial design)
## X-Category: Library, Tooltip
## X-License: Ace3 BSD-like license
## X-Curse-Packaged-Version: r139-release
## X-Curse-Project-Name: LibQTip-1.0
## X-Curse-Project-ID: libqtip-1-0
## X-Curse-Repository-ID: wow/libqtip-1-0/mainline

LibStub\LibStub.lua
lib.xml
