## Interface: 40100
## Title: GuildExport
## Notes: Exports guild-data for web-use
## Author: Xamian
## Description: Exports guild-data for web-use
## Version: 1.0
## SavedVariables: GuildExportData

GuildExport.lua

