## Interface: 30300
## Title: Titan Panel [|cffeda55fRegen|r] |cff00aa004.3.7.30300|r
## Notes: Adds a regen monitor to Titan panel to show HP/MANA regen
## Author: Titan Development Team (http://www.titanpanel.org)
## SavedVariables: 
## OptionalDeps: 
## Dependencies: Titan
## Version: 4.3.7.30300
## X-Child-Of: Titan
TitanRegen.xml