## Interface: 30300
## X-Compatible-With: 40000
## Author: Xus (Xussie of Kazzak EU)
## Title: Forte|c0200dd00Cooldown|r
## Notes: Forte Cooldown Module
## SavedVariables:
## OptionalDeps:
## Dependencies:Forte_Core
Localization.lua
Forte_Cooldown.lua

