## Interface: 30300
## LoadOnDemand: 1
## Title: Lib: TalentQuery 1.0
## Notes: Library to help with querying unit talents.
## Author: Peragor
## Version: $Rev: 82 $
## X-Category: Library
## X-ReleaseDate: $Date: 2009-12-09 11:08:46 +0000 (Wed, 09 Dec 2009) $
## X-Website: http://wowace.com/wiki/LibTalentQuery-1.0
## X-License: LGPL v2.1
## X-Curse-Packaged-Version: r84
## X-Curse-Project-Name: LibTalentQuery-1.0
## X-Curse-Project-ID: libtalentquery-1-0
## X-Curse-Repository-ID: wow/libtalentquery-1-0/mainline

LibStub\LibStub.lua
CallbackHandler-1.0\CallbackHandler-1.0.lua
lib.xml
