﻿## Interface: 40200
## Version: 1.2
## Title: BigGuild (|cff0000ffCataclysm|r)
## Notes: Improved guild UI
## SavedVariables: BigGuildOptions
BigGuild.lua
BigGuildExport.lua
BigGuild.xml
BigGuildExport.xml
