## Interface: 30300
## Title: Titan Panel [|cffeda55fRepair|r] |cff00aa004.3.4.30300|r
## Notes: Provides a configurable durability display. Also adds the ability to auto repair items and inventory at vendors
## Author: Titan Development Team (http://www.titanpanel.org)
## SavedVariables: 
## OptionalDeps: 
## Dependencies: Titan
## Version: 4.3.4.30300
## X-Child-Of: Titan
TitanRepair.xml