------------------------------------------------------------------------
r3 | arkayenro | 2010-08-19 03:48:52 +0000 (Thu, 19 Aug 2010) | 1 line
Changed paths:
   A /tags/1.00 (from /trunk:2)

Tagging as 1.00
------------------------------------------------------------------------
r2 | arkayenro | 2010-08-19 03:47:53 +0000 (Thu, 19 Aug 2010) | 1 line
Changed paths:
   A /trunk/ArkAutoLootBoP.lua
   A /trunk/ArkAutoLootBoP.toc

initial release
------------------------------------------------------------------------
r1 | root | 2010-08-19 03:40:28 +0000 (Thu, 19 Aug 2010) | 1 line
Changed paths:
   A /branches
   A /tags
   A /trunk

"arkautolootbop/mainline: Initial Import"
------------------------------------------------------------------------
