## Interface: 30300
## X-Compatible-With: 40000
## Author: Xus (Xussie of Kazzak EU)
## Title: Forte|c0100dd00Casting|r
## Notes: Forte Casting Module
## SavedVariables:
## OptionalDeps:
## Dependencies:Forte_Core
Localization.lua
Forte_Casting.lua
