## Interface: 30300
## Title: GnomeWorks
## Notes: A replacement tradeskill window
## Author: lilsparky
## X-Category: Tradeskill
## X-Curse-Packaged-Version: r54
## X-Curse-Project-Name: GnomeWorks TradeSkill Frame
## X-Curse-Project-ID: gnomeworks
## X-Curse-Repository-ID: wow/gnomeworks/mainline

## SavedVariables: GnomeWorksDB
## OptionalDeps: LibPeriodicTable-3.1
## X-Revision: $Rev: 54 $

## LoadManagers: AddonLoader
## X-LoadOn-Always: delayed


#### List of embedded libraries
#@no-lib-strip@
Libs\LibStub\LibStub.lua
Libs\LibPeriodicTable-3.1\LibPeriodicTable-3.1.lua
#Libs\LibPeriodicTable-3.1\LibPeriodicTable-3.1-Tradeskill\LibPeriodicTable-3.1-Tradeskill.lua
#Libs\LibPeriodicTable-3.1\LibPeriodicTable-3.1-TradeskillResultMats\LibPeriodicTable-3.1-TradeskillResultMats.lua
Libs\LibPeriodicTable-3.1\LibPeriodicTable-3.1-TradeskillLevels\LibPeriodicTable-3.1-TradeskillLevels.lua
Libs\CallbackHandler-1.0\CallbackHandler-1.0.lua
Libs\AceEvent-3.0\AceEvent-3.0.lua
Libs\AceTimer-3.0\AceTimer-3.0.lua
#@end-no-lib-strip@


#### Localization files
#Locale\Locale-enUS.lua
#Locale\Locale-deDE.lua
#Locale\Locale-zhTW.lua
#Locale\Locale-zhCN.lua
#Locale\Locale-koKR.lua
#Locale\Locale-frFR.lua
#Locale\Locale-esES.lua
#Locale\Locale-ruRU.lua




#### Main files
GnomeWorks.lua
MainWindow.lua
Window.lua
RecipeData.lua
RecipeGroups.lua
TradeButton.lua
ScrollFrame.lua
SkillList.lua
Details.lua
Queue.lua
ShoppingList.lua
Inventory.lua
GetTradeSkill.lua

PseudoTrades\CommonSkills.lua
PseudoTrades\Disenchanting.lua
PseudoTrades\Milling.lua
PseudoTrades\Prospecting.lua

#### API
API.lua



### plugin support
plugins\lsw.lua
plugins\arl.lua


#### hooking into different frames/events
FrameHooks\Vendor.lua
FrameHooks\AuctionHouse.lua
FrameHooks\Bank.lua
FrameHooks\GuildBank.lua
FrameHooks\TradeWindow.lua





