{
  "project_info": {
    "project_number": "531941075856",
    "firebase_url": "https://flutter-uber-clone-2943f-default-rtdb.firebaseio.com",
    "project_id": "flutter-uber-clone-2943f",
    "storage_bucket": "flutter-uber-clone-2943f.appspot.com"
  },
  "client": [
    {
      "client_info": {
        "mobilesdk_app_id": "1:531941075856:android:8d02d7c1d9f9647f986115",
        "android_client_info": {
          "package_name": "com.example.partner"
        }
      },
      "oauth_client": [
        {
          "client_id": "531941075856-ekh3ff6o7aln4fid37fpchte65pv0juc.apps.googleusercontent.com",
          "client_type": 3
        }
      ],
      "api_key": [
        {
          "current_key": "AIzaSyD9bHogRQBV0opZLuGRq1NHN94YV-7V9oM"
        }
      ],
      "services": {
        "appinvite_service": {
          "other_platform_oauth_client": [
            {
              "client_id": "531941075856-ekh3ff6o7aln4fid37fpchte65pv0juc.apps.googleusercontent.com",
              "client_type": 3
            }
          ]
        }
      }
    }
  ],
  "configuration_version": "1"
}