@startuml
!includeurl https://oer-informatik.gitlab.io/uml/umlzustand/plantuml/umlstate.cfg

skinparam linetype vpsc
'skinparam linetype polyline
'skinparam linetype ortho

left to right direction

[*] -left-> ausformuliert
ausformuliert: entry\pruefungVorbereiten() 
ausformuliert: do\pruefen()
ausformuliert: exit\pruefergebnisSpeichern() 

ausformuliert -down-> eingereicht : FormularAbsenden\n[alleFelderAusgefüllt == true]
eingereicht -up-> ausformuliert: AblehnungOrgateam \n\mailAnAutor("abgelehnt")
ausformuliert -down-> ausformuliert : AbänderungDesAutors
ausformuliert -down-> geloescht : \n\nLöscheFormular

eingereicht -down-> genehmigt : ZustimmungOrgateam \n\mailAnAutor("genehmigt")

genehmigt -right-> durchgeführt: [aktuelleZeit >= Sessionstartzeit]
eingereicht -right-> geloescht: \n\n\n\nDurch\nAutor\nZurückgezogen
genehmigt -up-> geloescht: Durch\nAutor\nZurückgezogen
geloescht -right->[*]
durchgeführt -up->[*]
@enduml