@startuml
!includeurl https://oer-informatik.gitlab.io/uml/umlsequenz/plantuml/umlsequence.cfg


participant "frontend" as frontend
participant ":Backend" as backend
participant "objekt :Klasse" as objekt
participant "self" as self
actor "martin :User" as martin
database "db :Datenbank" as db
collections "liste :Collection" as liste

@enduml
