@startuml
!includeurl https://oer-informatik.gitlab.io/uml/umlsequenz/plantuml/umlsequence.cfg


participant "client1 :Client" as client1
participant "subject :Subject" as cs
participant "observer1 :ConcreteObserver" as co1

activate client1

client1 -> cs:setState(someState)
activate cs
ref over co1, cs : changeState
client1 <<-- cs:void
deactivate cs
|||
deactivate client1

@enduml