@startuml
!include https://oer-informatik.gitlab.io/uml/umlklasse/plantuml/umlclass.cfg



class Konto{
	iban: String
	kontostand: double
	{static} kontenListe: Konto[0..*]
	Konto(iban: String)
	einzahlen(betrag:double):void
	auszahlen(betrag:double):boolean
	getKontostand():double
	kontoStatus():String
	{static} listeStatusAllerKonten():String
	}

note left of Konto::kontostand
  Attribute werden in der Form
  Namen: Datentyp
  notiert  
end note


	
@enduml 