@startuml
!include https://oer-informatik.gitlab.io/uml/umlklasse/plantuml/umlclass.cfg

together {
	class Hund
	class Maus
}
together {
	class Pferd
	class Katze
}
Pferd .right.> Hund
Hund .right[hidden].> Katze
Katze .down[hidden].> Maus
Maus .[norank].> Pferd
@enduml
