@startuml
!include https://oer-informatik.gitlab.io/uml/umlklasse/plantuml/umlclass.cfg

'skinparam lineType ortho

abstract class "Geldanlage\n{abstract}" as Geldanlage{

  {abstract}  +getAnlagewert(): double {{abstract}abstract} 
...
}


abstract class "Konto\n{abstract}" as Konto{

	-kontostand: double
...
	+einzahlen(betrag:double):boolean
	+auszahlen(betrag:double):boolean
	}

class Aktie{
...
+getAnlagewert(): double
	}

class Festgeld{
...
+getAnlagewert(): double
	}

class PrivatKonto{
...
+getAnlagewert(): double
	}


class GeschäftsKonto{
...
+getAnlagewert(): double
	}

Geldanlage <|-down- Konto
Geldanlage <|-down- Aktie
Geldanlage <|-down- Festgeld
Konto <|-down- PrivatKonto
Konto <|-down- GeschäftsKonto

@enduml
