@startuml
!include https://oer-informatik.gitlab.io/uml/umlklasse/plantuml/umlclass.cfg

'skinparam lineType ortho

class Geldanlage{
 +getAnlagenwert(): double
}


class Konto{

	}

class Aktie{

	}

class Festgeld{

	}

Geldanlage <|-down- Konto
Geldanlage <|-down- Aktie
Geldanlage <|-down- Festgeld
@enduml