@startuml
!include https://oer-informatik.gitlab.io/uml/umlklasse/plantuml/umlclass.cfg

'skinparam lineType ortho


class Konto{
 +auszahlen(betrag:double): boolean
 +einzahlen(betrag: double): boolean
}

class Kunde{
  +bezahleRechnung(rechnung: Rechnung, meinVermoegen: Konto):boolean
}


Kunde -right-> Konto : bezahlt mit >
	
@enduml 