@startuml
!includeurl https://oer-informatik.gitlab.io/uml/umlanwendungsfall/plantuml/umlusecase.cfg

actor :Spielerin: as player
actor :Schiedsrichterin: as referee

rectangle Tischtennis {
usecase (Rundlauf) as rundlauf

'Multiplizitäten werden an den Assoziatoinen angegeben
player "3..*" --- "1" rundlauf
referee "0..*" --- "0..1" rundlauf
}	  

@enduml
