@startuml
!includeurl https://oer-informatik.gitlab.io/uml/umlanwendungsfall/plantuml/umlusecase.cfg

actor :{abstract}\n<i>Befugte</i>: as befugte
actor :Prokuristin: as prokuristin
actor :Geschäftsführerin: as gf

rectangle Vertragswesen {
  usecase (Vertrag \n unterschreiben) as unterschreiben

  befugte -- unterschreiben
  befugte <|- prokuristin
  gf -|> befugte 
}
@enduml
