<?xml version="1.0" encoding="UTF-8"?>
<testsuite xmlns:xsi="http://www.w3.org/2001/XMLSchema-instance" xsi:noNamespaceSchemaLocation="https://maven.apache.org/surefire/maven-surefire-plugin/xsd/surefire-test-report-3.0.xsd" version="3.0" name="de.codecoverage.AppTest" time="0.347" tests="8" errors="0" skipped="0" failures="0">
  <properties>
    <property name="java.specification.version" value="17"/>
    <property name="sun.cpu.isalist" value="amd64"/>
    <property name="sun.jnu.encoding" value="Cp1252"/>
    <property name="java.class.path" value="c:\Users\hanne\addressbook\metrik\target\test-classes;c:\Users\hanne\addressbook\metrik\target\classes;C:\Users\hanne\.m2\repository\org\junit\jupiter\junit-jupiter\5.8.1\junit-jupiter-5.8.1.jar;C:\Users\hanne\.m2\repository\org\junit\jupiter\junit-jupiter-api\5.8.1\junit-jupiter-api-5.8.1.jar;C:\Users\hanne\.m2\repository\org\opentest4j\opentest4j\1.2.0\opentest4j-1.2.0.jar;C:\Users\hanne\.m2\repository\org\junit\platform\junit-platform-commons\1.8.1\junit-platform-commons-1.8.1.jar;C:\Users\hanne\.m2\repository\org\apiguardian\apiguardian-api\1.1.2\apiguardian-api-1.1.2.jar;C:\Users\hanne\.m2\repository\org\junit\jupiter\junit-jupiter-params\5.8.1\junit-jupiter-params-5.8.1.jar;C:\Users\hanne\.m2\repository\org\junit\jupiter\junit-jupiter-engine\5.8.1\junit-jupiter-engine-5.8.1.jar;C:\Users\hanne\.m2\repository\org\junit\platform\junit-platform-engine\1.8.1\junit-platform-engine-1.8.1.jar;"/>
    <property name="java.vm.vendor" value="Oracle Corporation"/>
    <property name="sun.arch.data.model" value="64"/>
    <property name="user.variant" value=""/>
    <property name="java.vendor.url" value="https://java.oracle.com/"/>
    <property name="user.timezone" value="Europe/Berlin"/>
    <property name="os.name" value="Windows 10"/>
    <property name="java.vm.specification.version" value="17"/>
    <property name="sun.java.launcher" value="SUN_STANDARD"/>
    <property name="user.country" value="DE"/>
    <property name="sun.boot.library.path" value="C:\Program Files\Java\jdk-17.0.4\bin"/>
    <property name="sun.java.command" value="C:\Users\hanne\AppData\Local\Temp\surefire7141164950966352787\surefirebooter-20220908150444097_3.jar C:\Users\hanne\AppData\Local\Temp\surefire7141164950966352787 2022-09-08T15-04-43_010-jvmRun1 surefire-20220908150444097_1tmp surefire_0-20220908150444097_2tmp"/>
    <property name="jdk.debug" value="release"/>
    <property name="surefire.test.class.path" value="c:\Users\hanne\addressbook\metrik\target\test-classes;c:\Users\hanne\addressbook\metrik\target\classes;C:\Users\hanne\.m2\repository\org\junit\jupiter\junit-jupiter\5.8.1\junit-jupiter-5.8.1.jar;C:\Users\hanne\.m2\repository\org\junit\jupiter\junit-jupiter-api\5.8.1\junit-jupiter-api-5.8.1.jar;C:\Users\hanne\.m2\repository\org\opentest4j\opentest4j\1.2.0\opentest4j-1.2.0.jar;C:\Users\hanne\.m2\repository\org\junit\platform\junit-platform-commons\1.8.1\junit-platform-commons-1.8.1.jar;C:\Users\hanne\.m2\repository\org\apiguardian\apiguardian-api\1.1.2\apiguardian-api-1.1.2.jar;C:\Users\hanne\.m2\repository\org\junit\jupiter\junit-jupiter-params\5.8.1\junit-jupiter-params-5.8.1.jar;C:\Users\hanne\.m2\repository\org\junit\jupiter\junit-jupiter-engine\5.8.1\junit-jupiter-engine-5.8.1.jar;C:\Users\hanne\.m2\repository\org\junit\platform\junit-platform-engine\1.8.1\junit-platform-engine-1.8.1.jar;"/>
    <property name="sun.cpu.endian" value="little"/>
    <property name="user.home" value="C:\Users\hanne"/>
    <property name="user.language" value="de"/>
    <property name="java.specification.vendor" value="Oracle Corporation"/>
    <property name="java.version.date" value="2022-07-19"/>
    <property name="java.home" value="C:\Program Files\Java\jdk-17.0.4"/>
    <property name="file.separator" value="\"/>
    <property name="basedir" value="c:\Users\hanne\addressbook\metrik"/>
    <property name="java.vm.compressedOopsMode" value="32-bit"/>
    <property name="line.separator" value="&#10;"/>
    <property name="java.vm.specification.vendor" value="Oracle Corporation"/>
    <property name="java.specification.name" value="Java Platform API Specification"/>
    <property name="surefire.real.class.path" value="C:\Users\hanne\AppData\Local\Temp\surefire7141164950966352787\surefirebooter-20220908150444097_3.jar"/>
    <property name="user.script" value=""/>
    <property name="sun.management.compiler" value="HotSpot 64-Bit Tiered Compilers"/>
    <property name="java.runtime.version" value="17.0.4+11-LTS-179"/>
    <property name="user.name" value="hanne"/>
    <property name="path.separator" value=";"/>
    <property name="os.version" value="10.0"/>
    <property name="java.runtime.name" value="Java(TM) SE Runtime Environment"/>
    <property name="file.encoding" value="Cp1252"/>
    <property name="java.vm.name" value="Java HotSpot(TM) 64-Bit Server VM"/>
    <property name="localRepository" value="C:\Users\hanne\.m2\repository"/>
    <property name="java.vendor.url.bug" value="https://bugreport.java.com/bugreport/"/>
    <property name="java.io.tmpdir" value="C:\Users\hanne\AppData\Local\Temp\"/>
    <property name="java.version" value="17.0.4"/>
    <property name="user.dir" value="c:\Users\hanne\addressbook\metrik"/>
    <property name="os.arch" value="amd64"/>
    <property name="java.vm.specification.name" value="Java Virtual Machine Specification"/>
    <property name="sun.os.patch.level" value=""/>
    <property name="native.encoding" value="Cp1252"/>
    <property name="java.library.path" value="C:\Program Files\Java\jdk-17.0.4\bin;C:\WINDOWS\Sun\Java\bin;C:\WINDOWS\system32;C:\WINDOWS;C:\Program Files\Common Files\Oracle\Java\javapath;C:\Program Files (x86)\Common Files\Oracle\Java\javapath;C:\Program Files\Python38\Scripts\;C:\Program Files\Python38\;C:\WINDOWS\system32;C:\WINDOWS;C:\WINDOWS\System32\Wbem;C:\WINDOWS\System32\WindowsPowerShell\v1.0\;C:\WINDOWS\System32\OpenSSH\;C:\Program Files\PuTTY\;C:\Program Files\MiKTeX 2.9\miktex\bin\x64\;C:\Program Files\Java\jdk-11.0.4\bin;C:\Program Files\NetBeans-11.1\netbeans\java\maven\bin;C:\Program Files\plantuml;C:\Program Files\Pandoc\;C:\Program Files (x86)\Microsoft SQL Server\150\DTS\Binn\;C:\Program Files\jEdit;C:\Program Files\Docker\Docker\resources\bin;C:\ProgramData\DockerDesktop\version-bin;C:\Program Files (x86)\IVI Foundation\IVI\bin;C:\Program Files\IVI Foundation\IVI\bin;C:\Program Files (x86)\IVI Foundation\VISA\WinNT\Bin\;C:\Program Files\IVI Foundation\VISA\Win64\Bin\;C:\Program Files (x86)\IVI Foundation\VISA\WinNT\Bin;C:\Program Files\Microsoft VS Code\bin;C:\Program Files\VSCodium\bin;C:\Program Files\Git\cmd;C:\Users\hanne\AppData\Local\Microsoft\WindowsApps;C:\Users\hanne\AppData\Local\atom\bin;C:\Users\hanne\AppData\Local\Microsoft\WindowsApps;C:\Program Files (x86)\Arduino\hardware\tools\avr\bin;C:\Users\hanne\Documents\ArduinoData\packages\esp8266\hardware\esp8266\2.5.2\tools\esptool;C:\Users\hanne\AppData\Roaming\Python\Python38\site-packages;C:\Program Files\JetBrains\IntelliJ IDEA 2021.1.1\bin;;C:\Program Files\Java\jdk-17.0.4;C:\Program Files\apache-maven-bin\apache-maven-3.8.6\bin;;."/>
    <property name="java.vm.info" value="mixed mode, sharing"/>
    <property name="java.vendor" value="Oracle Corporation"/>
    <property name="java.vm.version" value="17.0.4+11-LTS-179"/>
    <property name="sun.io.unicode.encoding" value="UnicodeLittle"/>
    <property name="java.class.version" value="61.0"/>
  </properties>
  <testcase name="rabattAusgeben_1100_nokarte_Test" classname="de.codecoverage.AppTest" time="0.152"/>
  <testcase name="rabattAusgeben_100_Test" classname="de.codecoverage.AppTest" time="0.01">
    <system-out><![CDATA[Position: 100
Summe: 100
Rabatte: 0
Summe-Rabatt: 100
]]></system-out>
  </testcase>
  <testcase name="rabattAusgeben_1100_Test" classname="de.codecoverage.AppTest" time="0.008">
    <system-out><![CDATA[Position: 1100
5€ Rabatt für 1100
Summe: 1100
Rabatte: 5
Summe-Rabatt: 1095
]]></system-out>
  </testcase>
  <testcase name="rabattAusgeben_100_nokarte_Test" classname="de.codecoverage.AppTest" time="0.008"/>
  <testcase name="rabattAusgeben_100_karte_Test" classname="de.codecoverage.AppTest" time="0"/>
  <testcase name="rabattAusgeben_NULL_Test" classname="de.codecoverage.AppTest" time="0.008">
    <system-out><![CDATA[Summe: 0
Rabatte: 0
Summe-Rabatt: 0
]]></system-out>
  </testcase>
  <testcase name="rabattAusgeben_1100_karte_Test" classname="de.codecoverage.AppTest" time="0.031"/>
  <testcase name="rabattAusgeben_500_Test" classname="de.codecoverage.AppTest" time="0.01">
    <system-out><![CDATA[Position: 500
5€ Rabatt für 500
Summe: 500
Rabatte: 5
Summe-Rabatt: 495
]]></system-out>
  </testcase>
</testsuite>