@startuml 
hide circle
skinparam classAttributeIconSize 0

skinparam DefaultFontName "Lucida Sans Typewriter"

skinparam Class{
    BorderColor DarkSlateBlue
    BackgroundColor    whitesmoke
}

skinparam Note{
    BorderColor DarkSlateBlue
    BackgroundColor LightYellow
}

skinparam ArrowColor DarkSlateBlue


class Background{
 +__init__()<<create>>

 +setup()
 +events()
 +update()
 +draw()
 +quit()
 
 +consume_dot(col:int, row:int)
 
 -is_running: bool
 -dot_size: int
 -color: Color<int, int, int>
 -display_size: Tupel<int, int>
 -pacman: Pacman
 -ghosts: Ghost[]
}

class Pacman{
 +  __init__() <<create>>

 +get_x_position():int
 +get_y_position():int 
 
 +dir_down():void
 +dir_up():void
 +dir_right():void
 +dir_left():void
 
 +update(max_x:int, max_y:int)
 +draw(screen:Screen)
 
 -x_position:int
 -y_position:int
 -dir_x:int
 -dir_y:int
 -radius:int
 -color:Color<int, int, int>
 -step:int
}

class Ghost{
 +__init__()<<create>>
 
 +move(pacman:Pacman)
 +draw(screen:Screen)
 +update()
 
 -x_position:int
 -y_position:int
 -radius:int
 -color:Color<int, int, int>
 -step:int
}

Pacman "1"-left-* Background
Ghost "1..*"-up-* Background
@enduml 