<?xml version="1.0" encoding="UTF-8" standalone="no"?>
<!-- Created with Inkscape (http://www.inkscape.org/) -->

<svg
   xmlns:dc="http://purl.org/dc/elements/1.1/"
   xmlns:cc="http://creativecommons.org/ns#"
   xmlns:rdf="http://www.w3.org/1999/02/22-rdf-syntax-ns#"
   xmlns:svg="http://www.w3.org/2000/svg"
   xmlns="http://www.w3.org/2000/svg"
   xmlns:sodipodi="http://sodipodi.sourceforge.net/DTD/sodipodi-0.dtd"
   xmlns:inkscape="http://www.inkscape.org/namespaces/inkscape"
   width="210mm"
   height="297mm"
   viewBox="0 0 210 297"
   version="1.1"
   id="svg8"
   inkscape:version="0.92.4 (5da689c313, 2019-01-14)"
   sodipodi:docname="magischesDreieck.svg"
   inkscape:export-filename="C:\CSBME\Fächer\IT\Prog\EmbeddedIoT\oer\images\magischesDreieck.png"
   inkscape:export-xdpi="96"
   inkscape:export-ydpi="96">
  <defs
     id="defs2">
    <inkscape:path-effect
       effect="skeletal"
       id="path-effect4646"
       is_visible="true"
       pattern="M 0,5 C 0,2.24 2.24,0 5,0 7.76,0 10,2.24 10,5 10,7.76 7.76,10 5,10 2.24,10 0,7.76 0,5 Z"
       copytype="single_stretched"
       prop_scale="0.26458333"
       scale_y_rel="false"
       spacing="0"
       normal_offset="0"
       tang_offset="0"
       prop_units="false"
       vertical_pattern="false"
       fuse_tolerance="0" />
  </defs>
  <sodipodi:namedview
     id="base"
     pagecolor="#ffffff"
     bordercolor="#666666"
     borderopacity="1.0"
     inkscape:pageopacity="0.0"
     inkscape:pageshadow="2"
     inkscape:zoom="2.8"
     inkscape:cx="507.39318"
     inkscape:cy="790.63467"
     inkscape:document-units="mm"
     inkscape:current-layer="layer1"
     showgrid="false"
     inkscape:window-width="2736"
     inkscape:window-height="1719"
     inkscape:window-x="-13"
     inkscape:window-y="-13"
     inkscape:window-maximized="1" />
  <metadata
     id="metadata5">
    <rdf:RDF>
      <cc:Work
         rdf:about="">
        <dc:format>image/svg+xml</dc:format>
        <dc:type
           rdf:resource="http://purl.org/dc/dcmitype/StillImage" />
        <dc:title></dc:title>
      </cc:Work>
    </rdf:RDF>
  </metadata>
  <g
     inkscape:label="Ebene 1"
     inkscape:groupmode="layer"
     id="layer1">
    <path
       style="fill:#000000;stroke:none;stroke-width:0.26458332px;stroke-linecap:butt;stroke-linejoin:miter;stroke-opacity:1"
       d="m 76.634672,102.43675 c -0.137,-0.10656 2.078882,-3.370459 6.587383,-8.853597 0,0 2e-6,-3e-6 2e-6,-3e-6 0.866677,-1.053053 1.595049,-1.845219 2.592182,-2.994235 0.256616,-0.296105 0.544068,-0.645942 0.843969,-0.973205 1.886844,-2.059161 4.046978,-4.294669 6.312704,-6.803648 0.686621,-0.758952 1.325952,-1.674603 2.139367,-2.57954 0.765492,-0.847483 1.598023,-1.605691 2.344608,-2.402485 0.726374,-0.773793 1.443659,-1.623193 2.236463,-2.478134 0.39149,-0.420449 0.78599,-0.787223 1.12585,-1.150038 0.73368,-0.780291 1.46087,-1.616245 2.23077,-2.466367 0.007,-0.0075 1.11545,-1.231682 1.12225,-1.239197 0.3885,-0.428938 0.77146,-0.818007 1.09641,-1.209233 0.29911,-0.355908 0.60101,-0.838853 1.04202,-1.348618 0.4414,-0.499032 0.89043,-0.891948 1.24448,-1.267695 0.38121,-0.402943 0.74274,-0.83505 1.12395,-1.237994 0,0 1e-5,-6e-6 1e-5,-6e-6 0.44215,-0.466135 0.87333,-0.838774 1.1905,-1.207859 0.28648,-0.321932 0.57521,-0.806661 1.02972,-1.331554 0.46485,-0.522926 0.92248,-0.890554 1.21873,-1.237035 0.30441,-0.342914 0.60261,-0.800973 1.00009,-1.295395 0.35236,-0.438036 0.7033,-0.84507 1.04536,-1.253075 0.17162,-0.205563 0.36301,-0.446108 0.59243,-0.699153 0,0 1e-5,-7e-6 1e-5,-7e-6 0.47284,0.01129 0.96942,-0.0073 1.51313,-0.03618 0,0 1e-5,0 1e-5,0 0.0629,0.126165 0.1338,0.236547 0.21474,0.333776 0.0213,0.02561 0.0444,0.05217 0.0614,0.08247 0.12759,0.228293 0.27666,0.38991 0.46235,0.492647 l 0,0 c -0.10043,0.128987 -0.19538,0.243621 -0.28094,0.347765 l -3e-5,-2.5e-5 c -0.3207,-0.194269 -0.63958,-0.391874 -0.95616,-0.592444 -1e-5,-8e-6 -2e-5,-1.5e-5 -3e-5,-2.2e-5 -0.0404,-0.0088 -0.0809,-0.01754 -0.12103,-0.02613 -0.016,-0.0034 -0.0349,-0.0075 -0.0476,-0.0094 -0.005,-0.01563 -0.0164,-0.03839 -0.0247,-0.05845 -0.012,-0.02969 -0.0574,-0.1408 -0.0694,-0.170494 -0.10257,-0.251852 -0.20553,-0.506606 -0.30775,-0.763116 0.40653,-0.462124 0.80974,-0.924335 1.22162,-1.395802 0.31614,-0.361364 0.64077,-0.791272 1.03636,-1.239766 0.43346,-0.483225 0.85167,-0.831538 1.13617,-1.150531 0.0939,-0.09999 0.23222,-0.304506 0.46933,-0.569844 0,0 10e-6,-8e-6 10e-6,-8e-6 0.44756,-0.488842 0.86399,-0.812467 1.09671,-1.105345 0,0 0,-5e-6 0,-5e-6 0.0445,-0.03975 0.16569,-0.299706 0.49027,-0.688713 0.42785,-0.476863 0.84422,-0.834484 1.14898,-1.162991 0.24878,-0.259787 0.51667,-0.666666 0.92406,-1.122642 0.22685,-0.246438 0.39926,-0.390486 0.46998,-0.474756 0,0 0,-3e-6 0,-3e-6 0.0954,-0.102749 0.23579,-0.307758 0.47306,-0.573058 0,0 0,-9e-6 0,-9e-6 0.25116,-0.271942 0.4564,-0.446206 0.56408,-0.569618 0.34462,-0.367696 0.67184,-0.938222 1.17697,-1.561666 0.62264,-0.767533 1.25649,-1.336351 1.63081,-1.910635 -0.0422,0.115655 0.0181,-0.133081 0.35074,-0.654582 l 0,0 2e-5,-2.2e-5 0,0 c 0.18981,-0.22335 0.37728,-0.407414 0.54491,-0.559887 l 0,0 c -0.35772,0.361855 0.67357,-0.681421 0.31586,-0.319566 l 0,0 c -0.0332,0.03266 0.11818,-0.11645 0.085,-0.08379 0,0 0,-1e-6 0,-1e-6 0.005,-0.0038 0.0135,-0.01002 0.0202,-0.01613 0.0599,-0.06271 0.16864,-0.239022 0.38256,-0.48431 0.49904,-0.555442 0.99254,-1.030984 1.39524,-1.500458 0.62302,-0.709799 1.16513,-1.55966 1.80646,-2.464919 0.31094,-0.367177 0.39984,-0.420008 0.20549,-0.21314 -0.18683,0.330201 -0.17732,0.253945 0.0938,-0.189275 0.28968,-0.336222 0.37118,-0.382396 0.18819,-0.189484 -0.21111,0.366095 -0.17024,0.158534 0.30412,-0.513028 0.8059,-0.5664 0.8552,-0.503316 0.0722,0.039 -0.18794,0.440648 -0.24912,0.435822 -0.0675,0.0025 0.0344,-0.09935 0.10353,-0.240816 0.21482,-0.419136 0.23981,-0.31698 0.2796,-0.26223 0.0144,0.108009 0.1113,0.534147 0.21954,0.760846 0.37084,0.68319 -4e-5,-8.6e-5 2e-5,-1e-5 2e-5,-1e-5 0.0264,0.03261 0.0525,0.06394 0.0781,0.09402 0.11453,0.134455 0.22012,0.243849 0.31023,0.330877 0.0854,0.08243 0.1568,0.144785 0.2088,0.189357 0.13179,0.134614 0.15483,0.128462 0.11869,-0.04719 0,0 -1e-5,-4.2e-5 -1e-5,-4.2e-5 -0.12021,0.03052 -0.0215,-0.0025 0.30306,-0.07464 0.53068,-0.417537 0.59401,-0.408068 0.14192,-0.02295 -0.32853,0.19629 -0.39792,0.216416 -0.18129,0.105622 0.26554,-0.247554 0.20526,-0.112267 -0.28279,0.28461 0,0 -5e-5,3.1e-5 -5e-5,3.1e-5 -0.53449,0.361687 -0.73012,0.36884 -0.49567,0.119733 0,0 2e-5,-2.1e-5 2e-5,-2.1e-5 0.59342,-0.132754 0.80738,-0.419601 0.67164,-0.918347 0,0 1e-5,-6.3e-5 1e-5,-6.3e-5 0.068,-0.368843 0.0551,-0.10074 -0.12352,0.786782 -0.34776,0.465948 -0.46951,0.598462 -0.33094,0.423303 -0.0191,0.02818 0.001,-0.01697 0.0831,-0.127468 -0.0613,0.08888 -0.10687,0.167711 -0.14316,0.235193 -0.0451,0.08608 -0.0766,0.151839 -0.1048,0.19747 -0.0703,0.114329 -0.0811,0.106875 0.001,0.0041 -0.072,0.180492 -0.0906,0.188716 -5.1e-4,0.04803 0.0678,-0.679136 0.11237,-0.641541 0.0276,0.09627 -0.24051,0.644894 -0.29854,0.660791 -0.0732,0.08996 0.002,-0.246902 0.0407,-0.141414 0.0107,0.309353 -0.0541,0.386065 -0.11405,0.535013 -0.0916,0.459153 0,0 0,-5e-6 0,-5e-6 -0.004,-0.11672 0.031,0.05182 -0.002,0.503134 -0.12629,0.551817 -0.19418,0.654692 -0.10117,0.335367 0.003,-0.185922 0.0247,-0.158604 0.0181,0.07432 0.004,0.0949 0.0225,0.331774 -0.006,0.707892 -0.12869,0.575165 -0.19855,0.683465 -0.10318,0.352234 0.003,-0.18661 0.0247,-0.15948 0.0181,0.07382 6.1e-4,0.220253 0.001,0.44074 0.002,0.661458 l 0,0 c 0,0 0,2e-6 0,2e-6 0.004,0.02057 0.017,0.199904 -0.009,0.536517 0,0 0,2.6e-5 0,2.6e-5 l 0,0 c 0,0 -3e-5,4e-6 -3e-5,4e-6 -0.39693,0.03986 -0.83382,0.237182 -1.35441,0.579483 l 0,0 c -0.007,-0.0089 -0.0156,-0.0081 -0.0303,-0.03352 -0.0162,-0.02798 -0.0196,-0.06944 -0.0248,-0.105056 -0.0513,-0.349309 -0.0403,-0.622296 -0.009,-0.807696 0,0 0,-4e-6 0,-4e-6 0.11725,-0.02221 0.23438,-0.04624 0.3533,-0.07193 0.0453,-0.0098 0.087,-0.03253 0.14038,-0.02737 0.0812,0.0078 0.14391,0.02972 0.21355,0.04423 0.20752,0.04326 0.4116,0.08158 0.61491,0.114554 0.0644,0.690778 0.0864,1.351255 0.11367,1.984995 l 0,0 0,1.1e-5 0,0 c 0.0289,0.702597 0.022,1.340014 0.0924,1.895288 l 0,0 c -0.398,0.251871 -0.81774,0.42928 -1.22719,0.525732 l 0,1e-6 c -0.0359,0.01923 -0.0693,0.03691 -0.10527,0.05615 -0.0101,0.0054 -0.018,0.0099 -0.0281,0.009 -0.0653,-0.0054 -0.14365,-0.0157 -0.2178,-0.02511 -0.2993,-0.03798 -0.60392,-0.091 -0.90764,-0.158985 0,-10e-7 -1e-5,-3e-6 -2e-5,-5e-6 0.42955,-0.05942 0.85903,-0.125415 1.28906,-0.198001 3e-5,-3e-6 3e-5,-3e-6 3e-5,-4e-6 0.0166,-0.0045 0.13274,-0.03644 0.14939,-0.04099 0.0214,-0.0059 0.0413,-0.01244 0.065,-0.01778 0.028,0.0042 0.0514,0.01015 0.0764,0.01524 0.0654,0.01422 0.13026,0.02835 0.19512,0.04231 0.27911,0.06008 0.55701,0.117344 0.83485,0.171669 0,0 4e-5,8e-6 4e-5,8e-6 l 0,0 c 0.0266,0.334505 0.0507,0.665345 0.0748,0.994033 0.0182,0.366208 -0.009,0.512745 -0.002,0.435432 -0.0271,-0.118278 0.0421,0.04741 0.099,0.515461 0.0233,0.578348 -0.0321,0.950975 -0.0137,1.110342 -0.1423,-0.227638 0.18934,0.145664 0.29445,1.176834 0.0352,0.483528 -0.004,0.593696 -0.007,0.325169 -8.6e-4,0.05281 0.10298,0.295342 0.1903,0.755752 0,0 0,1.5e-5 0,1.5e-5 0.07,0.452874 0.0734,0.786049 0.10235,0.9869 0,0 0,6e-6 0,6e-6 -7.2e-4,0.03231 0.0409,0.166827 0.0856,0.411114 0.0371,0.204083 0.0653,0.389593 0.093,0.556185 0.0892,0.411206 0.19401,0.851344 0.28528,1.320034 0,0 0,1.2e-5 0,1.2e-5 0.0854,0.446231 0.12673,0.825089 0.18864,1.124136 0,0 0,8e-6 0,8e-6 0.12958,0.684735 0.39158,1.415717 0.63728,2.251445 0.13564,0.471988 0.20139,0.857993 0.28467,1.133583 0.0942,0.32641 0.23242,0.691585 0.37162,1.109748 0.21914,0.748086 0.45565,1.520105 0.67542,2.307489 0.12468,0.451998 0.19354,0.831159 0.27959,1.117384 0,0 0,7e-6 0,7e-6 0.0763,0.269091 0.24166,0.644015 0.38606,1.160198 0.14135,0.537226 0.21031,1.000776 0.29572,1.369162 0,0 1e-5,9e-6 1e-5,9e-6 0.0781,0.339956 0.18233,0.711486 0.28125,1.122505 0,0 0,1.1e-5 0,1.1e-5 0.10709,0.45501 0.15687,0.825036 0.23901,1.086524 0.0666,0.151636 0.13192,0.298173 0.19794,0.438453 -0.0978,0.292695 -0.18983,0.597609 -0.27691,0.915177 0.17269,-0.187686 0.31434,-0.339473 0.41655,-0.446591 0.29489,-0.361648 0.30355,-0.281786 -0.0395,0.195212 0.0145,0.04657 0.0686,0.169741 0.1276,0.373701 -0.008,0.117385 0.21215,0.426643 0.43691,1.012224 0.047,0.161845 0.0944,0.326417 0.14138,0.493843 0.0107,0.03826 0.0214,0.07667 0.0321,0.115224 -0.0163,-0.02315 -0.0333,-0.04809 -0.0507,-0.07484 0.007,0.01824 0.0119,0.03396 0.0201,0.051 0.01,-0.01242 0.0369,0.01417 0.0543,0.04184 0.14961,0.238403 0.21356,0.418608 0.24302,0.511724 l 0,0 c -0.0782,0.395577 -0.12262,0.869895 -0.16547,1.432954 0,0 0,3.4e-5 0,3.4e-5 l 0,0 c 0.33416,-0.258634 0.55741,-0.414506 0.62582,-0.507155 0.0861,-0.116536 0.0303,-0.04985 -0.20749,0.149902 0,0 -3e-5,2.4e-5 -3e-5,2.4e-5 0,0 0,-10e-7 0,-10e-7 -0.016,-0.0214 0.0292,0.07587 0.0813,0.298053 l 0,0 0,1.2e-5 0,0 c 0.10437,0.373362 0.25973,0.768833 0.42846,1.195177 0,0 0,5e-6 0,5e-6 0.0717,0.207717 0.31458,0.552552 0.55753,1.112041 0,0 10e-6,1.4e-5 10e-6,1.4e-5 0.18489,0.442289 0.32956,0.857965 0.47063,1.227364 0.17221,0.371854 0.37364,0.773667 0.56672,1.22789 0,0 0,1.2e-5 0,1.2e-5 0.20284,0.484522 0.33401,0.905017 0.47256,1.230813 0,0 1e-5,8e-6 1e-5,8e-6 0.0791,0.206664 0.33702,0.570532 0.58304,1.176583 0,0 0,1.3e-5 0,1.3e-5 0.24703,0.653335 0.30069,1.117843 0.41849,1.297668 0,0 0,4e-6 0,4e-6 1.1186,2.244366 2.37613,4.438264 3.56708,6.683433 0.23632,0.447481 0.3949,0.832008 0.55407,1.114421 0.20232,0.365789 0.4145,0.728922 0.63349,1.09027 0.64923,1.070927 1.31647,2.136198 1.97504,3.211295 0.16126,0.258249 0.2094,0.390756 0.20419,0.359745 0.39253,0.51177 0.83887,1.028291 1.28951,1.572086 0.79013,0.949164 1.57164,1.844822 2.4218,2.618302 0.43752,0.431175 1.17711,0.769885 1.98206,1.281985 0,0 10e-6,1e-5 10e-6,1e-5 0.25631,0.1613 0.44238,0.30097 0.57932,0.38804 0,0 0,0 0,0 0.0663,0.0439 0.24882,0.13436 0.51812,0.3159 0,0 2e-5,1e-5 2e-5,1e-5 0.46044,0.33142 0.74262,0.62486 0.94286,0.75894 -0.007,0.005 0.16922,0.0798 0.48137,0.29185 0,0 1e-5,1e-5 1e-5,1e-5 0.4384,0.36729 0.45017,0.44057 0.10375,0.1341 -0.36173,-0.13874 -0.28241,-0.15587 0.19846,0.0489 0.59243,0.45639 0.65432,0.53214 0.22975,0.17349 -0.17186,-0.0889 -0.11075,-0.075 0.16311,0.0789 0.0523,0.041 0.10776,0.0845 0.16592,0.13114 0,0 0,0 0,0 0,0 0,0 0,0 0.006,0.0122 0.0115,0.0241 0.0162,0.0359 0.002,0.005 0.003,0.008 0.004,0.0132 -0.0274,-0.0108 -0.0541,-0.0232 -0.0811,-0.036 -0.027,-0.0131 -0.0606,-0.0247 -0.0775,-0.0446 -0.0195,-0.0231 0.009,-0.002 0.0118,0.003 0.013,0.022 0.0105,0.0484 -0.003,0.0692 0,0 0,0 0,0 l 0,0 c 1.4883,0.48452 1.74783,0.78697 0.96031,0.45417 0.0362,0.074 0.0711,0.14268 0.10422,0.20698 0.0678,0.13138 0.12841,0.24462 0.17886,0.34886 0.0404,0.0835 0.0743,0.16124 0.1,0.23785 0.16007,0.47159 0.0572,0.66987 -0.19422,0.52089 l 0,0 c -0.0396,0.0283 -0.0754,0.0515 -0.10852,0.0723 -0.0578,0.0362 -0.10742,0.0649 -0.15445,0.0995 -0.027,0.0199 -0.0531,0.0417 -0.0794,0.068 -0.0155,0.0155 -0.031,0.0317 -0.0464,0.0482 -0.0669,0.0717 -0.13268,0.15058 -0.19727,0.21886 -0.0149,0.0157 -0.0297,0.0309 -0.0444,0.0453 -0.025,0.0244 -0.0502,0.0437 -0.0745,0.0606 -0.0425,0.0294 -0.0823,0.0512 -0.11404,0.079 -0.0182,0.016 -0.0337,0.0339 -0.0454,0.0563 -0.009,0.0166 -0.0136,0.0344 -0.0159,0.0529 -0.006,0.0478 0.006,0.0998 0.0152,0.14549 0.005,0.0261 0.01,0.0501 0.01,0.0701 -0.004,0.13321 0.0713,0.17994 0.24515,0.27298 0,0 1e-5,1e-5 1e-5,1e-5 0.47598,-0.19673 0.40571,-0.12919 -0.24791,0.107 -0.48361,0.0565 -0.72457,0.033 -0.71853,0.0227 -7e-5,0 -0.5669,-0.002 -0.56697,-0.002 -0.29614,0.001 -0.47909,-0.0211 -0.54835,-0.007 0.24052,-0.0579 0.12555,0.011 -0.36706,0.092 -0.35376,0.0247 -0.58492,0.007 -0.69098,0.004 0,0 -10e-6,0 -10e-6,0 -1e-4,0 -0.66136,-0.002 -0.66146,-0.002 -0.30361,-9e-5 -0.52584,-0.0185 -0.66678,-0.006 -0.0203,0.002 -3.61145,0.26895 -3.6317,0.27046 0,0 -1e-5,0 -1e-5,0 -0.44324,-1e-4 -0.81324,-0.0239 -1.11041,-0.005 -0.62005,0.032 -1.31104,0.13629 -2.07945,0.17985 -0.4721,0.0227 -0.87663,-5.1e-4 -1.2051,-0.003 0,0 -1e-5,0 -1e-5,0 -0.43507,-0.002 -0.83218,-0.0161 -1.19204,-0.006 -0.59286,0.0144 -1.21971,0.0624 -1.88122,0.085 -0.248,0.007 -0.45267,-7.1e-4 -0.61199,-0.002 -3.6e-4,0 -1.41706,-0.007 -1.41742,-0.007 0,0 -1e-5,0 -1e-5,0 -1.40069,-0.007 -2.78678,-0.0147 -4.15772,-0.0224 -0.001,-1e-5 -2.73916,-0.0159 -2.74033,-0.0159 0,0 -10e-6,0 -10e-6,0 -0.51805,-0.003 -1.05827,0.0103 -1.64178,-0.0103 0,0 -1e-5,0 -1e-5,0 -0.52574,-0.0205 -1.01587,-0.0727 -1.45683,-0.10534 -2.7e-4,-2e-5 -1.41646,-0.10361 -1.41673,-0.10363 -6.3977,-0.4678 5.04445,0.36864 -1.35325,-0.0992 -0.45126,-0.0328 -0.92226,-0.0582 -1.42212,-0.11127 -1.07954,-0.11592 -2.07581,-0.30465 -3.01498,-0.39895 -0.44219,-0.0464 -0.9473,-0.053 -1.50506,-0.10522 -0.62989,-0.0606 -1.18665,-0.1611 -1.68495,-0.20092 -0.13878,-0.0191 -0.41962,0.0165 -0.83409,-0.006 -0.35206,-0.0267 -0.62043,-0.0809 -0.81373,-0.10567 -0.58596,-0.0722 -1.13211,-0.14958 -1.66936,-0.19998 -0.53299,-0.0517 -1.07746,-0.0569 -1.61045,-0.10862 -1.06134,-0.10556 -2.05184,-0.30015 -3.11318,-0.40571 -0.48026,-0.0485 -1.01925,-0.0538 -1.60498,-0.10955 -0.4794,-0.0469 -0.95696,-0.0931 -1.44244,-0.15032 -0.0698,-0.32707 -0.15304,-0.65463 -0.24891,-0.98644 0,0 0,-3e-5 0,-3e-5 -0.01,-0.0746 -0.0201,-0.14908 -0.0307,-0.22506 -0.003,-0.0251 -0.0125,-0.0474 -0.009,-0.0775 0.003,-0.0266 0.0154,-0.0451 0.0237,-0.0664 0.0208,-0.0535 0.0374,-0.0958 0.0582,-0.14924 0.0581,-0.1495 0.11388,-0.29718 0.16739,-0.44438 0,0 1e-5,-3e-5 1e-5,-3e-5 0.033,0.31773 0.0654,0.63519 0.0971,0.95231 0,0 1e-5,1e-5 1e-5,1e-5 0.0129,0.0308 0.0257,0.0616 0.0386,0.0925 0.005,0.0131 0.0116,0.0259 0.017,0.0393 -0.009,0.0176 -0.0172,0.0342 -0.0262,0.0511 -0.009,0.017 -0.0656,0.11928 -0.075,0.1363 0.17125,-0.31125 -0.50428,0.91679 -0.33303,0.60553 -0.50795,-0.032 -1.01524,-0.066 -1.51249,-0.0996 -0.54139,-0.0366 -1.07694,-0.0737 -1.60864,-0.11174 -0.53074,-0.0376 -1.02306,-0.0916 -1.48303,-0.10987 -0.53726,-0.0229 -1.09683,-0.0123 -1.67467,-0.019 0,0 -10e-6,0 -10e-6,0 -0.31587,-0.003 -0.58344,-0.0214 -0.80497,-0.0112 -0.24777,0.007 -0.55741,0.0586 -0.92982,0.0821 -0.58196,0.0345 -1.17349,0.0512 -1.71539,0.0743 2.8e-4,-1e-5 -1.702401,0.0725 -1.702115,0.0725 -0.593115,0.0255 -1.151812,0.0305 -1.676715,0.0697 -1.020069,0.074 -2.102237,0.25873 -3.122307,0.33274 -0.575003,0.0418 -1.116917,0.0476 -1.626762,0.071 -0.498361,0.0232 -0.991735,0.0502 -1.479791,0.0745 -0.490596,0.0247 -0.963283,0.0591 -1.473406,0.0667 -0.50622,0.007 -1.005891,-0.0341 -1.512111,-0.0272 -1.061413,0.014 -1.920711,0.0901 -2.969266,0.037 -0.490934,-0.0267 -0.929857,-0.094 -1.331229,-0.12339 -0.362223,-0.0292 -0.777595,0.002 -1.226933,-0.0281 -0.90306,-0.0662 -1.708835,-0.20119 -2.449142,-0.25126 -0.351217,-0.0257 -0.73516,-0.005 -1.134116,-0.0324 -0.368242,-0.027 -0.758036,-0.0919 -1.055226,-0.128 -0.39157,-0.0471 -0.770184,-0.0875 -1.131894,-0.13352 -0.347022,-0.0436 -0.651471,-0.10369 -0.929478,-0.13003 -0.262109,-0.0272 -0.554421,-0.008 -0.850198,-0.0371 -0.277237,-0.0291 -0.564912,-0.0946 -0.771905,-0.13432 0,0 -2e-6,0 -2e-6,0 -0.579018,-0.10801 -0.979931,-0.21515 -1.343719,-0.3813 -0.591382,-0.27711 -0.690496,-0.63551 -0.70248,-0.61953 0.03176,-0.0424 0.297335,0.20219 0.809425,0.32541 0.367825,0.0984 0.71237,0.13844 1.302112,0.18568 0,0 2e-6,0 2e-6,0 0.22259,0.0177 0.513405,0.0538 0.739999,0.0547 0.236574,0.003 0.512795,-0.0414 0.850698,-0.0371 0.321099,0.005 0.643886,0.0424 0.960402,0.059 0.401136,0.0216 0.734824,0.0339 1.13596,0.0555 0.348418,0.0192 0.691618,0.0582 1.023642,0.061 0.378735,0.005 0.755011,-0.0374 1.133746,-0.0324 0.799972,0.0115 1.626507,0.10595 2.464547,0.12672 0.411608,0.0112 0.818303,-0.0392 1.229912,-0.0281 0.460261,0.0138 0.900297,0.0622 1.3146,0.0656 0.884542,0.0125 1.839265,-0.0991 2.889369,-0.15202 0.533132,-0.0255 1.040876,-0.003 1.511697,-0.0272 0.460092,-0.0228 0.911357,-0.072 1.423457,-0.11385 0.471425,-0.0392 0.987768,-0.0842 1.481976,-0.12297 0.543059,-0.0424 1.074625,-0.0641 1.586039,-0.11797 1.0538,-0.10883 2.060496,-0.31438 3.114296,-0.42322 0.602947,-0.0605 1.155756,-0.0801 1.725071,-0.11933 2.78e-4,-2e-5 1.699385,-0.11649 1.699665,-0.1165 0.56819,-0.0387 1.13157,-0.068 1.68641,-0.11475 0.25506,-0.0211 0.57139,-0.0804 0.96006,-0.10686 0.34431,-0.0196 0.63874,-0.008 0.89589,-0.0112 0,0 10e-6,0 10e-6,0 0.5349,-0.007 1.12764,-0.0297 1.72713,-0.019 0.54035,0.011 1.05422,0.0549 1.54077,0.0791 0.53002,0.0264 1.06389,0.0521 1.60416,0.0773 0.49714,0.0232 1.00295,0.0467 1.5062,0.0682 0.0904,0.21133 0.18043,0.42354 0.27007,0.63637 0.0104,0.0247 0.0495,0.11779 0.06,0.14252 0.007,0.0176 0.0135,0.0356 0.0205,0.0526 -0.007,0.0119 -0.0144,0.0245 -0.0212,0.0369 -0.0162,0.0293 -0.0324,0.0587 -0.0486,0.0882 0,0 -1e-5,2e-5 -1e-5,2e-5 -0.0532,0.31317 -0.10586,0.62725 -0.15795,0.94232 0,0 -1e-5,-3e-5 -1e-5,-3e-5 -0.0303,-0.14982 -0.0585,-0.29979 -0.0844,-0.4486 -0.009,-0.0491 -0.0169,-0.0982 -0.0249,-0.14636 -0.003,-0.0204 -0.0104,-0.0436 -0.009,-0.0587 0.002,-0.017 0.0168,-0.0417 0.0262,-0.0638 0.0286,-0.067 0.0581,-0.13564 0.0881,-0.20432 0,0 10e-6,-2e-5 10e-6,-2e-5 0.0885,-0.30447 0.19085,-0.61219 0.30685,-0.91917 0.46014,0.0452 0.92542,0.081 1.4072,0.11895 0.52735,0.0419 1.08047,0.0375 1.60782,0.0794 1.02809,0.0821 2.09533,0.26808 3.12342,0.35023 0.47052,0.0394 1.00525,0.0347 1.60235,0.0804 0.60023,0.0471 1.16848,0.11744 1.73244,0.178 0.30986,0.0332 0.54156,0.0802 0.69817,0.0833 0.1499,0.011 0.43804,-0.0285 0.86679,-0.006 0.63228,0.0439 1.20284,0.1368 1.71685,0.17706 0.44279,0.0361 0.94986,0.0354 1.51874,0.0838 1.06244,0.0934 2.0695,0.26867 3.03264,0.35701 0.42343,0.0392 0.86984,0.0562 1.35277,0.0865 0.27791,0.0169 1.07461,0.0642 1.35252,0.0811 -2.7e-4,-2e-5 1.41836,0.0854 1.41809,0.0854 0.49701,0.0298 0.95609,0.0745 1.37798,0.0837 0,0 0,0 0,0 0.48592,0.0128 1.00915,-0.007 1.571,-0.0103 0,0 10e-6,0 10e-6,0 -0.001,10e-6 2.74149,-0.0159 2.74033,-0.0159 1.37094,-0.008 2.75703,-0.0152 4.15772,-0.0225 0,0 1e-5,0 1e-5,0 -3.6e-4,0 1.41778,-0.007 1.41742,-0.007 0.21777,-0.001 0.39207,0.005 0.52193,-0.002 0.59347,-0.0258 1.22487,-0.08 1.89854,-0.10397 0.4583,-0.0149 0.87673,-0.005 1.26478,-0.006 0,0 1e-5,0 1e-5,0 0.42424,-0.003 0.77964,0.0187 1.06276,-0.003 0.61467,-0.0378 1.30273,-0.14797 2.07829,-0.19813 0.45728,-0.0255 0.84132,-0.005 1.15744,-0.005 0,0 0,0 0,0 0.0133,-0.001 3.53657,-0.29539 3.54984,-0.2965 0.36201,-0.0204 0.64324,-0.006 0.84512,-0.006 -1e-4,0 0.66156,-0.002 0.66146,-0.002 0,0 10e-6,0 10e-6,0 0.27145,-0.003 0.42025,0.017 0.44294,0.004 -0.23376,0.0552 -0.11108,-0.0154 0.38888,-0.097 0.37008,-0.0262 0.62849,-0.009 0.77457,-0.007 -7e-5,0 0.56704,-0.002 0.56697,-0.002 0.32222,-0.0103 0.39943,0.0282 0.22641,0.0227 -0.51495,0.20857 -0.48318,0.14907 0.13004,-0.082 2e-5,-2e-5 4e-5,-1e-5 4e-5,-1e-5 0.29816,0.0619 0.51239,0.19714 0.62311,0.27298 0.0163,0.0117 0.0238,0.02 0.0263,0.0269 0.004,0.012 -0.007,0.0195 -0.0132,0.0333 -0.002,0.005 -0.004,0.0115 -0.004,0.0193 1.5e-4,0.0105 5e-4,0.026 0,0.0441 -8.6e-4,0.0314 -0.004,0.0704 -0.0159,0.10345 -0.007,0.0189 -0.016,0.0359 -0.0291,0.0484 -0.008,0.007 -0.0166,0.0141 -0.0267,0.0205 -0.0437,0.0277 -0.10943,0.0483 -0.19727,0.0794 -0.0202,0.007 -0.0416,0.0149 -0.0642,0.0234 -0.0382,0.0144 -0.0802,0.0339 -0.12483,0.0558 -0.0779,0.0382 -0.16393,0.0841 -0.25256,0.1239 -0.0508,0.0228 -0.10249,0.0437 -0.15397,0.0601 l 0,0 c -0.35225,-0.24986 -0.44237,-0.22771 -0.38322,0.14291 0.0101,0.061 0.0231,0.1375 0.0405,0.2248 0.0217,0.10894 0.0504,0.23473 0.0891,0.36828 0.019,0.0654 0.0403,0.13259 0.0645,0.20061 -1.09169,-0.48469 -0.95207,-0.66838 0.20435,-0.11281 l 0,0 c 0,0 -2e-5,-1e-5 -2e-5,-1e-5 -0.18058,-0.0625 -0.34964,-0.12144 -0.51086,-0.16657 -0.0368,-0.0103 -0.0978,-0.0363 -0.10965,-0.0175 -0.0103,0.0162 -0.003,0.0245 -0.001,0.0345 6.2e-4,0.01 0.002,0.0193 0.005,0.0278 -0.0122,-0.006 -0.0241,-0.0108 -0.0365,-0.0162 -0.0324,-0.0142 -0.0642,-0.0279 -0.0954,-0.0413 0,0 0,0 0,0 0,0 -1e-5,-1e-5 -1e-5,-1e-5 -0.11239,-0.0702 -0.22877,-0.14178 -0.34872,-0.21557 0.15295,0.0815 0.0744,0.0571 -0.21485,-0.11006 -0.49717,-0.40665 -0.47349,-0.43348 0.0408,-0.0155 0.30189,0.11519 0.16512,0.10161 -0.36849,-0.14009 -0.49918,-0.3979 -0.56761,-0.50762 -0.27424,-0.24387 0,0 0,0 0,0 0.0134,-0.001 -0.15555,-0.0695 -0.46356,-0.2751 -0.45959,-0.32782 -0.74494,-0.62062 -0.94702,-0.75296 0,0 0,-1e-5 0,-1e-5 -0.0314,-0.029 -0.18283,-0.0974 -0.42678,-0.25103 0,0 -2e-5,-10e-6 -2e-5,-10e-6 -0.24591,-0.15657 -0.42419,-0.28982 -0.55458,-0.36791 0,0 -10e-6,0 -10e-6,0 -0.65577,-0.39216 -1.52041,-0.81883 -2.36468,-1.55283 -0.99107,-0.90039 -1.85997,-1.878287 -2.68088,-2.862357 -0.43224,-0.515682 -0.90055,-1.05468 -1.35631,-1.640714 -0.22999,-0.321923 -0.33115,-0.529804 -0.36277,-0.585193 -0.6541,-1.057971 -1.32739,-2.123963 -1.99372,-3.214301 -0.23524,-0.384898 -0.46605,-0.777108 -0.68943,-1.177584 -0.25069,-0.455323 -0.41826,-0.853614 -0.57985,-1.153439 -1.17198,-2.192527 -2.44444,-4.401826 -3.61448,-6.734721 0,0 -1e-5,-1.5e-5 -1e-5,-1.5e-5 -0.32748,-0.710762 -0.41785,-1.256984 -0.52643,-1.537114 0,0 -1e-5,-6e-6 -1e-5,-6e-6 -0.0547,-0.183288 -0.3013,-0.517385 -0.55088,-1.091277 0,0 0,-1.2e-5 0,-1.2e-5 -0.20152,-0.481852 -0.33283,-0.901266 -0.47236,-1.225989 0,0 -1e-5,-8e-6 -1e-5,-8e-6 -0.15827,-0.376245 -0.36052,-0.779858 -0.56722,-1.228956 -0.17322,-0.447752 -0.31857,-0.862789 -0.47429,-1.229482 0,0 0,-6e-6 0,-6e-6 -0.0848,-0.218944 -0.33359,-0.577384 -0.5764,-1.155775 0,0 0,-1.5e-5 0,-1.5e-5 -0.17859,-0.441985 -0.36325,-0.92243 -0.51648,-1.450657 l 0,0 0,-8e-6 0,0 c -0.0528,-0.145105 -0.12933,-0.415608 -0.17523,-0.818222 0,0 0,-2.3e-5 0,-2.3e-5 0,0 -3e-5,1.6e-5 -3e-5,1.6e-5 -0.2437,0.124274 -0.30728,0.09001 -0.15021,-0.05283 0.12484,-0.113533 0.32381,-0.348194 0.64101,-0.664577 l 0,0 c 0,0 -1e-5,1.4e-5 -1e-5,1.4e-5 -0.14163,0.226562 -0.33507,0.381045 -0.54831,0.452607 l 0,0 c -0.12404,-0.275303 -0.19225,-0.477308 -0.25566,-0.57693 -0.007,-0.01051 -0.0217,-0.01748 -0.0169,0.01605 -0.003,-0.0049 -5.6e-4,-0.0089 -3e-5,-0.01473 -0.0357,-0.09516 -0.0709,-0.188512 -0.10574,-0.280014 -0.007,-0.02804 -0.0148,-0.0562 -0.0224,-0.08448 -0.0331,-0.123731 -0.0681,-0.249669 -0.10398,-0.377945 -0.0704,-0.181972 -0.31512,-0.57348 -0.50803,-1.255632 -0.0267,-0.167195 -0.0667,-0.414956 -0.0853,-0.747461 -0.34892,0.407527 -0.3731,0.387504 -0.0117,-0.01084 0.10767,-0.135118 0.23667,-0.30056 0.3999,-0.509661 -0.11453,0.255636 -0.2352,0.499158 -0.36108,0.730176 -0.0953,-0.214664 -0.1853,-0.425751 -0.27208,-0.632092 -0.15971,-0.54471 -0.23902,-1.008841 -0.32795,-1.370324 0,0 0,-1e-5 0,-1e-5 -0.0831,-0.347538 -0.18884,-0.726854 -0.2857,-1.145308 0,0 0,-1.1e-5 0,-1.1e-5 -0.11771,-0.511802 -0.17839,-0.943968 -0.27126,-1.276672 -0.063,-0.254388 -0.22325,-0.612517 -0.36988,-1.107662 0,0 -1e-5,-1.3e-5 -1e-5,-1.3e-5 -0.13241,-0.462801 -0.20373,-0.852487 -0.28736,-1.150451 -0.20201,-0.731004 -0.42763,-1.471075 -0.6475,-2.228226 -0.1134,-0.339633 -0.25547,-0.719693 -0.38434,-1.158106 -0.13522,-0.473553 -0.2,-0.859086 -0.28229,-1.134277 -0.21572,-0.746275 -0.49386,-1.551208 -0.68564,-2.473257 0,0 0,-1.2e-5 0,-1.2e-5 -0.0732,-0.374746 -0.11611,-0.768931 -0.18932,-1.143678 0,0 0,-8e-6 0,-8e-6 -0.0791,-0.417444 -0.18241,-0.857587 -0.2817,-1.3258 -0.0353,-0.211864 -0.0645,-0.404888 -0.096,-0.577745 -0.0127,-0.07204 -0.0603,-0.247837 -0.10339,-0.533824 0,0 -1e-5,-1.4e-5 -1e-5,-1.4e-5 -0.0548,-0.42763 -0.0528,-0.731903 -0.0866,-0.902942 0,0 0,-5e-6 0,-5e-6 0.002,-0.05285 -0.10145,-0.296743 -0.18768,-0.756156 -0.045,-0.517838 -0.0109,-0.663761 -0.007,-0.430783 -0.017,0.06461 -0.34073,-0.483021 -0.27251,-1.657986 -0.0415,-0.468985 0.005,-0.729683 -0.0136,-0.77954 0.0355,0.146888 -0.0309,0.0087 -0.09,-0.429477 -0.0242,-0.391173 0.002,-0.561497 -0.002,-0.509512 l 0,0 c -0.0229,-0.330356 -0.0452,-0.655923 -0.0695,-0.978347 l 0,0 c 0,0 4e-5,-1.2e-5 4e-5,-1.2e-5 0.26715,-0.08346 0.53447,-0.163957 0.80075,-0.241395 0.0619,-0.018 0.12377,-0.03584 0.18517,-0.05346 0.0235,-0.0064 0.0487,-0.01363 0.0697,-0.01904 0.0183,0.0043 0.041,0.0099 0.0622,0.01474 0.0496,0.01145 0.0995,0.023 0.14945,0.03464 0,10e-7 1e-5,10e-7 1e-5,2e-6 0.43091,0.0071 0.86221,0.02081 1.29332,0.04106 -1e-5,3e-6 -2e-5,6e-6 -3e-5,8e-6 -0.30019,0.111399 -0.59961,0.237804 -0.90442,0.37902 -0.0755,0.03498 -0.14683,0.07265 -0.23117,0.107327 -0.013,0.0054 -0.0282,0.0055 -0.0413,0.0047 -0.043,-0.0026 -0.0832,-0.0061 -0.12373,-0.0091 l 0,0 c -0.48595,-0.25836 -0.93174,-0.444348 -1.36979,-0.552655 l 0,0 c -0.076,-0.762099 -0.0706,-1.459429 -0.0966,-2.073442 l 0,0 0,-9e-6 0,0 c -0.0264,-0.654328 -0.0423,-1.27156 -0.0955,-1.857085 0.19467,-0.06091 0.38999,-0.116506 0.58328,-0.1664 0.0649,-0.01675 0.13679,-0.03965 0.19043,-0.04732 0.0353,-0.005 0.0824,0.01833 0.12589,0.02926 0.11421,0.0287 0.23067,0.05931 0.34753,0.09166 3e-5,4e-6 4e-5,6e-6 4e-5,6e-6 0.0289,0.115927 0.0339,0.150186 0.0576,0.09228 0.002,-0.0059 0.003,-0.0077 0.0151,-0.02475 0.0113,-0.01548 0.0162,-0.05857 0.0191,-0.0935 l 0,-1e-6 c -0.43617,0.118142 -0.85943,0.07132 -1.22665,-0.126213 0,0 -3e-5,-1.6e-5 -3e-5,-1.6e-5 l 0,0 c 0,0 0,6e-6 0,6e-6 0.005,0.08622 -0.0131,0.01206 -0.009,-0.219395 0,0 0,-1.8e-5 0,-1.8e-5 l 0,0 c 6e-4,-0.220718 0.001,-0.441205 0.002,-0.661458 -0.007,0.04503 -0.0161,-0.120988 0.0181,-0.493139 0.12825,-0.528293 0.19253,-0.591498 0.0858,-0.214731 0.0131,5.1e-5 -0.01,-0.143264 -0.006,-0.42607 -0.007,0.04469 -0.016,-0.121179 0.0181,-0.492613 0.12591,-0.516397 0.18953,-0.585329 0.0878,-0.231599 0.006,0.138104 -0.0298,-0.01151 -0.002,-0.441804 0,0 0,-2.4e-5 0,-2.4e-5 0.0545,-0.396012 0.11609,-0.55256 0.0974,-0.485772 -0.002,0.200222 -0.0333,0.04864 0.0107,-0.446597 0.24911,-0.711895 0.3215,-0.794268 0.11578,-0.288054 -0.054,0.615558 -0.0802,0.516956 0.0276,-0.281586 0.17935,-0.408613 0.32341,-0.636341 0.37747,-0.708005 0.14515,-0.165495 0.22104,-0.219683 0.1902,-0.184871 -0.0133,0.01568 -0.0513,0.04684 -0.10331,0.09567 -0.0421,0.03594 -0.0923,0.08565 -0.14465,0.147994 0.15534,-0.330229 0.31664,-0.558997 0.46111,-0.694434 0.20214,-0.238727 0.16564,-0.151257 -0.14194,0.234323 -0.12786,0.78666 -0.20269,0.929576 -0.13966,0.447995 0,0 1e-5,-8.2e-5 1e-5,-8.2e-5 -0.14081,-0.620077 0.16224,-1.021041 0.87678,-1.146505 0,0 3e-5,-3.7e-5 3e-5,-3.7e-5 0.36203,-0.440543 0.41457,-0.49246 0.0713,-0.258214 0,0 -3e-5,2e-5 -3e-5,2e-5 -0.26467,0.247889 -0.20451,0.11389 0.28417,-0.282356 0.33248,-0.188192 0.40948,-0.202302 0.19672,-0.08339 -0.37709,0.335129 -0.28035,0.246006 0.33305,-0.21272 0.4159,-0.09901 0.61196,-0.120874 0.58458,-0.09108 0,0 1e-5,-4.3e-5 1e-5,-4.3e-5 0.0418,-0.176276 0.19237,-0.195602 0.39937,-0.03143 0.0741,0.0655 0.148,0.154323 0.22995,0.265641 0.0865,0.117522 0.18201,0.260133 0.29295,0.425076 0.0248,0.0369 0.0504,0.07491 0.0769,0.114016 0,0 6e-5,9.2e-5 6e-5,9.2e-5 0.15128,0.04879 0.29021,0.404255 0.3708,1.061062 -0.32103,0.596038 -0.47464,0.798682 -0.36354,0.674973 0.0329,-0.06083 0.0439,-0.07281 0.0258,-0.04116 0.10514,-0.242438 0.0537,-0.03611 -0.25646,0.569426 -0.87328,0.660145 -1.00611,0.690003 -0.30582,0.228015 0.27254,-0.469017 0.30851,-0.351736 -0.0738,0.242915 -0.29017,0.33578 -0.37248,0.381894 -0.18978,0.188456 0.18619,-0.33012 0.17641,-0.254429 -0.0953,0.18877 -0.30151,0.349715 -0.37973,0.386793 -0.17248,0.164805 -0.6057,0.840577 -1.20424,1.749243 -1.9733,2.637755 -0.50858,0.576806 -1.01549,1.058489 -1.43958,1.523354 -0.0571,0.05431 -0.16372,0.223792 -0.37372,0.46099 -0.0227,0.02468 -0.0481,0.05109 -0.0725,0.07703 0,0 0,3e-6 0,3e-6 -0.0141,0.01427 -0.11637,0.117487 -0.13049,0.131753 l 0,1e-6 c -0.0417,0.04111 -0.27894,0.275028 -0.32061,0.316142 l 0,0 c -0.14601,0.16072 -0.28533,0.286503 -0.39963,0.384752 l -4.2e-4,4.66e-4 1e-5,-7e-6 0,0 c 0.0826,-0.17735 0.0663,0.01405 -0.21623,0.479333 -0.61931,0.870993 -1.29573,1.483794 -1.77097,2.058115 -0.35278,0.425117 -0.71751,1.029395 -1.27987,1.651132 -0.25428,0.27145 -0.46043,0.442886 -0.56986,0.564308 0,0 -1e-5,4e-6 -1e-5,4e-6 -0.0958,0.09811 -0.23679,0.300129 -0.47187,0.560859 0,0 -1e-5,10e-6 -1e-5,10e-6 -0.22947,0.245943 -0.40258,0.387471 -0.47495,0.470175 -0.34342,0.367294 -0.6224,0.777918 -0.96582,1.145212 -0.43245,0.452077 -0.83666,0.788118 -1.11886,1.104869 -0.0379,0.01609 -0.14949,0.260746 -0.45469,0.634203 0,0 -1e-5,9e-6 -1e-5,9e-6 -0.46113,0.527119 -0.89906,0.866296 -1.17111,1.162484 0,0 0,5e-6 0,5e-6 -0.0961,0.09817 -0.23764,0.302041 -0.47563,0.564086 -0.44133,0.472827 -0.85532,0.80724 -1.13167,1.117323 -0.32314,0.354769 -0.65115,0.778653 -1.04252,1.217082 -0.41692,0.465449 -0.82826,0.925076 -1.24476,1.386411 -0.27139,-0.06671 -0.54327,-0.131681 -0.81641,-0.195791 -0.2108,-0.04948 0.0247,0.0058 -0.18612,-0.04369 -0.0222,-0.0054 -0.0417,-0.0082 -0.0666,-0.01775 -0.0102,-0.01714 -0.0139,-0.03195 -0.0205,-0.04734 -0.0165,-0.03858 -0.0328,-0.07688 -0.0491,-0.115133 -1e-5,-1.1e-5 -2e-5,-2.2e-5 -3e-5,-3.2e-5 -0.23888,-0.295357 -0.47932,-0.58704 -0.72178,-0.875468 l 0,0 c 0.0923,-0.110028 0.17587,-0.207628 0.24697,-0.297007 l 3e-5,1.1e-5 c 0.22803,0.04887 0.4273,0.160337 0.58291,0.326154 0.0206,0.02201 0.034,0.04991 0.048,0.08088 0.0531,0.117589 0.0997,0.25275 0.13776,0.402837 10e-6,4.1e-5 10e-6,4.8e-5 10e-6,4.8e-5 0.13742,0.363387 0.26167,0.767331 0.35337,1.191245 0,0 0,5e-6 0,5e-6 -0.1644,0.173606 -0.3392,0.389421 -0.54148,0.623753 -0.36099,0.419099 -0.70748,0.809224 -1.03352,1.203771 -0.31532,0.380362 -0.64222,0.859779 -1.07879,1.350439 -0.47828,0.524873 -0.93809,0.882272 -1.23811,1.219811 -0.29564,0.319017 -0.59492,0.802923 -1.04914,1.31428 -0.45767,0.502614 -0.91107,0.885789 -1.26634,1.248981 0,0 0,5e-6 0,5e-6 -0.36309,0.370285 -0.72862,0.792945 -1.1439,1.218843 -0.45481,0.465464 -0.88988,0.828815 -1.21236,1.189151 -0.30996,0.33505 -0.61394,0.805508 -1.03686,1.297216 -0.39921,0.458981 -0.81432,0.868691 -1.17145,1.247613 -0.007,0.0072 -1.13884,1.210453 -1.14561,1.217645 -0.78861,0.837852 -1.50186,1.627237 -2.30494,2.447335 -0.4073,0.415467 -0.80494,0.769212 -1.142,1.117808 -0.77175,0.796525 -1.51331,1.635302 -2.299254,2.43556 -0.832327,0.846557 -1.669992,1.571129 -2.3801,2.322218 -0.765002,0.804287 -1.442355,1.718846 -2.207357,2.523133 -2.361708,2.474415 -4.589579,4.638663 -6.538487,6.61451 -0.286607,0.28939 -0.564101,0.604307 -0.856921,0.916677 -0.969945,1.034334 -1.88993,1.967863 -2.699486,2.864391 0,0 -3e-6,3e-6 -3e-6,3e-6 -4.73544,5.244628 -7.234478,8.282289 -7.39773,8.155319 z"
       id="path4644"
       inkscape:connector-curvature="0"
       inkscape:path-effect="#path-effect4646"
       inkscape:original-d="m 76.634672,102.43675 c 3.043225,-3.912712 2.574179,-3.376955 6.992559,-8.504461 0.858909,-0.996759 1.764314,-1.952493 2.645834,-2.929313 0.283906,-0.3146 0.55848,-0.63781 0.850445,-0.944941 2.133507,-2.244336 4.318516,-4.439915 6.425596,-6.709079 0.760188,-0.818663 1.415601,-1.730431 2.173362,-2.551337 0.755348,-0.818296 1.590805,-1.559314 2.362353,-2.362351 0.772163,-0.803683 1.501355,-1.647762 2.267859,-2.456847 0.36762,-0.388051 0.76374,-0.748318 1.13393,-1.133927 0.77183,-0.803998 1.5119,-1.637898 2.26785,-2.456847 0.37798,-0.409475 0.75596,-0.818949 1.13393,-1.228421 0.37798,-0.409474 0.77257,-0.804217 1.13393,-1.228423 0.36366,-0.426911 0.66685,-0.903767 1.03944,-1.322917 0.38472,-0.432813 0.82705,-0.811001 1.22842,-1.228423 0.38624,-0.401688 0.74769,-0.826733 1.13393,-1.228424 0.40136,-0.417422 0.8437,-0.79561 1.22842,-1.22842 0.37258,-0.419153 0.66685,-0.903767 1.03943,-1.322917 0.38473,-0.432813 0.8437,-0.79561 1.22842,-1.228423 0.37259,-0.419153 0.68519,-0.888161 1.03944,-1.322917 0.33882,-0.41583 0.69204,-0.819724 1.03944,-1.228423 0.18807,-0.221266 0.36999,-0.448072 0.56696,-0.661459 2.03044,-2.199647 -1.8441,2.212002 1.70089,-1.795385 0.3554,-0.401757 0.68177,-0.828683 1.03944,-1.228424 0.35643,-0.398359 0.77272,-0.739891 1.13392,-1.133927 0.16624,-0.181346 0.30624,-0.38562 0.47248,-0.566965 0.3612,-0.394039 0.78864,-0.725869 1.13392,-1.133928 0.17503,-0.206846 0.2918,-0.459531 0.47248,-0.661458 0.35642,-0.398362 0.7669,-0.745313 1.13392,-1.13393 0.33783,-0.357701 0.61398,-0.769866 0.94494,-1.133927 0.14982,-0.164804 0.32265,-0.307668 0.47247,-0.472472 0.16549,-0.182031 0.30624,-0.38562 0.47247,-0.566965 0.1806,-0.197017 0.38637,-0.369943 0.56697,-0.566963 0.72808,-0.794268 0.36027,-0.545324 1.22842,-1.606399 0.78456,-0.958908 1.02432,-1.000275 1.70089,-1.984375 0.11971,-0.174117 0.15921,-0.396081 0.28349,-0.566965 0.003,-0.0044 0.93414,-0.932939 0.94494,-0.944941 0.13492,-0.14991 0.24266,-0.322913 0.37797,-0.472469 0.46347,-0.512257 0.9637,-0.990981 1.41741,-1.511906 1.42166,-1.632272 0.79534,-1.018979 1.88988,-2.551337 0.0518,-0.0725 0.13554,-0.117718 0.18899,-0.188989 0.0423,-0.05635 0.0522,-0.132644 0.0945,-0.188989 0.0534,-0.07127 0.13553,-0.117716 0.18899,-0.188987 0.0845,-0.112691 0.0894,-0.278371 0.18898,-0.377976 0.0498,-0.0498 0.14673,-0.03815 0.18899,-0.0945 0.0598,-0.07968 0.0575,-0.191 0.0945,-0.28348 0.0262,-0.06539 0.0554,-0.130386 0.0945,-0.188989 0.11526,-0.1729 0.12047,-0.0094 0.18899,-0.283482 0.0153,-0.06111 0,-0.125992 0,-0.188987 0,-0.0315 0.0223,-0.07222 0,-0.0945 -0.0133,-0.01333 -0.2641,-0.0097 -0.28349,0 -0.0398,0.01992 -0.0574,0.06979 -0.0945,0.0945 -0.0586,0.03907 -0.13039,0.05542 -0.18899,0.09449 -0.10903,0.07269 -0.17445,0.210794 -0.28348,0.283483 -0.13771,0.0918 -0.19682,0.05899 -0.28348,0.188987 -0.17902,-0.01077 -0.063,0.220487 -0.0945,0.283482 -0.0199,0.03984 -0.063,0.063 -0.0945,0.09449 -0.10812,0.108117 -0.13178,0.111861 -0.18899,0.283483 -0.01,0.02988 0.0141,0.06632 0,0.0945 -0.0199,0.03984 -0.063,0.06299 -0.0945,0.09449 -0.063,0.125992 -0.14445,0.24434 -0.18899,0.377976 -0.0199,0.05976 0.0153,0.127873 0,0.188989 -0.0171,0.06833 -0.0829,0.119515 -0.0945,0.188987 -0.0207,0.124277 0.0139,0.252756 0,0.377975 -0.0177,0.159629 -0.0785,0.312659 -0.0945,0.472472 -0.0157,0.156708 0.0195,0.316196 0,0.472469 -0.0123,0.09884 -0.0781,0.185232 -0.0945,0.283483 -0.0155,0.09321 0,0.188989 0,0.283482 0,0.188987 0.0209,0.379132 0,0.566965 -0.011,0.099 -0.0781,0.185233 -0.0945,0.28348 -0.0155,0.09321 0,0.18899 0,0.283483 0,0.220488 0,0.440973 0,0.661458 0,0.125992 0.0156,0.252958 0,0.377976 -0.19643,1.571514 -0.18239,-2.487575 0,1.889882 0.0592,1.419661 -0.11573,0.09233 0.0945,1.984375 0.20758,1.868228 -0.0247,-1.66919 0.18898,1.322916 0.0112,0.157091 -0.0157,0.315762 0,0.472472 0.016,0.159811 0.0838,0.312216 0.0945,0.472469 0.0209,0.314283 -0.0299,0.631381 0,0.944941 -0.11356,0.512313 0.22372,0.939305 0.28348,1.41741 0.0156,0.125021 -0.0207,0.253698 0,0.377976 0.0427,0.256206 0.14629,0.499747 0.18899,0.755954 0.052,0.312243 0.0527,0.631166 0.0945,0.944941 0.0212,0.1592 0.0658,0.314449 0.0945,0.472469 0.0343,0.188505 0.063,0.377976 0.0945,0.566965 0.0945,0.44097 0.19832,0.880046 0.28349,1.322917 0.0724,0.376293 0.11383,0.758179 0.18898,1.133927 0.36176,1.808771 0.16132,0.647597 0.66146,2.362351 0.10909,0.374025 0.17439,0.759904 0.28348,1.13393 0.11156,0.382484 0.25199,0.755951 0.37798,1.133927 0.22048,0.755952 0.4507,1.509136 0.66146,2.267858 0.10427,0.375396 0.17439,0.759904 0.28348,1.133927 0.11156,0.382487 0.2744,0.749208 0.37797,1.13393 0.11725,0.435475 0.18208,0.883484 0.28349,1.322917 0.0876,0.379632 0.19256,0.755078 0.28348,1.133927 0.0981,0.408633 0.16273,0.82591 0.28348,1.228424 0.55563,1.296474 0.0783,0.02447 0.37798,1.322916 0.18062,0.782701 0.17964,0.372573 0.47247,1.133928 0.39938,1.397825 -0.0539,-0.03495 0.47247,1.228423 0.46702,1.120839 -0.0713,-0.01326 0.28348,1.228423 0.12864,0.450234 0.29857,0.888156 0.47247,1.322917 0.15695,0.392364 0.40298,0.744453 0.56697,1.133928 0.17024,0.404336 0.31497,0.818948 0.47246,1.228423 0.18899,0.409474 0.39125,0.813083 0.56697,1.228423 0.17094,0.404043 0.30222,0.824085 0.47247,1.228421 0.16399,0.389475 0.41652,0.739024 0.56696,1.13393 0.1773,0.465399 0.24975,0.97196 0.47247,1.41741 1.13437,2.268733 2.39863,4.470167 3.59078,6.709077 0.19861,0.373009 0.36173,0.764518 0.56696,1.13393 0.21251,0.382516 0.43394,0.760145 0.66146,1.133927 0.65448,1.075214 1.32467,2.140783 1.98438,3.212798 0.0962,0.156419 0.17118,0.327139 0.28348,0.472469 0.42414,0.548894 0.87884,1.073508 1.32291,1.6064 0.79921,0.959043 1.6259,1.899007 2.55134,2.740327 0.60368,0.54879 1.52331,1.015 2.17337,1.41741 0.19312,0.11955 0.37533,0.25603 0.56696,0.37798 0.15495,0.0986 0.32201,0.17815 0.47247,0.28348 0.33046,0.23132 0.61449,0.52463 0.94494,0.75595 0.15046,0.10533 0.32302,0.17673 0.47247,0.28348 0.0725,0.0518 0.1126,0.14316 0.18899,0.18899 0.0854,0.0512 0.19439,0.0499 0.28348,0.0945 0.0398,0.0199 0.0574,0.0698 0.0945,0.0945 0.0586,0.0391 0.12859,0.0583 0.18898,0.0945 0.81242,0.54162 -0.21547,-0.10774 0.56697,0.28348 0.23403,-0.0524 0.23711,0.21306 0.37798,0.28349 0.0282,0.0141 0.0722,-0.0223 0.0945,0 0.0498,0.0498 0.0447,0.13918 0.0945,0.18899 0.0223,0.0223 0.0722,-0.0223 0.0945,0 0.0223,0.0223 0.0223,0.0722 0,0.0945 -0.0223,0.0223 -0.0722,-0.0223 -0.0945,0 -0.0223,0.0223 0.0282,0.0804 0,0.0945 -0.0563,0.0282 -0.12787,-0.0153 -0.18898,0 -0.0683,0.0171 -0.11993,0.0807 -0.18899,0.0945 -0.15444,0.0309 -0.31498,0 -0.47247,0 -0.18899,0 -0.37798,0 -0.56697,0 -0.22048,0 -0.44188,-0.0199 -0.66146,0 -0.12933,0.0118 -0.24875,0.0816 -0.37797,0.0945 -0.18805,0.0188 -0.37798,0 -0.56697,0 -0.22048,0 -0.44097,0 -0.66146,0 -0.25198,0 -0.5045,-0.0164 -0.75595,0 -1.19692,0.0945 -2.39385,0.18899 -3.59077,0.28348 -0.37798,0 -0.75661,-0.0222 -1.13393,0 -0.69461,0.0409 -1.38426,0.14813 -2.07887,0.18899 -0.37732,0.0222 -0.75595,0 -1.13393,0 -0.40947,0 -0.81913,-0.0124 -1.22842,0 -0.63046,0.0191 -1.2596,0.0702 -1.88988,0.0945 -0.18885,0.007 -0.37798,0 -0.56696,0 -0.47248,0 -0.94495,0 -1.41742,0 -1.38591,0 -2.77182,0 -4.15773,0 -0.91345,0 -1.82689,0 -2.74033,0 -0.53547,0 -1.07119,0.0167 -1.6064,0 -0.47329,-0.0148 -0.94494,-0.063 -1.41741,-0.0945 -0.47247,-0.0315 -0.94494,-0.063 -1.41741,-0.0945 -0.21039,-0.014 -2.48387,-0.16334 -2.74033,-0.18899 -1.01074,-0.10107 -2.01246,-0.28316 -3.02381,-0.37798 -0.50275,-0.0471 -1.00891,-0.0501 -1.5119,-0.0945 -0.56825,-0.0501 -1.132,-0.14685 -1.7009,-0.18899 -0.2827,-0.0209 -0.56745,0.0166 -0.85044,0 -0.25351,-0.0149 -0.50368,-0.0654 -0.75595,-0.0945 -0.5667,-0.0654 -1.13253,-0.14027 -1.7009,-0.18899 -0.53443,-0.0458 -1.07221,-0.0459 -1.6064,-0.0945 -6.27256,-0.57023 3.47834,0.20409 -3.1183,-0.37797 -0.53432,-0.0472 -1.07208,-0.0474 -1.6064,-0.0945 -4.33192,-0.38223 1.20848,-0.0254 -3.30729,-0.28349 -0.53552,-0.0306 -1.07099,-0.062 -1.6064,-0.0945 -0.50402,-0.0306 -1.00717,-0.0797 -1.5119,-0.0945 -0.56672,-0.0167 -1.13393,0 -1.7009,0 -0.28348,0 -0.56735,-0.0149 -0.85044,0 -0.31612,0.0167 -0.6292,0.072 -0.94494,0.0945 -0.5664,0.0404 -1.13393,0.063 -1.7009,0.0945 -0.56696,0.0315 -1.133925,0.063 -1.70089,0.0945 -0.566963,0.0315 -1.135251,0.0446 -1.700893,0.0945 -1.04299,0.092 -2.075312,0.28595 -3.118302,0.37798 -0.534316,0.0471 -1.071052,0.061 -1.6064,0.0945 -0.316441,0.0198 -2.656144,0.18045 -2.929315,0.18899 -0.503722,0.0157 -1.008198,-0.0162 -1.511904,0 -1.979591,0.0639 -0.88075,0.16278 -2.929315,0.0945 -0.441852,-0.0147 -0.881372,-0.0724 -1.322917,-0.0945 -0.408964,-0.0205 -0.81946,0.0204 -1.228423,0 -0.820344,-0.041 -1.636133,-0.15616 -2.456844,-0.18899 -0.377675,-0.0151 -0.756312,0.0164 -1.133931,0 -0.347577,-0.0151 -0.692835,-0.0644 -1.039434,-0.0945 -0.377859,-0.0329 -0.7562,-0.0602 -1.133927,-0.0945 -0.315251,-0.0286 -0.628827,-0.0778 -0.944941,-0.0945 -0.283091,-0.0149 -0.567454,0.0166 -0.850447,0 -0.253506,-0.0149 -0.504235,-0.0609 -0.755952,-0.0945 -0.56397,-0.0752 -0.781391,-0.0866 -1.322917,-0.28349 -0.335719,-0.12208 -0.470019,-0.25802 -0.755951,-0.47247" />
    <text
       xml:space="preserve"
       style="font-style:normal;font-variant:normal;font-weight:normal;font-stretch:normal;font-size:10.58333302px;line-height:1.25;font-family:'FG Virgil';-inkscape-font-specification:'FG Virgil';font-variant-ligatures:normal;font-variant-caps:normal;font-variant-numeric:normal;font-feature-settings:normal;text-align:center;letter-spacing:0px;word-spacing:0px;writing-mode:lr-tb;text-anchor:middle;fill:#000000;fill-opacity:1;stroke:#0000f3;stroke-width:0.26458332;stroke-opacity:1;"
       x="132.10268"
       y="33.267113"
       id="text4650"><tspan
         sodipodi:role="line"
         id="tspan4648"
         x="132.10268"
         y="33.267113"
         style="stroke-width:0.26458332;stroke:#0000f3;stroke-opacity:1;">Qualitaet / Umfang</tspan></text>
    <text
       xml:space="preserve"
       style="font-style:normal;font-variant:normal;font-weight:normal;font-stretch:normal;font-size:10.58333302px;line-height:1.25;font-family:'FG Virgil';-inkscape-font-specification:'FG Virgil';font-variant-ligatures:normal;font-variant-caps:normal;font-variant-numeric:normal;font-feature-settings:normal;text-align:center;letter-spacing:0px;word-spacing:0px;writing-mode:lr-tb;text-anchor:middle;fill:#000000;fill-opacity:1;stroke:#00d101;stroke-width:0.26458332;stroke-opacity:1;"
       x="169.42783"
       y="114.43749"
       id="text4654"><tspan
         sodipodi:role="line"
         id="tspan4652"
         x="169.42783"
         y="114.43749"
         style="stroke-width:0.26458332;stroke:#00d101;stroke-opacity:1;">Kosten</tspan></text>
    <text
       xml:space="preserve"
       style="font-style:normal;font-variant:normal;font-weight:normal;font-stretch:normal;font-size:10.58333302px;line-height:1.25;font-family:'FG Virgil';-inkscape-font-specification:'FG Virgil';font-variant-ligatures:normal;font-variant-caps:normal;font-variant-numeric:normal;font-feature-settings:normal;text-align:center;letter-spacing:0px;word-spacing:0px;writing-mode:lr-tb;text-anchor:middle;fill:#000000;fill-opacity:1;stroke:#d10010;stroke-width:0.26458332;stroke-opacity:1;"
       x="61.8936"
       y="112.16965"
       id="text4658"><tspan
         sodipodi:role="line"
         id="tspan4656"
         x="61.8936"
         y="112.16965"
         style="stroke-width:0.26458332;stroke:#d10010;stroke-opacity:1;">Zeit</tspan></text>
    <text
       xml:space="preserve"
       style="font-style:normal;font-variant:normal;font-weight:normal;font-stretch:normal;font-size:5.64444447px;line-height:1.25;font-family:'FG Virgil';-inkscape-font-specification:'FG Virgil, Normal';font-variant-ligatures:normal;font-variant-caps:normal;font-variant-numeric:normal;font-feature-settings:normal;text-align:center;letter-spacing:0px;word-spacing:0px;writing-mode:lr-tb;text-anchor:middle;fill:#000000;fill-opacity:1;stroke:none;stroke-width:0.26458332"
       x="118.49553"
       y="74.088539"
       id="text4662"><tspan
         sodipodi:role="line"
         id="tspan4660"
         x="118.49553"
         y="74.088539"
         style="font-style:normal;font-variant:normal;font-weight:normal;font-stretch:normal;font-size:5.64444447px;font-family:'FG Virgil';-inkscape-font-specification:'FG Virgil, Normal';font-variant-ligatures:normal;font-variant-caps:normal;font-variant-numeric:normal;font-feature-settings:normal;text-align:center;writing-mode:lr-tb;text-anchor:middle;stroke-width:0.26458332">magisches</tspan><tspan
         sodipodi:role="line"
         x="118.49553"
         y="81.144096"
         style="font-style:normal;font-variant:normal;font-weight:normal;font-stretch:normal;font-size:5.64444447px;font-family:'FG Virgil';-inkscape-font-specification:'FG Virgil, Normal';font-variant-ligatures:normal;font-variant-caps:normal;font-variant-numeric:normal;font-feature-settings:normal;text-align:center;writing-mode:lr-tb;text-anchor:middle;stroke-width:0.26458332"
         id="tspan4664">Dreieck</tspan><tspan
         sodipodi:role="line"
         x="118.49553"
         y="88.199654"
         style="font-style:normal;font-variant:normal;font-weight:normal;font-stretch:normal;font-size:5.64444447px;font-family:'FG Virgil';-inkscape-font-specification:'FG Virgil, Normal';font-variant-ligatures:normal;font-variant-caps:normal;font-variant-numeric:normal;font-feature-settings:normal;text-align:center;writing-mode:lr-tb;text-anchor:middle;stroke-width:0.26458332"
         id="tspan4666">des</tspan><tspan
         sodipodi:role="line"
         x="118.49553"
         y="95.255203"
         style="font-style:normal;font-variant:normal;font-weight:normal;font-stretch:normal;font-size:5.64444447px;font-family:'FG Virgil';-inkscape-font-specification:'FG Virgil, Normal';font-variant-ligatures:normal;font-variant-caps:normal;font-variant-numeric:normal;font-feature-settings:normal;text-align:center;writing-mode:lr-tb;text-anchor:middle;stroke-width:0.26458332"
         id="tspan4668">Projektmanagments</tspan></text>
  </g>
</svg>
