@startuml
!include https://oer-informatik.gitlab.io/uml/umlklasse/plantuml/umlclass.cfg





abstract class Node

abstract class Parent




Node <|-down- Parent
Node <|-down[norank]- Shape

Parent <|-down- Region
Parent <|-down[norank]- Group
Parent <|-down[norank]- WebView


Region <|-down- Pane
Region <|-down-- Control


Control <|-down[norank]- Accordion
Control <|-down[norank]- ButtonBar
Control <|-down[norank]- ChoiceBox
Control <|-down[norank]- ComboBoxBase
Control <|-left- HTMLEditor
Control <|-down[norank]- Labeled
Control <|-down[norank]- ListView
Control <|-down[norank]- MenuBar
Control <|-down[norank]- Pagination
Control <|-down[norank]- ProgressIndicator
Control <|-left[norank]- ScrollBar
Control <|-down[norank]- ScrollPane
Control <|-left- Separator
Control <|-right- Slider
Control <|-down[norank]- Spinner
Control <|-down[norank]- SplitPane
Control <|-down[norank]- TableView
Control <|-right- TabPane
Control <|-down[norank]- TextInputControl
Control <|-down[norank]- ToolBar
Control <|-down[norank]- TreeTableView
Control <|-down[norank]- TreeView

' Ab hier nur zur Formatierung
Parent -right[hidden]- Shape
Region -right[hidden]- Group
Group -right[hidden]- WebView
Group -down[hidden]- Control

Accordion	-right[hidden]- ButtonBar
ButtonBar	-right[hidden]- ChoiceBox
ChoiceBox	-right[hidden]- ComboBoxBase
ComboBoxBase -right[hidden]-  HTMLEditor

Accordion	-down[hidden]- 	Labeled
Labeled	-right[hidden]-ListView

ListView-right[hidden]- MenuBar
MenuBar	-right[hidden]-Pagination
Pagination -right[hidden]-	ProgressIndicator
ProgressIndicator	-right[hidden]- ScrollBar
ScrollPane	-right[hidden]- Separator

'ListView-down[hidden]-	Slider
Slider	-right[hidden]-Spinner
Spinner	-right[hidden]-SplitPane
SplitPane -right[hidden]- ScrollPane
ScrollPane-right[hidden]- TableView


Slider	-down[hidden]- TreeView
TabPane -right[hidden]-TreeView
TreeView	-right[hidden]-TextInputControl
TextInputControl -right[hidden]-ToolBar
ToolBar	-right[hidden]-TreeTableView





@enduml 