@startuml
!include https://oer-informatik.gitlab.io/uml/umlklasse/plantuml/umlclass.cfg


class App{
+{static}main(args: String[])
+start(primaryStage: Stage) 
}


abstract class Application{
+{abstract}start(primaryStage: Stage)
+init()
+stop()
+{static}launch(args: String[])
}

class LauncherImpl{
+{static}launchApplication(startAppClass: Class, args: String[])
}

note right of App::main
  launch(args);
end note

note left of Application::launch
  LauncherImpl.launchApplication(appClass, args);
end note

note right of LauncherImpl::launchApplication
App theApp = new App(); // vereinfacht
theApp.init();	
final Stage primaryStage = new Stage();
theApp.start(primaryStage);
theApp.stop();
end note



Application -- LauncherImpl
Application <|- App
@enduml