@startuml
hide circle
skinparam classAttributeIconSize 0

skinparam DefaultFontName "Lucida Sans Typewriter"

skinparam Class{
    BorderColor DarkSlateBlue
    BackgroundColor LightYellow
}

skinparam Note{
    BorderColor DarkSlateBlue
    BackgroundColor LightYellow
}

skinparam ArrowColor DarkSlateBlue


class MockMvc{
+getDispatcherServlet(): DispatcherServlet 	
+perform(RequestBuilder requestBuilder): ResultActions
}

interface ResultActions <<Interface>>{ 
  {abstract}+andExpect(ResultMatcher matcher):ResultActions 
  {abstract}+andDo(ResultHandler handler): ResultActions
  {abstract}+ andReturn(): MvcResult
}


interface RequestBuilder <<Interface>>{ 
  {abstract} +buildRequest(ServletContext servletContext): MockHttpServletRequest
}


abstract class MockMvcRequestBuilders{
{static} get(uri: URI):  MockHttpServletRequestBuilder
{static} get(urlTemplate: String, uriVars[]: Object):  MockHttpServletRequestBuilder  
{static} delete(uri: URI):  MockHttpServletRequestBuilder
{static} delete(urlTemplate: String, uriVars[]: Object):  MockHttpServletRequestBuilder
{static} post(uri: URI):  MockHttpServletRequestBuilder
{static} post(urlTemplate: String, uriVars[]: Object):  MockHttpServletRequestBuilder
{static} put(uri: URI):  MockHttpServletRequestBuilder
{static} put(urlTemplate: String, uriVars[]: Object):  MockHttpServletRequestBuilder
}

class MockHttpServletRequestBuilder{
+ accept(mediaTypes: MediaType[]): MockHttpServletRequestBuilder
+ contentType(contentType: MediaType): MockHttpServletRequestBuilder
+ content(content: String): MockHttpServletRequestBuilder
+ param(name: String, values: String[]): MockHttpServletRequestBuilder
+ buildRequest(ServletContext servletContext): MockHttpServletRequest
}



MockHttpServletRequestBuilder ..|> RequestBuilder
MockMvcRequestBuilders .left.> MockHttpServletRequestBuilder : <<create>>
MockMvc ..> ResultActions: <<use>>
MockMvc .left.> RequestBuilder: <<use>>
@enduml 
