@startuml
hide circle
skinparam classAttributeIconSize 0

skinparam DefaultFontName "Lucida Sans Typewriter"

skinparam Class{
    BorderColor DarkSlateBlue
    BackgroundColor LightYellow
}

skinparam Note{
    BorderColor DarkSlateBlue
    BackgroundColor LightYellow
}
@startuml
skinparam DefaultFontName "Lucida Sans Typewriter"

skinparam sequence {
    ArrowColor DarkSlateBlue
	ActorBorderColor DarkSlateBlue
	ActorBackgroundColor whitesmoke
		
	LifeLineBorderColor DarkSlateBlue
	LifeLineBackgroundColor whitesmoke
	
	ParticipantBorderColor DarkSlateBlue
	ParticipantBackgroundColor whitesmoke
}

skinparam Note{
    BorderColor DarkSlateBlue
    BackgroundColor LightYellow
}

skinparam Database{
	BackgroundColor whitesmoke
	BorderColor DarkSlateBlue
}

skinparam Collections{
	BackgroundColor whitesmoke
	BorderColor DarkSlateBlue
}


hide footbox

title AddressControllerTest.testPost() #2

participant "jUnit\n:AddressControllerTest" as jUnit



activate jUnit

participant "mockMvc\n:MockMvc" as mockMvc
participant "requestBuilder\n:MockHttpServletRequestBuilder" as requestBuilder
participant "request\n: MockHttpServletRequest" as request


jUnit -> mockMvc:perform(requestBuilder)
activate mockMvc
mockMvc -> requestBuilder: buildRequest()
activate requestBuilder
create request
requestBuilder -->>request: new()
mockMvc <<-- requestBuilder: request
deactivate requestBuilder
mockMvc -> request: request.getAsyncContext().getResponse()
activate request
participant "response\n:HttpServletResponse" as response
create response
request -->>response: new()
mockMvc <<-- request: response: HttpServletResponse
deactivate request


participant "mvcResult\n:MvcResult" as mvcResult
create mvcResult
mockMvc -->> mvcResult: new(request, response)

participant "result\n:ResultActions" as result
create result
mockMvc -->>result: new()
mockMvc -> result: inject mvcResult 
jUnit <<-- mockMvc: resultAction: ResultActions
deactivate mockMvc

deactivate jUnit

@enduml
