@startuml
skinparam DefaultFontName "Lucida Sans Typewriter"

skinparam State{
    BackgroundColor snow
    BorderColor DarkSlateBlue
    DiamondBackgroundColor ghostwhite
    DiamondBorderColor DarkSlateBlue
}
skinparam Activity{
	DiamondBackgroundColor ghostwhite
	DiamondBorderColor DarkSlateBlue
}
skinparam Note{
    BorderColor DarkSlateBlue
    BackgroundColor LightYellow
}

skinparam ArrowColor DarkSlateBlue


state "<b>Eingabemaske dargestellt</b>\n neuen Eintrag erstellen oder \n vorhandenen bearbeiten" AS edit
edit: entry/editDetails()
state "<b>gefülltes Adressbuch dargestellt</b>\nTabelle mit der Auflistung der vorhandenen Einträge wird ausgegeben"  AS aufgelistet
aufgelistet: entry/list()
state "<b>Details angezeigt</b>\nEin Eintrag wurde angezeigt und ausgewählt."  AS show
show: entry/showDetails()
state "<b>Adresse gelöscht</b>"  AS geloescht
geloescht: entry/delete()


edit -down-> geloescht : "Eintrag Löschen"     \ngedrückt\n[Anzahl > 1]\n/Anzahl--
note top of geloescht
	Route POST "/address/delete/{id}"
end note
geloescht -down-> aufgelistet  : [true]\n/Weiterleitung an list()



aufgelistet --up--> edit : "Details bearbeiten" \noder\n "Neue Adresse ergänzen"      \ngedrückt

note bottom of aufgelistet
	Route GET "/adress"
	View: addresses.html
end note



aufgelistet -right-> show : "Details anzeigen" \ngedrückt
note bottom of show
	Route GET "/address/{id}"
	View: addressDetail.html
end note

show ---> edit: "Diese Adresse bearbeiten"\ngedrückt

'state "<b>gespeicherter Eintrag angezeigt</b>\nEin neuer Eintrag wurde gespeichert"  AS neuerEintrag

@enduml