@startuml
!include https://oer-informatik.gitlab.io/uml/umlklasse/plantuml/umlclass.cfg

class AddressRepositoryTest <<@DataJpaTest>> <<@ExtendWith(SpringExtension.class)>> {
- entityManager: TestEntityManager  
- addressRepository: AddressRepository 
+ AddressRepositoryTest()
{static} + setUpClass():void <<@BeforeAll>>
{static} +  tearDownClass():void <<@AfterAll>>
+setUp():void <<@BeforeEach>>
+tearDown():void <<@AfterEach>>

+testSave_createAddress():void 
+testfindById_readAddress():void 
+testSave_updateAddress():void
+testDelete_deletAddress():void 
}

note "@Autowired" as N3

AddressRepositoryTest::entityManager .up. N3
AddressRepositoryTest::addressRepository .up. N3




note "ohne\nImplementierung" as N1
AddressRepositoryTest::setUpClass .left. N1
AddressRepositoryTest::tearDownClass .left. N1
AddressRepositoryTest::setUp .left. N1
AddressRepositoryTest::tearDown .left. N1

note "@Test" as N2
AddressRepositoryTest::testSave_createAddress .right. N2
AddressRepositoryTest::testfindById_readAddress .right. N2
AddressRepositoryTest::testSave_updateAddress .right. N2
AddressRepositoryTest::testDelete_deletAddres .right. N2
@enduml