@startuml
skinparam DefaultFontName "Lucida Sans Typewriter"

skinparam State{
    BackgroundColor snow
    BorderColor DarkSlateBlue
    DiamondBackgroundColor ghostwhite
    DiamondBorderColor DarkSlateBlue
}
skinparam Activity{
	DiamondBackgroundColor ghostwhite
	DiamondBorderColor DarkSlateBlue
}
skinparam Note{
    BorderColor DarkSlateBlue
    BackgroundColor LightYellow
}

skinparam ArrowColor DarkSlateBlue

state "<b>leeres Adressbuch dargestellt</b>" AS leeresAdressbuch
leeresAdressbuch: entry/list()

[*] -right-> leeresAdressbuch
note top of leeresAdressbuch
	Route GET "/adress"
	View: adresses.html
end note
@enduml