@startuml

hide circle
skinparam classAttributeIconSize 0

skinparam DefaultFontName "Lucida Sans Typewriter"

skinparam Class{
    BorderColor DarkSlateBlue
    BackgroundColor    whitesmoke
}

skinparam Note{
    BorderColor DarkSlateBlue
    BackgroundColor LightYellow
}

skinparam ArrowColor DarkSlateBlue


interface Repository<T, ID>  <<Interface>>{
}


note bottom of Repository
  Marker-Interface
  zur Kennzeichnung
  eines Repositories
end note


interface CrudRepository<T, ID>  <<Interface>>{
{abstract} +count()
{abstract} +delete(T entity): void 
{abstract} +deleteAll (): void
{abstract} +deleteAll(Iterable<? extends T> entities): void
{abstract} +deleteById(ID id): void
{abstract} +existsById(ID id): boolean
{abstract} +findAll(): Iterable<T>
{abstract} +findAllById(Iterable<ID> ids): Iterable<T> 	
{abstract} +findById(ID id): Optional<T> 	
{abstract} +save(S entity): S
{abstract} +saveAll(Iterable <S > entities): Iterable<S>
}

note bottom of CrudRepository
  Interface für 
  allgemeine CRUD-Methoden
  und generische Typen
  
  Hinweis:
  <S extends T>
end note


interface JpaRepository<T, ID>  <<Interface>>{
{abstract} +deleteAllInBatch(): void 
{abstract} +deleteInBatch(Iterable<T> entities): void
{abstract} +findAll(): List<T>
{abstract} +findAll(Example<S > example): List<S >
{abstract} +findAll(Example<S > example, Sort sort)  : List<S > 
{abstract} +findAll(Sort sort): List<T > 
{abstract} +findAllById(Iterable<ID> ids) : List<T> 
{abstract} +flush(): void 
{abstract} +getOne(ID id): T
{abstract} +saveAll(Iterable<S > entities): List<S >
{abstract} +saveAndFlush(S entity): S 
}

note bottom of JpaRepository
  JPA-spezifische 
  Erweiterung von Registry
  
  Hinweis:
  <S extends T>
end note

note right of JpaRepository::deleteInBatch
 InBatch 
 heißt 
 hier 
 mit 
 einer 
 Query
end note


interface QueryByExampleExecutor<T> <<Interface>>{
 {abstract} +count(Example<S > example): long
 {abstract} +exists(Example<S > example): boolean
 {abstract} +findAll(Example<S > example): Iterable<S >
 {abstract} +findAll(Example<S > example, Pageable pageable): Page<S > 
 {abstract} +findAll(Example<S > example, Sort sort): Iterable<S > 
 {abstract} +findOne(Example<S > example) : Optional<S >
}

interface PagingAndSortingRepository<T,ID> <<Interface>>{
 {abstract} +findAll(Pageable pageable): Page<T>
 {abstract} +findAll(Sort sort): Iterable<T>
}

note left of QueryByExampleExecutor
 Ermöglicht Abfrage über
 Instanzen von 
 Example
 
 Hinweis:
 <S extends T>
end note
note bottom of PagingAndSortingRepository
  Erweitert Repository 
  um Seitennummerierung/
  Umbruch und Sortierung
end note

class SimpleJpaRepository<T,ID>
interface JpaRepositoryImplementation<T,ID> <<Interface>>{
 	 {abstract} +setEscapeCharacter(EscapeCharacter escapeCharacter):void
	 {abstract} +setRepositoryMethodMetadata(CrudMethodMetadata crudMethodMetadata): void
}



'interface AddressRepository <<Interface>>{
'}

Repository <|-right- CrudRepository
CrudRepository <|-right- PagingAndSortingRepository
PagingAndSortingRepository <|-right- JpaRepository
QueryByExampleExecutor <|-down- JpaRepository
JpaRepository <|-down- JpaRepositoryImplementation
JpaRepositoryImplementation <|.down. SimpleJpaRepository
'CrudRepository <|-down- AddressRepository

@enduml