@startuml
hide circle
skinparam classAttributeIconSize 0

skinparam DefaultFontName "Lucida Sans Typewriter"

skinparam Class{
    BorderColor DarkSlateBlue
    BackgroundColor LightYellow
}

skinparam Note{
    BorderColor DarkSlateBlue
    BackgroundColor LightYellow
}

skinparam ArrowColor DarkSlateBlue


class MockMvc{
+getDispatcherServlet(): DispatcherServlet 	
+perform(RequestBuilder requestBuilder): ResultActions
}

interface ResultActions <<Interface>>{ 
  {abstract}+andExpect(ResultMatcher matcher):ResultActions 
  {abstract}+andDo(ResultHandler handler): ResultActions
  {abstract}+ andReturn(): MvcResult
}

interface MockMvcBuilder <<Interface>>{ 
  {abstract}+build(): MockMvc
}

interface RequestBuilder <<Interface>>{ 
  {abstract} +buildRequest(ServletContext servletContext): MockHttpServletRequest
}

class MockMvcBuilders{
{static}  +standaloneSetup(Object... controllers): StandaloneMockMvcBuilder
{static}  +webAppContextSetup(WebApplicationContext context): DefaultMockMvcBuilder
}

abstract class MockMvcRequestBuilders{
{static} get(uri: URI):  MockHttpServletRequestBuilder
{static} get(urlTemplate: String, uriVars[]: Object):  MockHttpServletRequestBuilder  
{static} delete(uri: URI):  MockHttpServletRequestBuilder
{static} delete(urlTemplate: String, uriVars[]: Object):  MockHttpServletRequestBuilder
{static} post(uri: URI):  MockHttpServletRequestBuilder
{static} post(urlTemplate: String, uriVars[]: Object):  MockHttpServletRequestBuilder
{static} put(uri: URI):  MockHttpServletRequestBuilder
{static} put(urlTemplate: String, uriVars[]: Object):  MockHttpServletRequestBuilder
}


class DefaultMockMvcBuilder{
#initWebAppContext(): WebApplicationContext
}

abstract class AbstractMockMvcBuilder{
+build(): MockMvc
}

class MockHttpServletRequestBuilder{
+param(String name, String... values): MockHttpServletRequestBuilder
}

abstract class MockMvcResultMatchers{
{static} content(): ContentResultMatchers
{static} status(): StatusResultMatchers
{static} jsonPath(expression: String, matcher: Matcher<T>): ResultMatcher<T>
}

interface ResultMatcher <<Interface>>{ 
  {abstract} +match(MvcResult result):void
  {static} matchAll(ResultMatcher... matchers): ResultMatcher
}
class ContentResultMatchers{
+string(expectedContent: String): ResultMatcher
+contentType(contentType: MediaType): ResultMatcher
}
class StatusResultMatchers{
+isOk(): ResultMatcher
+isCreated(): ResultMatcher
+is2xxSuccessful(): ResultMatcher
}



DefaultMockMvcBuilder --|> AbstractMockMvcBuilder
ResultActions .right.> ResultMatcher: <<use>>
DefaultMockMvcBuilder .right.> MockMvc : <<create>>
RequestBuilder .right.> MockHttpServeltRequest : <<create>>
MockMvcRequestBuilders .left.> MockHttpServletRequestBuilder : <<create>>
MockMvcBuilders .right.> DefaultMockMvcBuilder : <<create>>
MockMvc ....> ResultActions: <<use>>
MockMvc .up.> RequestBuilder: <<use>>
MockHttpServletRequestBuilder ..|> RequestBuilder
DefaultMockMvcBuilder .up.|> MockMvcBuilder
MockMvcResultMatchers .down.> ContentResultMatchers : <<create>>
MockMvcResultMatchers .down.> StatusResultMatchers : <<create>>
ContentResultMatchers .down.> ResultMatcher : <<create>>
StatusResultMatchers .down.> ResultMatcher : <<create>>
@enduml 
