@startuml

hide circle
skinparam classAttributeIconSize 0

skinparam DefaultFontName "Lucida Sans Typewriter"

skinparam Class{
    BorderColor DarkSlateBlue
    BackgroundColor    whitesmoke
}

skinparam Note{
    BorderColor DarkSlateBlue
    BackgroundColor LightYellow
}

skinparam ArrowColor DarkSlateBlue

class java.lang.annotation.ElementType  <<enumeration>>{
TYPE
FIELD
METHOD
PARAMETER
CONSTRUCTOR
LOCAL_VARIABLE
ANNOTATION_TYPE
PACKAGE
TYPE_PARAMETER
TYPE_USE
MODULE
}

note right of java.lang.annotation.ElementType::TYPE
für class, interface, annotation, enum
end note
note right of java.lang.annotation.ElementType::FIELD
Attribute (Fields) und enum-Werte
end note
note right of java.lang.annotation.ElementType::TYPE_PARAMETER
Generische Typenparameter z.B.  T in class Box<T> 
end note

class java.lang.annotation.RetentionPolicy  <<enumeration>>{
SOURCE
CLASS
RUNTIME
}

note left of java.lang.annotation.RetentionPolicy::SOURCE
  vom Compiler verworfen - 
  nur im Quelltext sichtbar
end note
note left of java.lang.annotation.RetentionPolicy::CLASS
  werden ins *.class-File übernommen, 
  von der VM jedoch nicht ausgewertet
end note
note left of java.lang.annotation.RetentionPolicy::RUNTIME
  Werden von der VM ausgewertet und stehen 
  für Reflection zur Verfügung
end note

@enduml