@startuml

!includeurl https://oer-informatik.gitlab.io/uml/umlzustand/plantuml/umlstate.cfg

skinparam lineType polyline


state "<b>nicht  versioniert</b>\nProjektverzeichnis ist nicht versioniert" AS nichtVersioniert
state "<b>init</b>\n Repository angelegt aber leer" AS angelegt
state "<b>untracked</b>\nRepository mit unangemeldeten Dateien"  AS untracked
state "<b>staged</b>\nRepository mit angemeldeten Dateien"  AS staged
state "<b>modified</b>\nEine vorhandene Datei wurde geändert"  AS changed
state "<b>clean</b>\nAlle angemeldeten Änderungen sind in der aktuellen Version enthalten"  AS clean

[*] -right-> nichtVersioniert
nichtVersioniert -right-> angelegt : Repository erstellen
note on link : git init
angelegt -down-> untracked : neue Datei erstellt
note on link : touch beispiel.txt
untracked -left-> staged: Dateien vormerken
note on link : git add beispiel.txt
staged -down-> clean: Version ins Repository übernehmen
note on link : git commit -m "feat: Code anpassen"

clean -up-> untracked : neue Datei erstellt
note on link : touch beispiel.txt

clean -up-> changed : Datei modifiziert
note on link : pico beispiel.txt
changed -right-> staged: Dateien vormerken
note on link : git add beispiel.txt
@enduml
