@startuml
!includeurl https://oer-informatik.gitlab.io/uml/umlsequenz/plantuml/umlsequence.cfg

mainframe sd changeState

participant "subject :UIState" as cs
participant "observer1 :Transition" as co1

activate cs
|||
deactivate cs


@enduml 