@startuml
!include https://oer-informatik.gitlab.io/uml/umlklasse/plantuml/umlclass.cfg

'skinparam lineType ortho

class  UIStateEnum <<enumeration>>{
ANMELDEN_UI
LIST_UI
CREATE_DETAIL_UI
READ_DETAIL_UI
UPDATE_DETAIL_UI
DELETE_DETAIL_UI
--
- uiObject: UIStateInterface
--
~UIStateEnum(uiObject: UIStateInterface)
+getUIState(): UIStateInterface
+{static} getUIStateEnum(usedObject: Object): UIStateEnum
}

@enduml 