@startuml
!include https://oer-informatik.gitlab.io/uml/umlklasse/plantuml/umlclass.cfg

'skinparam lineType ortho

class UIContext{
-state: UIStateInterface
	+UIContext()
	+setState(state: UIStateInterface)
	+entry()
	+doing()
	+exit()
	{static}+main(args:String[])
}

interface UIStateInterface <<Interface>>{
  {abstract} +entry()
  {abstract} +doing()
  {abstract} +exit()
 }




class AnmeldenUI{

+login()
}

class  ListUI{

+abmelden()
}

class  CreateDetailUI{

+speichern()
}

class  ReadDetailUI{

}

class  UpdateDetailUI{
+loeschen()
+speichern()
}
class  DeleteDetailUI{
+loeschen()
}

abstract class "AbstractUIState\n{abstract}" as AbstractUIState{
+entry()
+doing()
+exit()
}


UIStateInterface <|.down. AbstractUIState
AbstractUIState <|-- AnmeldenUI
AbstractUIState <|-- ListUI
AbstractUIState <|-- CreateDetailUI
AbstractUIState <|-- ReadDetailUI
AbstractUIState <|-- UpdateDetailUI
AbstractUIState <|-- DeleteDetailUI

UIContext o-right- UIStateInterface

@enduml 