@startuml
!include https://oer-informatik.gitlab.io/uml/umlklasse/plantuml/umlclass.cfg

'skinparam lineType ortho


interface UIStateInterface <<Interface>>{
  {abstract} +entry()
  {abstract} +doing()
  {abstract} +exit()
  {abstract} +initializeTransitions()
  {abstract} +handleTriggerEvent(keyStroke String): UIStateEnum
}


abstract class "AbstractUIState\n{abstract}" as AbstractUIState{
-transitions Transitions
 +initializeTransitions()
 +addTransition(target: UIStateEnum, trigger: String, menueItem: String)
 +handleTriggerEvent(keyStroke String): UIStateEnum
 +entry()
 +doing()
 +exit()
}


UIStateInterface <|.down. AbstractUIState


@enduml 