@startuml
!includeurl https://oer-informatik.gitlab.io/uml/umlzustand/plantuml/umlstate.cfg

skinparam lineType ortho

left to right direction

state "<b>als Gast lesend</b>\n" AS gast
state "<b>registrierend</b>\n" AS registrierend
state "<b>abgemeldet</b>\n"  AS abgemeldet
state "<b>als Nutzer lesend</b>\n"  AS lesend
state "<b>als Nutzer schreibend</b>\n"  AS schreibend

[*] --> gast
gast --> registrierend : "Klick auf Registrierungseite"
gast --> lesend : "g"
registrierend -left-> lesend : "u"
lesend -left-> abgemeldet : "v"
abgemeldet --> [*] : "q"
lesend --> schreibend
schreibend --> lesend
@enduml
