@startuml
hide circle
skinparam classAttributeIconSize 0

skinparam DefaultFontName "Lucida Sans Typewriter"

skinparam Class{
    BorderColor DarkSlateBlue
    BackgroundColor    whitesmoke
}

skinparam Note{
    BorderColor DarkSlateBlue
    BackgroundColor LightYellow
}

skinparam ArrowColor DarkSlateBlue

class Model
class View
class Controller

interface Observable <<Interface>>{
  {abstract}+addObserver(observer: Observer)
  {abstract}+removeObserver(observer: Observer)
  {abstract}+notifyObservers()
}

class Model{
  -state: Object
  -observers: Observer[] [0..*]
  +setState(someState: Object)
  +getState(): Object
  +addObserver(observer: Observer)
  +removeObserver(observer: Observer)
  +notifyObservers()
}

note left of Model::setState 
 this.state = someState;
 notifyObservers();
end note


note left of Model::notifyObservers 
 for (observer: observers) {
   observer.update();
 }
end note

interface Observer  <<Interface>>{
  {abstract}+update()
}


class View{
  +update()
}



Observable <|.down. Model
Observer "0..*" <--o Model 
Observer <|.down.  View
@enduml