@startuml
hide circle
skinparam classAttributeIconSize 0

skinparam DefaultFontName "Lucida Sans Typewriter"

skinparam Class{
    BorderColor DarkSlateBlue
    BackgroundColor    whitesmoke
}

skinparam Interface{
    BorderColor DarkSlateBlue
    BackgroundColor    whitesmoke
}


skinparam Note{
    BorderColor DarkSlateBlue
    BackgroundColor LightYellow
}

skinparam ArrowColor DarkSlateBlue

class Model
class View
class Controller

Controller .down.> Model:ändert
Model ..right..> View :benachrichtigt
View ..left..> Model :holt Daten ab

View .up.> Controller:per Benutzer-\nereignis \nwird Controller \nbenachrichtigt





@enduml