@startuml
skinparam DefaultFontName "Lucida Sans Typewriter"

skinparam sequence {
    ArrowColor DarkSlateBlue
	ActorBorderColor DarkSlateBlue
	ActorBackgroundColor whitesmoke
		
	LifeLineBorderColor DarkSlateBlue
	LifeLineBackgroundColor whitesmoke
	
	ParticipantBorderColor DarkSlateBlue
	ParticipantBackgroundColor whitesmoke
}

skinparam Note{
    BorderColor DarkSlateBlue
    BackgroundColor LightYellow
}

skinparam Database{
	BackgroundColor whitesmoke
	BorderColor DarkSlateBlue
}

skinparam Collections{
	BackgroundColor whitesmoke
	BorderColor DarkSlateBlue
}


hide footbox


title Model-View-Controller Pattern

participant "client1 :Client" as client1
participant ":Controller" as controller
participant ":Model" as model
participant ":View" as view

activate client1
client1 -> controller
activate controller
controller -> model:setState(someState)
activate model
group Observer-Synchronisation
	model->model:notifyObservers()
	activate model


	model->view:update()
	activate view
	view->model:observerState=getState()
	activate model
	view<<--model:observerState=someState
	deactivate model
	model<<--view:update():void
	deactivate view

	model<<--model:notifyObservers():void
	deactivate model
end
controller <<-- model:void


deactivate model



deactivate client1
...
@enduml
