<?xml version="1.0" encoding="UTF-8" standalone="no"?>
<svg xmlns="http://www.w3.org/2000/svg" xmlns:xlink="http://www.w3.org/1999/xlink" contentScriptType="application/ecmascript" contentStyleType="text/css" height="195px" preserveAspectRatio="none" style="width:947px;height:195px;background:#FFFFFF;" version="1.1" viewBox="0 0 947 195" width="947px" zoomAndPan="magnify"><defs><filter height="300%" id="fmro3iqvlep7r" width="300%" x="-1" y="-1"><feGaussianBlur result="blurOut" stdDeviation="2.0"/><feColorMatrix in="blurOut" result="blurOut2" type="matrix" values="0 0 0 0 0 0 0 0 0 0 0 0 0 0 0 0 0 0 .4 0"/><feOffset dx="4.0" dy="4.0" in="blurOut2" result="blurOut3"/><feBlend in="SourceGraphic" in2="blurOut3" mode="normal"/></filter></defs><g><!--MD5=[46c1db258fa8f3fd700308c6dadd6b90]
class Rechnungsposten--><rect codeLine="16" fill="#F5F5F5" filter="url(#fmro3iqvlep7r)" height="103.9922" id="Rechnungsposten" style="stroke:#483D8B;stroke-width:1.5;" width="191" x="7" y="49.5"/><text fill="#000000" font-family="Lucida Sans Typewriter" font-size="12" lengthAdjust="spacing" textLength="107" x="49" y="65.6387">Rechnungsposten</text><line style="stroke:#483D8B;stroke-width:1.5;" x1="8" x2="197" y1="73.4688" y2="73.4688"/><text fill="#000000" font-family="Lucida Sans Typewriter" font-size="11" lengthAdjust="spacing" textLength="149" x="13" y="87.6792">⚷ Rechnungsposition «PK»</text><text fill="#000000" font-family="Lucida Sans Typewriter" font-size="11" lengthAdjust="spacing" textLength="157" x="13" y="100.4839">⚷ ↑ RechnungsNr «PK»«FK»</text><text fill="#000000" font-family="Lucida Sans Typewriter" font-size="11" lengthAdjust="spacing" textLength="6" x="13" y="113.2886">*</text><text fill="#000000" font-family="Lucida Sans Typewriter" font-size="11" font-weight="bold" lengthAdjust="spacing" textLength="99" x="19" y="113.2886">Artikelnummer</text><text fill="#000000" font-family="Lucida Sans Typewriter" font-size="11" lengthAdjust="spacing" textLength="70" x="122" y="113.2886">«NOT NULL»</text><text fill="#000000" font-family="Lucida Sans Typewriter" font-size="11" lengthAdjust="spacing" textLength="78" x="13" y="126.0933">Beschreibung</text><text fill="#000000" font-family="Lucida Sans Typewriter" font-size="11" lengthAdjust="spacing" textLength="133" x="13" y="138.8979">① Speicherzeit «UNIQ»</text><line style="stroke:#483D8B;stroke-width:1.5;" x1="8" x2="197" y1="145.4922" y2="145.4922"/><path d="M233,6 L233,14.5664 L162,83.8711 L233,22.5664 L233,31.1328 A0,0 0 0 0 233,31.1328 L701,31.1328 A0,0 0 0 0 701,31.1328 L701,16 L691,6 L233,6 A0,0 0 0 0 233,6 " fill="#FFFFE0" filter="url(#fmro3iqvlep7r)" style="stroke:#483D8B;stroke-width:1.0;"/><path d="M691,6 L691,16 L701,16 L691,6 " fill="#FFFFE0" style="stroke:#483D8B;stroke-width:1.0;"/><text fill="#000000" font-family="Lucida Sans Typewriter" font-size="13" lengthAdjust="spacing" textLength="447" x="239" y="23.0669">Primärschlüssel mit Stereotyp («PK») und Symbol (⚷) gekennzeichnet</text><path d="M233,41.1328 L233,57.2656 L170,96.6758 L233,65.2656 L233,81.3984 A0,0 0 0 0 233,81.3984 L722,81.3984 A0,0 0 0 0 722,81.3984 L722,51.1328 L712,41.1328 L233,41.1328 A0,0 0 0 0 233,41.1328 " fill="#FFFFE0" filter="url(#fmro3iqvlep7r)" style="stroke:#483D8B;stroke-width:1.0;"/><path d="M712,41.1328 L712,51.1328 L722,51.1328 L712,41.1328 " fill="#FFFFE0" style="stroke:#483D8B;stroke-width:1.0;"/><text fill="#000000" font-family="Lucida Sans Typewriter" font-size="13" lengthAdjust="spacing" textLength="222" x="239" y="58.1997">Teilschlüssel des Primärschlüssels,</text><text fill="#000000" font-family="Lucida Sans Typewriter" font-size="13" lengthAdjust="spacing" textLength="468" x="239" y="73.3325">als Fremdschlüssel mit Stereotyp («FK») und Symbol (↑) gekennzeichnet</text><path d="M233,91.3984 L233,99.9648 L192,109.4805 L233,107.9648 L233,116.5313 A0,0 0 0 0 233,116.5313 L938,116.5313 A0,0 0 0 0 938,116.5313 L938,101.3984 L928,91.3984 L233,91.3984 A0,0 0 0 0 233,91.3984 " fill="#FFFFE0" filter="url(#fmro3iqvlep7r)" style="stroke:#483D8B;stroke-width:1.0;"/><path d="M928,91.3984 L928,101.3984 L938,101.3984 L928,91.3984 " fill="#FFFFE0" style="stroke:#483D8B;stroke-width:1.0;"/><text fill="#000000" font-family="Lucida Sans Typewriter" font-size="13" lengthAdjust="spacing" textLength="684" x="239" y="108.4653">Eingabepflichtiges Attribut über Symbol (*), fett-Schreibweise und Stereotyp («NOT NULL») hervorgehoben</text><path d="M233,126.5313 L233,135.0977 L91,122.2852 L233,143.0977 L233,151.6641 A0,0 0 0 0 233,151.6641 L631,151.6641 A0,0 0 0 0 631,151.6641 L631,136.5313 L621,126.5313 L233,126.5313 A0,0 0 0 0 233,126.5313 " fill="#FFFFE0" filter="url(#fmro3iqvlep7r)" style="stroke:#483D8B;stroke-width:1.0;"/><path d="M621,126.5313 L621,136.5313 L631,136.5313 L621,126.5313 " fill="#FFFFE0" style="stroke:#483D8B;stroke-width:1.0;"/><text fill="#000000" font-family="Lucida Sans Typewriter" font-size="13" lengthAdjust="spacing" textLength="377" x="239" y="143.5981">optionale Attribute werden nicht gesondert hervorgehoben</text><path d="M233,161.6641 L233,170.2305 L146,135.0898 L233,178.2305 L233,186.7969 A0,0 0 0 0 233,186.7969 L804,186.7969 A0,0 0 0 0 804,186.7969 L804,171.6641 L794,161.6641 L233,161.6641 A0,0 0 0 0 233,161.6641 " fill="#FFFFE0" filter="url(#fmro3iqvlep7r)" style="stroke:#483D8B;stroke-width:1.0;"/><path d="M794,161.6641 L794,171.6641 L804,171.6641 L794,161.6641 " fill="#FFFFE0" style="stroke:#483D8B;stroke-width:1.0;"/><text fill="#000000" font-family="Lucida Sans Typewriter" font-size="13" lengthAdjust="spacing" textLength="550" x="239" y="178.731">Einzigartige Attribute (_uniq_) mit Stereotyp («UNIQ») und Symbol (①) hervorgehoben</text><!--MD5=[1487b87504e80044f18887d58298e6b2]
link Rechnungsposten to Rechnungsposten$$$RIGHT--><!--MD5=[23c804577c0a03e1d943bfcc93e2ecb0]
@startuml
hide circle
skinparam classAttributeIconSize 0
skinparam DefaultFontName "Lucida Sans Typewriter"
skinparam Class{
    BorderColor DarkSlateBlue
    BackgroundColor    whitesmoke
}
skinparam Note{
    BorderColor DarkSlateBlue
    BackgroundColor LightYellow
}
skinparam ArrowColor DarkSlateBlue
' avoid problems with angled crows feet
skinparam linetype ortho

entity "Rechnungsposten" {
  &#9911; Rechnungsposition <<PK>>
  &#9911; &#8593; RechnungsNr <<PK>><<FK>>
  * <b>Artikelnummer</B> <<NOT NULL>>
  Beschreibung
  &#9312; Speicherzeit <<UNIQ>>
}

note right of Rechnungsposten::Rechnungsposition
Primärschlüssel mit Stereotyp (<<PK>>) und Symbol (&#9911;) gekennzeichnet
end note

note right of Rechnungsposten::RechnungsNr
Teilschlüssel des Primärschlüssels, 
als Fremdschlüssel mit Stereotyp (<<FK>>) und Symbol (&#8593;) gekennzeichnet
end note

note right of Rechnungsposten::Artikelnummer
Eingabepflichtiges Attribut über Symbol (*), fett-Schreibweise und Stereotyp (<<NOT NULL>>) hervorgehoben
end note

note right of Rechnungsposten::Beschreibung
optionale Attribute werden nicht gesondert hervorgehoben
end note

note right of Rechnungsposten::Speicherzeit
Einzigartige Attribute (_uniq_) mit Stereotyp (<<UNIQ>>) und Symbol (&#9312;) hervorgehoben
end note
@enduml

@startuml
hide circle
skinparam classAttributeIconSize 0
skinparam DefaultFontName "Lucida Sans Typewriter"
skinparam Class{
    BorderColor DarkSlateBlue
    BackgroundColor    whitesmoke
}
skinparam Note{
    BorderColor DarkSlateBlue
    BackgroundColor LightYellow
}
skinparam ArrowColor DarkSlateBlue
skinparam linetype ortho

entity "Rechnungsposten" {
  &#9911; Rechnungsposition <<PK>>
  &#9911; &#8593; RechnungsNr <<PK>><<FK>>
  * <b>Artikelnummer</B> <<NOT NULL>>
  Beschreibung
  &#9312; Speicherzeit <<UNIQ>>
}

note right of Rechnungsposten::Rechnungsposition
Primärschlüssel mit Stereotyp (<<PK>>) und Symbol (&#9911;) gekennzeichnet
end note

note right of Rechnungsposten::RechnungsNr
Teilschlüssel des Primärschlüssels, 
als Fremdschlüssel mit Stereotyp (<<FK>>) und Symbol (&#8593;) gekennzeichnet
end note

note right of Rechnungsposten::Artikelnummer
Eingabepflichtiges Attribut über Symbol (*), fett-Schreibweise und Stereotyp (<<NOT NULL>>) hervorgehoben
end note

note right of Rechnungsposten::Beschreibung
optionale Attribute werden nicht gesondert hervorgehoben
end note

note right of Rechnungsposten::Speicherzeit
Einzigartige Attribute (_uniq_) mit Stereotyp (<<UNIQ>>) und Symbol (&#9312;) hervorgehoben
end note
@enduml

PlantUML version 1.2021.15beta8(Unknown compile time)
(GPL source distribution)
Java Runtime: Java(TM) SE Runtime Environment
JVM: Java HotSpot(TM) 64-Bit Server VM
Default Encoding: UTF-8
Language: en
Country: US
--></g></svg>