@startuml 

skinparam DefaultFontName "Lucida Sans Typewriter"

skinparam Activity{
BackgroundColor snow
BorderColor DarkSlateBlue
DiamondBackgroundColor ghostwhite
DiamondBorderColor DarkSlateBlue

}

skinparam ArrowMessageAlignment right
skinparam Note{
BorderColor DarkSlateBlue
BackgroundColor LightYellow
}
skinparam ArrowColor DarkSlateBlue
skinparam ActivityEndColor lightgray
skinparam ActivityStartColor lightgray

"Start" #lightgray -right-> "A" 
"A" -->[1] "B" 
"A"	-->[2] "C" 
"A"	-->[3] "D" 
"A" -->[4] "E"
"B" --> "F" 
"C"	--> "F" 
"D"	--> "F" 
"E" --> "F"
"F" -right-> "Stop" #lightgray
@enduml 

