{
  "project_info": {
    "project_number": "876576093507",
    "firebase_url": "https://runtrainer-216411.firebaseio.com",
    "project_id": "runtrainer-216411",
    "storage_bucket": "runtrainer-216411.appspot.com"
  },
  "client": [
    {
      "client_info": {
        "mobilesdk_app_id": "1:876576093507:android:9216204af73e274b",
        "android_client_info": {
          "package_name": "no.none.runtrainer"
        }
      },
      "oauth_client": [
        {
          "client_id": "876576093507-53vdp21a2792t0gd42atq3dsrga4alk3.apps.googleusercontent.com",
          "client_type": 1,
          "android_info": {
            "package_name": "no.none.runtrainer",
            "certificate_hash": "00500ddda4d2ebd945c9ebc3f098b23e5fbccded"
          }
        },
        {
          "client_id": "876576093507-2hc1vpq3b4r0lfdka26v7c8b2qgk4rjb.apps.googleusercontent.com",
          "client_type": 3
        }
      ],
      "api_key": [
        {
          "current_key": "AIzaSyB8vbsW6X9YGyfnF7vB-FfkwsDrutEFOGE"
        }
      ],
      "services": {
        "analytics_service": {
          "status": 1
        },
        "appinvite_service": {
          "status": 2,
          "other_platform_oauth_client": [
            {
              "client_id": "876576093507-2hc1vpq3b4r0lfdka26v7c8b2qgk4rjb.apps.googleusercontent.com",
              "client_type": 3
            }
          ]
        },
        "ads_service": {
          "status": 2
        }
      }
    }
  ],
  "configuration_version": "1"
}