2020-03-31 09:43:04 - INFO - running arguments: Namespace(batch_size=256, bit_width_list='1,2,4,8,32', dataset='imagenet', epochs=80, lr=0.5, lr_decay='45,60,70', model='resnet50q', optimizer='sgd', pretrain=None, print_freq=20, results_dir='/content/mydrive/any-precision-nets/results/exp_imagenet_resnet50q_1_0.3_lr_20200331_094256', resume='resnet50q_any_recursive.pth.tar', start_epoch=0, train_split='train', weight_decay=1e-05, workers=16)
2020-03-31 09:43:44 - INFO - loaded resume checkpoint 'resnet50q_any_recursive.pth.tar'
2020-03-31 09:43:44 - INFO - number of parameters: 25769512
2020-03-31 09:45:39 - INFO - Running 
2020-03-31 09:45:39 - INFO - Precision 8 bits
2020-03-31 09:45:50 - INFO - Running 
2020-03-31 09:45:50 - INFO - Precision 8 bits
2020-03-31 09:45:56 - INFO - Running 
2020-03-31 09:45:56 - INFO - Precision 8 bits
2020-03-31 09:46:03 - INFO - Running 
2020-03-31 09:46:03 - INFO - Precision 8 bits
2020-03-31 09:46:17 - INFO - Running 
2020-03-31 09:46:17 - INFO - Precision 8 bits
2020-03-31 09:46:23 - INFO - Running 
2020-03-31 09:46:23 - INFO - Precision 8 bits
2020-03-31 09:46:30 - INFO - Running 
2020-03-31 09:46:30 - INFO - Precision 8 bits
2020-03-31 09:46:36 - INFO - Running 
2020-03-31 09:46:36 - INFO - Precision 8 bits
2020-03-31 09:46:42 - INFO - Running 
2020-03-31 09:46:42 - INFO - Precision 8 bits
2020-03-31 09:46:48 - INFO - Running 
2020-03-31 09:46:48 - INFO - Precision 8 bits
2020-03-31 09:46:55 - INFO - Running 
2020-03-31 09:46:55 - INFO - Precision 8 bits
2020-03-31 09:47:01 - INFO - Running 
2020-03-31 09:47:01 - INFO - Precision 8 bits
2020-03-31 09:47:07 - INFO - Running 
2020-03-31 09:47:07 - INFO - Precision 8 bits
2020-03-31 09:47:13 - INFO - Running 
2020-03-31 09:47:13 - INFO - Precision 8 bits
2020-03-31 09:47:20 - INFO - Running 
2020-03-31 09:47:20 - INFO - Precision 8 bits
2020-03-31 09:47:26 - INFO - Running 
2020-03-31 09:47:26 - INFO - Precision 8 bits
