# Blender v2.92.0 OBJ File: ''
# www.blender.org
o SeatSecond_Handles
v 0.251250 0.411829 0.250237
v 0.251250 0.457419 0.265330
v 0.251250 0.436982 0.233888
v 0.251250 0.432266 0.281679
v 0.251250 0.498946 0.193612
v 0.251250 0.544536 0.208704
v 0.251250 0.524099 0.177262
v 0.251250 0.519383 0.225053
v 0.251250 0.535733 0.250207
v 0.251250 0.473769 0.290483
v 0.281250 0.535733 0.250207
v 0.281250 0.473769 0.290483
v 0.281250 0.544536 0.208704
v 0.281250 0.524099 0.177262
v 0.281250 0.498946 0.193612
v 0.281250 0.519383 0.225053
v 0.281250 0.457419 0.265330
v 0.281250 0.436982 0.233888
v 0.281250 0.411829 0.250237
v 0.281250 0.432266 0.281679
v 0.251250 0.411829 -0.250238
v 0.251250 0.457419 -0.265330
v 0.251250 0.432266 -0.281680
v 0.251250 0.436982 -0.233888
v 0.251250 0.535732 -0.250207
v 0.251250 0.473769 -0.290483
v 0.251250 0.519382 -0.225053
v 0.251250 0.544536 -0.208704
v 0.251250 0.498946 -0.193612
v 0.251250 0.524099 -0.177263
v 0.281250 0.473769 -0.290483
v 0.281250 0.535732 -0.250207
v 0.281250 0.432266 -0.281680
v 0.281250 0.411829 -0.250238
v 0.281250 0.436982 -0.233888
v 0.281250 0.457419 -0.265330
v 0.281250 0.519382 -0.225053
v 0.281250 0.498946 -0.193612
v 0.281250 0.524099 -0.177263
v 0.281250 0.544536 -0.208704
vt 0.824600 0.497200
vt 0.844300 0.513000
vt 0.824600 0.513000
vt 0.844300 0.497200
vt 0.824600 0.552000
vt 0.844300 0.567800
vt 0.824600 0.567800
vt 0.844300 0.552000
vt 0.860200 0.552000
vt 0.860200 0.513000
vt 0.797600 0.776300
vt 0.836500 0.760500
vt 0.836500 0.776300
vt 0.797600 0.760500
vt 0.775200 0.760500
vt 0.775200 0.776300
vt 0.873000 0.568800
vt 0.857200 0.588600
vt 0.857200 0.568800
vt 0.873000 0.588600
vt 0.874100 0.769900
vt 0.854300 0.754100
vt 0.874100 0.754100
vt 0.854300 0.769900
vt 0.853300 0.776300
vt 0.837500 0.737300
vt 0.853300 0.737300
vt 0.837500 0.776300
vt 0.815700 0.596600
vt 0.799900 0.616400
vt 0.799900 0.596600
vt 0.815700 0.616400
vt 0.283800 0.823400
vt 0.299600 0.803600
vt 0.299600 0.823400
vt 0.283800 0.803600
vt 0.299600 0.845800
vt 0.283800 0.845800
vt 0.815700 0.759500
vt 0.835500 0.743700
vt 0.835500 0.759500
vt 0.815700 0.743700
vt 0.799900 0.743700
vt 0.815700 0.704700
vt 0.799900 0.704700
vt 0.815700 0.688900
vt 0.835500 0.688900
vt 0.835500 0.704700
vt 0.860200 0.425600
vt 0.840400 0.441400
vt 0.840400 0.425600
vt 0.860200 0.441400
vt 0.824600 0.480400
vt 0.824600 0.441400
vt 0.840400 0.480400
vt 0.840400 0.496200
vt 0.860200 0.480400
vt 0.860200 0.496200
vt 0.299600 0.760500
vt 0.283800 0.721500
vt 0.299600 0.721500
vt 0.283800 0.760500
vt 0.283800 0.699100
vt 0.299600 0.699100
vt 0.299600 0.679300
vt 0.283800 0.679300
vt 0.299600 0.846700
vt 0.283800 0.866500
vt 0.283800 0.846700
vt 0.299600 0.866500
vt 0.276900 0.503700
vt 0.237900 0.519500
vt 0.237900 0.503700
vt 0.276900 0.519500
vt 0.874100 0.753200
vt 0.854300 0.737300
vt 0.874100 0.737300
vt 0.854300 0.753200
vt 0.299600 0.782900
vt 0.283800 0.802700
vt 0.283800 0.782900
vt 0.299600 0.802700
vt 0.835500 0.672100
vt 0.819700 0.617300
vt 0.835500 0.633100
vt 0.819700 0.633100
vt 0.819700 0.672100
vt 0.819700 0.687900
vt 0.799900 0.672100
vt 0.799900 0.687900
vt 0.799900 0.617300
vt 0.799900 0.633100
vn -1.0000 0.0000 0.0000
vn 0.0000 0.5450 0.8384
vn 0.0000 0.9782 0.2075
vn 0.0000 0.8384 -0.5450
vn 0.0000 -0.8384 0.5450
vn 0.0000 -0.5450 -0.8384
vn 0.0000 -0.2075 0.9782
vn 1.0000 0.0000 0.0000
vn 0.0000 0.5450 -0.8384
vn 0.0000 -0.2075 -0.9782
vn 0.0000 -0.8384 -0.5450
vn 0.0000 0.8384 0.5450
vn 0.0000 -0.5450 0.8384
vn 0.0000 -0.8385 -0.5450
vn 0.0000 0.9782 -0.2075
s 1
f 1/1/1 2/2/1 3/3/1
f 2/2/1 1/1/1 4/4/1
f 5/5/1 6/6/1 7/7/1
f 6/6/1 5/5/1 8/8/1
f 6/6/1 8/8/1 9/9/1
f 9/9/1 8/8/1 2/2/1
f 9/9/1 2/2/1 10/10/1
f 10/10/1 2/2/1 4/4/1
f 11/11/2 10/12/2 12/13/2
f 10/12/2 11/11/2 9/14/2
f 6/15/3 11/11/3 13/16/3
f 11/11/3 6/15/3 9/14/3
f 7/17/4 13/18/4 14/19/4
f 13/18/4 7/17/4 6/20/4
f 8/21/5 15/22/5 16/23/5
f 15/22/5 8/21/5 5/24/5
f 8/25/6 17/26/6 2/27/6
f 17/26/6 8/25/6 16/28/6
f 3/29/4 17/30/4 18/31/4
f 17/30/4 3/29/4 2/32/4
f 4/33/5 19/34/5 20/35/5
f 19/34/5 4/33/5 1/36/5
f 12/37/7 4/33/7 20/35/7
f 4/33/7 12/37/7 10/38/7
f 13/39/8 15/40/8 14/41/8
f 15/40/8 13/39/8 16/42/8
f 16/42/8 13/39/8 11/43/8
f 16/42/8 11/43/8 17/44/8
f 17/44/8 11/43/8 12/45/8
f 17/44/8 12/45/8 20/46/8
f 17/44/8 19/47/8 18/48/8
f 19/47/8 17/44/8 20/46/8
f 21/49/1 22/50/1 23/51/1
f 22/50/1 21/49/1 24/52/1
f 23/51/1 25/53/1 26/54/1
f 25/53/1 23/51/1 22/50/1
f 25/53/1 22/50/1 27/55/1
f 25/53/1 27/55/1 28/56/1
f 28/56/1 27/55/1 29/57/1
f 28/56/1 29/57/1 30/58/1
f 25/59/9 31/60/9 26/61/9
f 31/60/9 25/59/9 32/62/9
f 26/61/10 33/63/10 23/64/10
f 33/63/10 26/61/10 31/60/10
f 21/65/11 33/63/11 34/66/11
f 33/63/11 21/65/11 23/64/11
f 22/67/12 35/68/12 36/69/12
f 35/68/12 22/67/12 24/70/12
f 37/71/13 22/72/13 36/73/13
f 22/72/13 37/71/13 27/74/13
f 29/75/14 37/76/14 38/77/14
f 37/76/14 29/75/14 27/78/14
f 28/79/12 39/80/12 40/81/12
f 39/80/12 28/79/12 30/82/12
f 25/59/15 40/81/15 32/62/15
f 40/81/15 25/59/15 28/79/15
f 32/83/8 33/84/8 31/85/8
f 33/84/8 32/83/8 36/86/8
f 36/86/8 32/83/8 37/87/8
f 37/87/8 32/83/8 40/88/8
f 37/87/8 40/88/8 38/89/8
f 38/89/8 40/88/8 39/90/8
f 36/86/8 34/91/8 33/84/8
f 34/91/8 36/86/8 35/92/8
o SeatSecond_Base
v -0.228750 0.115464 0.322500
v -0.228750 0.055464 0.322500
v 0.221250 0.092964 0.322500
v 0.221250 0.025464 0.322500
v 0.131250 0.002964 0.322500
v 0.221250 0.025464 0.262500
v 0.221250 0.092964 0.262500
v 0.131250 0.002964 0.262500
v -0.228750 0.055464 0.262500
v -0.228750 0.115464 0.262500
v 0.191250 0.392964 -0.262500
v 0.303750 0.317964 -0.262500
v 0.191250 0.317964 -0.262500
v 0.303750 0.392964 -0.262500
v 0.228750 0.317964 -0.187500
v 0.228750 0.508348 -0.187500
v 0.228750 0.542964 -0.165000
v 0.303750 0.542964 -0.165000
v 0.303750 0.317964 0.262500
v 0.303750 0.542964 0.165000
v 0.303750 0.392964 0.262500
v -0.303750 -0.209536 -0.262500
v 0.165898 -0.244536 -0.262500
v 0.116250 -0.244536 -0.262500
v 0.189010 -0.150227 -0.262500
v -0.303750 -0.117036 -0.262500
v 0.082500 -0.117036 -0.262500
v 0.116250 -0.132036 -0.187500
v 0.228750 0.542964 0.165000
v 0.191250 0.392964 0.262500
v 0.228750 0.508349 0.187500
v 0.082500 -0.117036 0.262500
v 0.189011 -0.150226 0.262500
v 0.191250 0.317964 0.262500
v 0.116250 -0.244536 0.262500
v 0.165899 -0.244536 0.262500
v -0.303750 -0.209536 0.262500
v -0.303750 -0.117036 0.262500
v -0.303750 -0.132036 -0.187500
v -0.303750 -0.132036 0.187500
v 0.228750 0.317964 0.187500
v 0.116250 -0.132036 0.187500
v -0.228750 0.055464 -0.322500
v 0.221250 0.025464 -0.322500
v 0.131250 0.002964 -0.322500
v 0.221250 0.092964 -0.322500
v -0.228750 0.115464 -0.322500
v 0.221250 0.092964 -0.262500
v 0.221250 0.025464 -0.262500
v 0.131250 0.002964 -0.262500
v -0.228750 0.055464 -0.262500
v -0.228750 0.115464 -0.262500
vt 0.725300 0.862000
vt 0.720700 0.893300
vt 0.488700 0.839500
vt 0.483500 0.874700
vt 0.528800 0.893300
vt 0.856200 0.568800
vt 0.856200 0.604400
vt 0.824600 0.568800
vt 0.824600 0.604400
vt 0.775200 0.916400
vt 0.775200 0.948100
vt 0.726200 0.916400
vt 0.726200 0.948100
vt 0.967100 0.916400
vt 0.967100 0.948100
vt 0.836400 0.681600
vt 0.836400 0.649900
vt 0.868100 0.681600
vt 0.868100 0.649900
vt 0.999100 0.351800
vt 0.999100 0.383500
vt 0.761400 0.351800
vt 0.761400 0.383500
vt 0.965700 0.889200
vt 0.728000 0.889200
vt 0.964100 0.857600
vt 0.726200 0.853700
vt 0.773100 0.839500
vt 0.398400 0.135000
vt 0.456000 0.173200
vt 0.398500 0.173400
vt 0.455900 0.134900
vt 0.530800 0.669200
vt 0.484800 0.706600
vt 0.486900 0.666300
vt 0.528100 0.770200
vt 0.417400 0.076000
vt 0.709100 0.424700
vt 0.760500 0.306000
vt 0.760500 0.345500
vt 0.483500 0.306000
vt 0.535000 0.424700
vt 0.483500 0.345500
vt 0.146200 0.443500
vt 0.386200 0.460800
vt 0.360900 0.460800
vt 0.397900 0.412600
vt 0.146100 0.396200
vt 0.343500 0.395700
vt 0.483500 0.429600
vt 0.528200 0.425600
vt 0.761400 0.789700
vt 0.935500 0.829300
vt 0.761400 0.829300
vt 0.935500 0.789700
vt 0.039500 0.458500
vt 0.078300 0.458300
vt 0.078200 0.440400
vt 0.039000 0.342100
vt 0.152400 0.116500
vt 0.097300 0.099600
vt 0.097200 0.341800
vt 0.039100 0.380900
vt 0.097400 0.380600
vt 0.134700 0.050600
vt 0.109000 0.050700
vt 0.352100 0.067700
vt 0.352300 0.115600
vt 0.760500 0.051700
vt 0.760500 0.000500
vt 0.483500 0.000500
vt 0.277400 0.995100
vt 0.000500 0.968900
vt 0.277400 0.968900
vt 0.000500 0.995100
vt 0.278400 0.523500
vt 0.277000 0.745400
vt 0.000500 0.745400
vt 0.001660 0.528816
vt 0.483500 0.789700
vt 0.523100 0.830600
vt 0.483500 0.838500
vt 0.760500 0.789700
vt 0.720900 0.830600
vt 0.760500 0.838500
vt 0.000500 0.950100
vt 0.040800 0.746400
vt 0.040800 0.967900
vt 0.000500 0.746400
vt 0.768900 0.668800
vt 0.727400 0.770200
vt 0.725000 0.671100
vt 0.769900 0.708300
vt 0.774200 0.430600
vt 0.729400 0.426200
vt 0.238600 0.746400
vt 0.279000 0.950100
vt 0.238600 0.967900
vt 0.279000 0.746400
vt 0.721400 0.967200
vt 0.483500 0.963200
vt 0.530400 0.949000
vt 0.485300 0.998800
vt 0.723000 0.998800
vt 0.836400 0.617300
vt 0.872000 0.649000
vt 0.836400 0.649000
vt 0.872000 0.617300
vt 0.772900 0.949000
vt 0.723900 0.980700
vt 0.723900 0.949000
vt 0.772900 0.980700
vt 0.964800 0.949000
vt 0.964800 0.980700
vt 0.868100 0.688900
vt 0.836500 0.720600
vt 0.836500 0.688900
vt 0.868100 0.720600
vt 0.999100 0.384400
vt 0.761400 0.416100
vt 0.761400 0.384400
vt 0.999100 0.416100
vt 0.483500 0.929500
vt 0.720700 0.948100
vt 0.528800 0.948100
vt 0.488700 0.894200
vt 0.725300 0.916800
vt 0.417400 0.058300
vt 0.455700 0.058300
vn -0.0000 -0.0000 1.0000
vn 1.0000 0.0000 0.0000
vn 0.2425 -0.9701 -0.0000
vn -0.1443 -0.9895 -0.0000
vn -1.0000 0.0000 0.0000
vn 0.0499 0.9988 0.0000
vn 0.0000 0.0000 -1.0000
vn -0.8944 -0.0000 0.4472
vn -0.0000 0.5450 -0.8384
vn -0.8729 0.2182 0.4364
vn 0.0000 1.0000 0.0000
vn 0.0000 0.5450 0.8384
vn 0.9713 -0.2380 -0.0000
vn -0.9730 0.0046 0.2308
vn -0.9854 0.0041 0.1701
vn -0.9796 0.0043 0.2011
vn 0.0000 -1.0000 -0.0000
vn -0.0830 -0.9965 -0.0000
vn 0.0000 0.9806 0.1961
vn -0.8944 -0.0000 -0.4472
vn -0.8729 0.2182 -0.4364
vn 0.0000 0.9806 -0.1961
s 1
f 41/93/16 42/94/16 43/95/16
f 43/95/16 42/94/16 44/96/16
f 45/97/16 44/96/16 42/94/16
f 46/98/17 47/99/17 44/100/17
f 43/101/17 44/100/17 47/99/17
f 45/102/18 48/103/18 44/104/18
f 46/105/18 44/104/18 48/103/18
f 42/106/19 49/107/19 45/102/19
f 48/103/19 45/102/19 49/107/19
f 50/108/20 49/109/20 41/110/20
f 42/111/20 41/110/20 49/109/20
f 50/112/21 41/113/21 47/114/21
f 43/115/21 47/114/21 41/113/21
f 50/116/22 47/117/22 49/118/22
f 47/117/22 46/119/22 49/118/22
f 48/120/22 49/118/22 46/119/22
f 51/121/22 52/122/22 53/123/22
f 52/122/22 51/121/22 54/124/22
f 55/125/23 51/126/23 53/127/23
f 51/126/23 55/125/23 56/128/23
f 54/124/24 51/121/24 56/129/24
f 58/130/17 52/131/17 54/132/17
f 52/131/17 58/130/17 59/133/17
f 59/133/17 58/130/17 60/134/17
f 59/133/17 60/134/17 61/135/17
f 62/136/22 63/137/22 64/138/22
f 63/137/22 62/136/22 65/139/22
f 65/139/22 62/136/22 66/140/22
f 65/139/22 66/140/22 67/141/22
f 65/139/22 67/141/22 52/122/22
f 52/122/22 67/141/22 53/123/22
f 67/142/25 55/125/25 53/127/25
f 55/125/25 67/142/25 68/143/25
f 57/144/26 60/145/26 58/146/26
f 60/145/26 57/144/26 69/147/26
f 60/148/27 69/149/27 71/150/27
f 59/151/16 72/152/16 73/153/16
f 72/152/16 59/151/16 74/154/16
f 74/154/16 59/151/16 61/155/16
f 74/154/16 61/155/16 70/156/16
f 73/153/16 75/157/16 76/158/16
f 75/157/16 73/153/16 77/159/16
f 77/159/16 73/153/16 78/160/16
f 78/160/16 73/153/16 72/152/16
f 59/133/28 65/161/28 52/131/28
f 65/161/28 59/133/28 63/162/28
f 63/162/28 59/133/28 76/163/28
f 76/158/29 59/151/30 73/153/31
f 75/164/32 63/165/32 76/166/32
f 63/165/32 75/164/32 64/167/32
f 75/168/32 77/169/33 62/170/33
f 75/168/32 62/170/33 64/171/32
f 62/172/20 79/173/20 66/174/20
f 79/173/20 62/172/20 77/175/20
f 79/173/20 77/175/20 80/176/20
f 80/176/20 77/175/20 78/177/20
f 67/178/34 79/179/34 68/180/34
f 79/179/34 67/178/34 66/181/34
f 74/182/35 71/183/35 81/184/35
f 71/183/35 74/182/35 70/185/35
f 72/186/36 81/184/36 82/187/36
f 81/184/36 72/186/36 74/182/36
f 80/188/37 72/189/37 82/190/37
f 72/189/37 80/188/37 78/191/37
f 83/192/22 84/193/22 85/194/22
f 84/193/22 83/192/22 86/195/22
f 86/195/22 83/192/22 87/196/22
f 88/197/17 84/198/17 86/199/17
f 84/198/17 88/197/17 89/200/17
f 90/201/18 84/202/18 89/203/18
f 84/202/18 90/201/18 85/204/18
f 91/205/19 85/204/19 90/201/19
f 85/204/19 91/205/19 83/206/19
f 91/207/20 87/208/20 83/209/20
f 87/208/20 91/207/20 92/210/20
f 87/211/21 88/212/21 86/213/21
f 88/212/21 87/211/21 92/214/21
f 89/215/16 91/216/16 90/217/16
f 91/216/16 89/215/16 88/218/16
f 91/216/16 88/218/16 92/219/16
f 56/129/24 57/220/24 58/221/24
f 58/221/24 54/124/24 56/129/24
f 70/156/27 61/155/27 71/150/27
f 61/155/27 60/148/27 71/150/27
o SeatSecond_Back
v 0.116250 -0.132036 0.187500
v 0.228750 0.317964 -0.187500
v 0.116250 -0.132036 -0.187500
v 0.228750 0.317964 0.187500
v 0.228750 0.508348 -0.187500
v 0.228750 0.542964 -0.165000
v 0.228750 0.542964 0.165000
v 0.228750 0.508349 0.187500
v -0.303750 -0.132036 0.187500
v -0.303750 -0.132036 -0.187500
vt 0.500000 0.000000
vt 0.000000 0.610200
vt 0.000000 0.000000
vt 0.500000 0.610200
vt 0.000000 0.863200
vt 0.030000 0.909200
vt 0.470000 0.909200
vt 0.500000 0.863200
vt 0.500000 0.560000
vt 1.000000 0.000000
vt 1.000000 0.560000
vt 0.500000 0.000000
vn -0.9701 0.2425 0.0000
vn -1.0000 -0.0000 0.0000
vn 0.0000 1.0000 0.0000
s 1
f 93/222/38 94/223/38 95/224/38
f 94/223/38 93/222/38 96/225/38
f 96/225/39 97/226/39 94/223/39
f 97/226/39 96/225/39 98/227/39
f 98/227/39 96/225/39 99/228/39
f 99/228/39 96/225/39 100/229/39
f 95/230/40 101/231/40 93/232/40
f 101/231/40 95/230/40 102/233/40
o SeatSecond_Legs
v -0.258750 -0.213286 0.142500
v 0.116250 -0.544536 0.142500
v -0.258750 -0.544536 0.142500
v 0.116250 -0.244536 0.142500
v 0.116250 -0.244536 0.187500
v 0.116250 -0.544536 0.187500
v -0.258750 -0.544536 0.187500
v -0.258750 -0.213286 0.187500
v 0.116250 -0.244536 -0.142500
v 0.116250 -0.544536 -0.187500
v 0.116250 -0.244536 -0.187500
v 0.116250 -0.544536 -0.142500
v -0.258750 -0.213286 -0.187500
v -0.258750 -0.544536 -0.187500
v -0.258750 -0.544536 -0.142500
v -0.258750 -0.213286 -0.142500
vt 0.959200 0.175200
vt 0.761400 0.000500
vt 0.959200 0.000500
vt 0.761400 0.158700
vt 0.799900 0.583900
vt 0.823600 0.425600
vt 0.823600 0.583900
vt 0.799900 0.425600
vt 0.482600 0.928800
vt 0.284800 0.952600
vt 0.284800 0.928800
vt 0.482600 0.952600
vt 0.798900 0.425600
vt 0.775200 0.600300
vt 0.775200 0.425600
vt 0.798900 0.600300
vt 0.482600 0.516800
vt 0.308500 0.700800
vt 0.324900 0.503700
vt 0.482600 0.715300
vt 0.775200 0.759500
vt 0.798900 0.601300
vt 0.798900 0.759500
vt 0.775200 0.601300
vt 0.959200 0.350900
vt 0.761400 0.176200
vt 0.959200 0.176200
vt 0.761400 0.334400
vt 0.482600 0.729400
vt 0.308500 0.913400
vt 0.324900 0.716300
vt 0.482600 0.927900
vt 0.924100 0.891700
vt 0.726200 0.915500
vt 0.726200 0.891700
vt 0.924100 0.915500
vt 0.307500 0.503700
vt 0.283800 0.678400
vt 0.283800 0.503700
vt 0.307500 0.678400
vn -0.0000 0.0000 -1.0000
vn 1.0000 0.0000 0.0000
vn 0.0000 -1.0000 -0.0000
vn -1.0000 -0.0000 0.0000
vn 0.0000 -0.0000 1.0000
s 1
f 103/234/41 104/235/41 105/236/41
f 104/235/41 103/234/41 106/237/41
f 107/238/42 104/239/42 106/240/42
f 104/239/42 107/238/42 108/241/42
f 109/242/43 104/243/43 108/244/43
f 104/243/43 109/242/43 105/245/43
f 109/246/44 103/247/44 105/248/44
f 103/247/44 109/246/44 110/249/44
f 107/250/45 109/251/45 108/252/45
f 109/251/45 107/250/45 110/253/45
f 111/254/42 112/255/42 113/256/42
f 112/255/42 111/254/42 114/257/42
f 115/258/41 112/259/41 116/260/41
f 112/259/41 115/258/41 113/261/41
f 111/262/45 117/263/45 114/264/45
f 117/263/45 111/262/45 118/265/45
f 117/266/43 112/267/43 114/268/43
f 112/267/43 117/266/43 116/269/43
f 117/270/44 115/271/44 116/272/44
f 115/271/44 117/270/44 118/273/44
