{
 "BaseHref": "../../../../../../../",
 "Footer": {
  "Enabled": false,
  "Source": "",
  "InsertFacebook": true,
  "FacebookUrl": "https://www.facebook.com/OrthodoxChristianMissionCenter/",
  "InsertOwnerWebsite": true,
  "OwnerWebsiteUrl": "https://ocmc.org"
 },
 "ID": "bk.ty.m08.d29",
 "Language": "en",
 "Links": [
  {
   "Href": "css/jquery.dropdown.css"
  },
  {
   "Href": "css/bootstrap.min.css"
  },
  {
   "Href": "css/bootstrap-table.min.css"
  },
  {
   "Href": "css/app.css"
  },
  {
   "Href": "css/doxa.css"
  }
 ],
 "LmlTemplates": [
  "001: a-templates/Typikon/Hemerologion/m08/bk.ty.m08.d29",
  "002: a-templates/Typikon/Hemerologion/m08/bk.ty.m08.d29/bl.Instance01",
  "003: a-templates/Typikon/Hemerologion/m08/bk.ty.m08.d29/Instance01/bl.ve",
  "004: a-templates/Typikon/Hemerologion/m08/bk.ty.m08.d29/Instance01/bl.mo",
  "005: a-templates/Typikon/Hemerologion/m08/bk.ty.m08.d29/Instance01/bl.ma",
  "006: a-templates/Typikon/Hemerologion/m08/bk.ty.m08.d29/Instance01/bl.li"
 ],
 "Navbar": {
  "Simple": true,
  "NavbarSrc": "navbar",
  "NavbarHome": "/home.html",
  "NavbarTitle": "The Liturgy in My Language (Demo)",
  "NavbarLogoSrc": "favicon.ico",
  "NavbarLogoHeight": "30",
  "NavbarLogoWidth": "30",
  "ShowSecondIconColumn": true,
  "ShowTime": true
 },
 "PathOut": "/Users/mac002/doxa/projects/doxa-alwb/websites/test/dcs/h/b/ty/m08/d29/en/index.html",
 "Rows": null,
 "Scripts": [
  {
   "MediaType": "application/javascript",
   "Source": "js/jquery-2.0.3.min.js",
   "Defer": false
  },
  {
   "MediaType": "application/javascript",
   "Source": "js/jquery.dropdown.js",
   "Defer": false
  },
  {
   "MediaType": "application/javascript",
   "Source": "js/bootstrap.bundle.min.js",
   "Defer": false
  },
  {
   "MediaType": "application/javascript",
   "Source": "js/app.js",
   "Defer": false
  }
 ],
 "Templates": {
  "Tree": {
   "Name": "accordion.gohtml",
   "ParseName": "accordion.gohtml",
   "Root": {
    "NodeType": 11,
    "Pos": 0,
    "Nodes": null
   },
   "Mode": 0
  }
 },
 "Timestamp": "Wed, 26 Apr 2023 12:56:52 -0700",
 "Title": "29th",
 "Date": "",
 "Versions": null
}