{
 "BaseHref": "../../../../../../../",
 "Footer": {
  "Enabled": false,
  "Source": "",
  "InsertFacebook": true,
  "FacebookUrl": "https://www.facebook.com/OrthodoxChristianMissionCenter/",
  "InsertOwnerWebsite": true,
  "OwnerWebsiteUrl": "https://ocmc.org"
 },
 "ID": "se.m02.d21.h9",
 "Language": "en-gr",
 "Links": [
  {
   "Href": "css/jquery.dropdown.css"
  },
  {
   "Href": "css/bootstrap.min.css"
  },
  {
   "Href": "css/bootstrap-table.min.css"
  },
  {
   "Href": "css/app.css"
  },
  {
   "Href": "css/doxa.css"
  }
 ],
 "LmlTemplates": [
  "001: a-templates/Dated-Services/m02/d21/se.m02.d21.h9"
 ],
 "Navbar": {
  "Simple": true,
  "NavbarSrc": "navbar",
  "NavbarHome": "/home.html",
  "NavbarTitle": "The Liturgy in My Language (Demo)",
  "NavbarLogoSrc": "favicon.ico",
  "NavbarLogoHeight": "30",
  "NavbarLogoWidth": "30",
  "ShowSecondIconColumn": true,
  "ShowTime": true
 },
 "PathOut": "/Users/mac002/doxa/projects/doxa-alwb/websites/test/dcs/h/s/2023/m02/d21/h9/en-gr/index.html",
 "Rows": null,
 "Scripts": [
  {
   "MediaType": "application/javascript",
   "Source": "js/jquery-2.0.3.min.js",
   "Defer": false
  },
  {
   "MediaType": "application/javascript",
   "Source": "js/jquery.dropdown.js",
   "Defer": false
  },
  {
   "MediaType": "application/javascript",
   "Source": "js/bootstrap.bundle.min.js",
   "Defer": false
  },
  {
   "MediaType": "application/javascript",
   "Source": "js/app.js",
   "Defer": false
  }
 ],
 "Templates": {
  "Tree": {
   "Name": "accordion.gohtml",
   "ParseName": "accordion.gohtml",
   "Root": {
    "NodeType": 11,
    "Pos": 0,
    "Nodes": null
   },
   "Mode": 0
  }
 },
 "Timestamp": "Mon, 27 Mar 2023 10:02:23 -0700",
 "Title": "Ninth Hour Tuesday, February 21, 2023",
 "Date": "",
 "Versions": null
}