{
	"info": {
		"_postman_id": "04c036ca-f664-46bc-bf85-4145c1b61ba8",
		"name": "Capstone 2",
		"schema": "https://schema.getpostman.com/json/collection/v2.1.0/collection.json"
	},
	"item": [
		{
			"name": "Product",
			"item": [
				{
					"name": "Create a product",
					"protocolProfileBehavior": {
						"disableBodyPruning": true
					},
					"request": {
						"auth": {
							"type": "bearer",
							"bearer": [
								{
									"key": "token",
									"value": "eyJhbGciOiJIUzI1NiIsInR5cCI6IkpXVCJ9.eyJpZCI6IjYxNTJhNDQxNmJiYjE5Nzc2MmVjZTllZCIsImVtYWlsIjoiYWRtaW5AbWFpbC5jb20iLCJpc0FkbWluIjp0cnVlLCJpYXQiOjE2MzI4MTU4OTV9.etc7qdMQyJGVUIdKp-wCNOw32utEPpJn3H7ox7IBujU",
									"type": "string"
								}
							]
						},
						"method": "GET",
						"header": [],
						"body": {
							"mode": "raw",
							"raw": "{\r\n\r\n    \"productName\": \"Oversized ASSC hoodie\",\r\n    \"productPrice\": \"₱5499.00\",\r\n    \"productDescription\": \"S22 Winter collection hoodies\"\r\n\r\n\r\n\r\n\r\n}",
							"options": {
								"raw": {
									"language": "json"
								}
							}
						},
						"url": {
							"raw": "http://localhost:4000/product/create",
							"protocol": "http",
							"host": [
								"localhost"
							],
							"port": "4000",
							"path": [
								"product",
								"create"
							]
						}
					},
					"response": []
				},
				{
					"name": "get all active products",
					"request": {
						"method": "GET",
						"header": [],
						"url": {
							"raw": "http://localhost:4000/product/active",
							"protocol": "http",
							"host": [
								"localhost"
							],
							"port": "4000",
							"path": [
								"product",
								"active"
							]
						}
					},
					"response": []
				},
				{
					"name": "retrieve single product",
					"request": {
						"method": "GET",
						"header": [],
						"url": {
							"raw": "http://localhost:4000/product/6152d6afc6b43bb28a5ad5b1",
							"protocol": "http",
							"host": [
								"localhost"
							],
							"port": "4000",
							"path": [
								"product",
								"6152d6afc6b43bb28a5ad5b1"
							]
						}
					},
					"response": []
				},
				{
					"name": "update a product info",
					"request": {
						"auth": {
							"type": "bearer",
							"bearer": [
								{
									"key": "token",
									"value": "eyJhbGciOiJIUzI1NiIsInR5cCI6IkpXVCJ9.eyJpZCI6IjYxNTJhNDQxNmJiYjE5Nzc2MmVjZTllZCIsImVtYWlsIjoiYWRtaW5AbWFpbC5jb20iLCJpc0FkbWluIjp0cnVlLCJpYXQiOjE2MzI4MTU4OTV9.etc7qdMQyJGVUIdKp-wCNOw32utEPpJn3H7ox7IBujU",
									"type": "string"
								}
							]
						},
						"method": "PUT",
						"header": [],
						"body": {
							"mode": "raw",
							"raw": "{\r\n\r\n    \"productName\": \"vans sk8 hi\",\r\n    \"productPrice\": \"₱3455.00\",\r\n    \"productDescription\": \" Hi collections\"\r\n\r\n\r\n\r\n\r\n}",
							"options": {
								"raw": {
									"language": "json"
								}
							}
						},
						"url": {
							"raw": "http://localhost:4000/product/6152deba02ede0f6cc7e34a2/updateItem",
							"protocol": "http",
							"host": [
								"localhost"
							],
							"port": "4000",
							"path": [
								"product",
								"6152deba02ede0f6cc7e34a2",
								"updateItem"
							]
						}
					},
					"response": []
				},
				{
					"name": "archive a product",
					"request": {
						"auth": {
							"type": "bearer",
							"bearer": [
								{
									"key": "token",
									"value": "eyJhbGciOiJIUzI1NiIsInR5cCI6IkpXVCJ9.eyJpZCI6IjYxNTJhNDQxNmJiYjE5Nzc2MmVjZTllZCIsImVtYWlsIjoiYWRtaW5AbWFpbC5jb20iLCJpc0FkbWluIjp0cnVlLCJpYXQiOjE2MzI4MTU4OTV9.etc7qdMQyJGVUIdKp-wCNOw32utEPpJn3H7ox7IBujU",
									"type": "string"
								}
							]
						},
						"method": "PUT",
						"header": [],
						"url": {
							"raw": "http://localhost:4000/product/6152deba02ede0f6cc7e34a2/archive",
							"protocol": "http",
							"host": [
								"localhost"
							],
							"port": "4000",
							"path": [
								"product",
								"6152deba02ede0f6cc7e34a2",
								"archive"
							]
						}
					},
					"response": []
				}
			]
		},
		{
			"name": "Register a user",
			"request": {
				"method": "POST",
				"header": [],
				"body": {
					"mode": "raw",
					"raw": "{\r\n\r\n     \"firstName\": \"Cardo\",\r\n     \"lastName\": \"Dalisay\",\r\n     \"email\": \"promdi@mail.com\",\r\n     \"password\": \"123\",\r\n     \"address\": \"17 sampaloc manila\"\r\n\r\n\r\n}",
					"options": {
						"raw": {
							"language": "json"
						}
					}
				},
				"url": {
					"raw": "http://localhost:4000/user/register",
					"protocol": "http",
					"host": [
						"localhost"
					],
					"port": "4000",
					"path": [
						"user",
						"register"
					]
				}
			},
			"response": []
		},
		{
			"name": "User authentication",
			"request": {
				"method": "POST",
				"header": [],
				"body": {
					"mode": "raw",
					"raw": "{\r\n\r\n    \"email\": \"promdi@mail.com\",\r\n    \"password\": \"123\"\r\n\r\n}",
					"options": {
						"raw": {
							"language": "json"
						}
					}
				},
				"url": {
					"raw": "http://localhost:4000/user/check",
					"protocol": "http",
					"host": [
						"localhost"
					],
					"port": "4000",
					"path": [
						"user",
						"check"
					]
				}
			},
			"response": []
		},
		{
			"name": "set a user as admin",
			"request": {
				"auth": {
					"type": "bearer",
					"bearer": [
						{
							"key": "token",
							"value": "eyJhbGciOiJIUzI1NiIsInR5cCI6IkpXVCJ9.eyJpZCI6IjYxNTJhNDQxNmJiYjE5Nzc2MmVjZTllZCIsImVtYWlsIjoiYWRtaW5AbWFpbC5jb20iLCJpc0FkbWluIjp0cnVlLCJpYXQiOjE2MzI4MTEwMDV9.yQlSG6TSMMaavwRhQyagpGHVW4PElmXZ_4PqT5jhtbI",
							"type": "string"
						}
					]
				},
				"method": "PUT",
				"header": [],
				"body": {
					"mode": "raw",
					"raw": "",
					"options": {
						"raw": {
							"language": "json"
						}
					}
				},
				"url": {
					"raw": "http://localhost:4000/user/615298dadc9286c36e9db72a/setAsAdmin",
					"protocol": "http",
					"host": [
						"localhost"
					],
					"port": "4000",
					"path": [
						"user",
						"615298dadc9286c36e9db72a",
						"setAsAdmin"
					]
				}
			},
			"response": []
		}
	]
}