{
    "name": "Portal",
    "alias": "portal",
    "description": "Módulo principal del Portal",
    "keywords": [],
    "version": "1.0.0",
    "active": 1,
    "order": 1,
    "providers": [
        "Modules\\Portal\\Providers\\PortalServiceProvider",
        "Modules\\Portal\\Providers\\RouteServiceProvider"
    ],
    "aliases": {},
    "files": [
        
    ],
    "requires": []
}
