{
  "name": "SST Simulation Designer",
  "type": "editor",
  "architecture": "javascript",
  "environment": "html",
  "license": "BSD",
  "summary": "An interactive tool to design SST simulations using a graph-based editor.",
  "inputs": [
    {
      "name": "SST Simulation JSON",
      "type": "application",
      "subtype": "application/json",
      "views": [
        {
          "type": "simulation",
          "subtype": "SST"
        }
      ],
      "edits": [
        {
          "type": "simulation",
          "subtype": "SST"
        }
      ]
    }
  ],
  "install": [
    {
      "type": "resource",
      "subtype": "git",
      "to": "widget",
      "name": "workflow-widget",
      "source": "https://gitlab.com/wilkie/workflow-widget",
      "id": "QmUZ9yuSHSV971FoMyHNYAusvMVt9ymxonWd77Lxqwtg1L",
      "uid": "Qmav51jw7mTpe1kHqVhLPVXoBkrtJ6gtMFDAdJksMM3RD7",
      "revision": "5dtzXjcJJ13WeYa5Bbo8J2TjDaoHZw"
    }
  ],
  "file": "index.html"
}