<?xml version="1.0" encoding="UTF-8" standalone="no"?>
<svg
   xmlns:dc="http://purl.org/dc/elements/1.1/"
   xmlns:cc="http://creativecommons.org/ns#"
   xmlns:rdf="http://www.w3.org/1999/02/22-rdf-syntax-ns#"
   xmlns:svg="http://www.w3.org/2000/svg"
   xmlns="http://www.w3.org/2000/svg"
   xmlns:sodipodi="http://sodipodi.sourceforge.net/DTD/sodipodi-0.dtd"
   xmlns:inkscape="http://www.inkscape.org/namespaces/inkscape"
   width="22"
   height="22"
   viewBox="0 0 22 22"
   version="1.1"
   id="svg2"
   inkscape:version="0.91 r13725"
   sodipodi:docname="floppy.small.svg"
   inkscape:export-filename="C:\Users\wilkie\images\icons\floppy.small.png"
   inkscape:export-xdpi="81.818184"
   inkscape:export-ydpi="81.818184">
  <metadata
     id="metadata14">
    <rdf:RDF>
      <cc:Work
         rdf:about="">
        <dc:format>image/svg+xml</dc:format>
        <dc:type
           rdf:resource="http://purl.org/dc/dcmitype/StillImage" />
        <dc:title>album_collection</dc:title>
      </cc:Work>
    </rdf:RDF>
  </metadata>
  <sodipodi:namedview
     pagecolor="#ffffff"
     bordercolor="#666666"
     borderopacity="1"
     objecttolerance="10"
     gridtolerance="10"
     guidetolerance="10"
     inkscape:pageopacity="0"
     inkscape:pageshadow="2"
     inkscape:window-width="1920"
     inkscape:window-height="1057"
     id="namedview12"
     showgrid="false"
     inkscape:zoom="14.302842"
     inkscape:cx="-11.226255"
     inkscape:cy="4.9923955"
     inkscape:window-x="-8"
     inkscape:window-y="1072"
     inkscape:window-maximized="1"
     inkscape:current-layer="g6299" />
  <title
     id="title4">album_collection</title>
  <description
     id="description6">Created with Sketch (http://www.bohemiancoding.com/sketch)</description>
  <defs
     id="defs8" />
  <g
     id="g6299"
     transform="translate(179.67237,-70.223625)">
    <path
       style="opacity:1;fill:#2da0b7;fill-opacity:1;stroke:none;stroke-width:0.5;stroke-miterlimit:4;stroke-dasharray:none;stroke-opacity:1"
       d="m 0.24901718,19.201058 c -0.0459047,0.372933 0.31911405,0.707145 0.70801405,0.707145 l 2.89843757,0 0.90625,-6.707031 c 0.0435,-0.321614 0.2829831,-0.626953 0.6269531,-0.626953 l 9.6621091,0 c 0.3437,0 0.580111,0.307717 0.619141,0.630859 l 0.466797,6.703125 1.923096,0 1.026123,0 1.949218,0 c 0.3889,0 0.755781,-0.333383 0.707032,-0.738281 l -0.02148,-0.179688 -0.01367,-0.207031 -1.9336,-15.9570311 c -0.0488,-0.404894 -0.308366,-0.734375 -0.697266,-0.734375 l -1.226563,0 0.947266,7.8828125 c 0.0258,0.2145086 -0.0608,0.4109526 -0.193359,0.5429686 -0.13251,0.132018 -0.310654,0.210938 -0.501954,0.210938 l -14.2089839,0 c -0.19143,0 -0.3701931,-0.07817 -0.5019531,-0.210938 C 3.258865,10.384814 3.1721419,10.185035 3.2011719,9.9707031 l 1.0664062,-7.8789062 -1.0917969,0 c -0.38889,0 -0.6523612,0.330315 -0.7070312,0.734375 M 5.3671306,2.0917969 4.362828,9.3980984 c -0.01,0.07162 0.014413,0.135 0.070313,0.191406 0.056,0.05642 0.1427625,0.09375 0.2265625,0.09375 l 12.5659535,0 c 0.0839,0 0.173209,-0.03675 0.230469,-0.09375 0.0573,-0.057 0.08312,-0.121329 0.07422,-0.193359 L 16.75201,2.0917969 Z m 0.685745,11.2499721 c -0.12869,0 -0.211395,0.09811 -0.234375,0.267578 l -0.8984375,6.298856 10.1171029,0 -0.458984,-6.302763 c -0.0204,-0.168965 -0.0976,-0.263671 -0.226563,-0.263671 z m 1.5018961,1.229647 2.3904839,0 c 0.2056204,0 0.3433904,0.176558 0.3691404,0.390625 l -0.222656,3.58929 c -0.008,0.223202 -0.2395363,0.296875 -0.3164063,0.296875 l -2.9881401,0 c 0,0 -0.2969425,0.05723 -0.2578125,-0.296875 l 0.6523438,-3.587337 c 0.0289,-0.213629 0.1674468,-0.392578 0.3730468,-0.392578 z"
       transform="translate(-179.67237,70.223625)"
       id="rect6737"
       inkscape:connector-curvature="0"
       sodipodi:nodetypes="csccssccccsccccscccsscccsccccssccccsccccssssccscccs" />
  </g>
</svg>
