[
  {
    "designation": "un article",
    "quantity": 1,
    "unitPrice": 29.90,
    "vat": 0.1
  },
  {
    "designation": "un deuxième article",
    "quantity": 1,
    "unitPrice": 29.90,
    "vat": 0.1
  },
  {
    "designation": "un troisième article",
    "quantity": 1,
    "unitPrice": 29.90,
    "vat": 0.1
  },
  {
    "designation": "un quatrième article",
    "quantity": 1,
    "unitPrice": 29.90,
    "vat": 0.1
  },
  {
    "designation": "un cinquième article",
    "quantity": 1,
    "unitPrice": 29.90,
    "vat": 0.1
  },
  {
    "designation": "un sixième article",
    "quantity": 1,
    "unitPrice": 29.90,
    "vat": 0.1
  },
  {
    "designation": "un septième article",
    "quantity": 1,
    "unitPrice": 29.90,
    "vat": 0.1
  },
  {
    "designation": "un huitième article",
    "quantity": 1,
    "unitPrice": 29.90,
    "vat": 0.1
  },
  {
    "designation": "un neuvième article",
    "quantity": 1,
    "unitPrice": 29.90,
    "vat": 0.1
  },
  {
    "designation": "un dixième article",
    "quantity": 1,
    "unitPrice": 29.90,
    "vat": 0.1
  },
  {
    "designation": "un onzième article",
    "quantity": 1,
    "unitPrice": 29.90,
    "vat": 0.1
  },
  {
    "designation": "un douzième article",
    "quantity": 1,
    "unitPrice": 29.90,
    "vat": 0.1
  },
  {
    "designation": "un treizième article",
    "quantity": 1,
    "unitPrice": 29.90,
    "vat": 0.1
  },
  {
    "designation": "un quatorzième article",
    "quantity": 1,
    "unitPrice": 29.90,
    "vat": 0.1
  },
  {
    "designation": "un quinzième article",
    "quantity": 1,
    "unitPrice": 29.90,
    "vat": 0.1
  },
  {
    "designation": "un seizième article",
    "quantity": 1,
    "unitPrice": 29.90,
    "vat": 0.1
  },
  {
    "designation": "un dix-septième article",
    "quantity": 1,
    "unitPrice": 29.90,
    "vat": 0.1
  },
  {
    "designation": "un dix-huitième article",
    "quantity": 1,
    "unitPrice": 29.90,
    "vat": 0.1
  },
  {
    "designation": "un dix-neuvième article",
    "quantity": 1,
    "unitPrice": 29.90,
    "vat": 0.1
  },
  {
    "designation": "un vingtième article",
    "quantity": 1,
    "unitPrice": 29.90,
    "vat": 0.1
  },
  {
    "designation": "un vingt-et-unième article",
    "quantity": 1,
    "unitPrice": 29.90,
    "vat": 0.1
  },
  {
    "designation": "un vingt-deuxième article",
    "quantity": 1,
    "unitPrice": 29.90,
    "vat": 0.1
  },
  {
    "designation": "un nième article",
    "quantity": 1,
    "unitPrice": 29.90,
    "vat": 0.1
  },
  {
    "designation": "un nième+1 article",
    "quantity": 1,
    "unitPrice": 39.90,
    "vat": 0.1
  }
]
  