[
  {
    "companyId": "a2a5bbc1-bc8c-4375-b7be-7b839daefdd8",
    "validityMessage": "1 mois a compter de la date du devis",
    "paymentMethod": "40% avant le debut des travaux, situations intermediaires suivant avancement. Le solde a reception finale. Pour acceptation, nous retourner un exemplaire date et signe.",
    "conditions": "De convention exepresse les marchandises fournies resteront mon entiere propriete jusqu au dernier jour de leur parfait paiement, ceci conformement aux termes de la loi 80.335 du 12.05.80"
  }
]
  