{
  "owner": "obsidiansystems",
  "repo": "opam2nix",
  "branch": "ae-thunkify-tezos-platform",
  "rev": "42a42bb7a90105c394e72f34ff721a7b73908dc6",
  "sha256": "05j6nbs8vf0m4mpinp79yryyzdlkhf16jdbr8kkhl62m9jc1nwl3"
}
