-----BEGIN PGP SIGNATURE-----

iQEzBAABCAAdFiEEtUHVUwEnDgvPFcpdgXC0cm1xmN4FAly0uYEACgkQgXC0cm1x
mN4jmAf9G+5t4cYPh44fGZUj/qAZYR0noRNS4YFZq9/LhLRoxiajCQt6xzTUeo7E
xQiIriS/3f148cH5Md9615aGDfXvZZv9GsVOdDQm800G6ufQ6K9li+93ZMZcvhGe
nUIbkVN+M/FN3DIELtcYqbpMZYAth5pbrFJnq8sjakAUZ27RducFiV27z6yEGLhc
pJN9QEtrrC8WXny3R0uhWzq5dF8bl1PtwId0a2CEK+DAUi0rfAKCWawamyLyhMqL
bH/wjzWamPE0PtKyiOpukMOewuWdLotDan4YJpqZFgt0UFWZYQ4KIDSf9NKbiWSq
GjYuOHPz8XHUg27Y8nCqGz94DDLerw==
=eA19
-----END PGP SIGNATURE-----
