{
    "id": 19,
    "created_at": "2020-08-31T15:53:00.073Z",
    "commit_message_regex": "[a-zA-Z]",
    "commit_message_negative_regex": "[x+]",
    "branch_name_regex": null,
    "deny_delete_tag": false,
    "member_check": false,
    "prevent_secrets": false,
    "author_email_regex": "^[A-Za-z0-9.]+@gitlab.com$",
    "file_name_regex": null,
    "max_file_size": 100
}
