[
  {
    "id": 1,
    "title": "Public key",
    "key": "ssh-rsa AAAAB3NzaC1yc2EAAAABJQAAAIEAiPWx6WM4lhHNedGfBpPJNPpZ7yKu+dnn1SJejgt4596k6YjzGGphH2TUxwKzxcKDKKezwkpfnxPkSMkuEspGRt/aZZ9wa++Oi7Qkr8prgHc4soW6NUlfDzpvZK2H5E7eQaSeP3SAwGmQKUFHCddNaP0L+hM7zhFNzjFvpaMgJw0=",
    "created_at": "2014-08-01T14:47:39.08Z"
  },
  {
    "id": 3,
    "title": "Another Public key",
    "key": "ssh-rsa AAAAB3NzaC1yc2EAAAABJQAAAIEAiPWx6WM4lhHNedGfBpPJNPpZ7yKu+dnn1SJejgt4596k6YjzGGphH2TUxwKzxcKDKKezwkpfnxPkSMkuEspGRt/aZZ9wa++Oi7Qkr8prgHc4soW6NUlfDzpvZK2H5E7eQaSeP3SAwGmQKUFHCddNaP0L+hM7zhFNzjFvpaMgJw0=",
    "created_at": "2014-08-01T14:47:39.08Z"
  }
]
