[
    {   "name":"Institut za javno zdravlje Beograd",
        "id":"IPH",
        "location": [44.816770, 20.470141],
        "description":"Centar Beograda, ulica Despota Stefana",
        "start":2017,
        "end":2019
    },
    {   "name":"Novi Beograd",
        "id":"NBG",
        "location": [44.805827, 20.398789],
        "description":"Dom zdravlja Novi Beograd, ulica Jurija Gagarina",
        "start":2017,
        "end":2019
    },
    {   "name":"Obrenovac",
        "id":"OBR",
        "location": [44.669253, 20.196301],
        "description":"Osnovna škola Jefimija",
        "start":2017,
        "end":2019
    },
    {   "name":"Lazaravac",
        "id":"LAZ",
        "location": [44.383270, 20.262527],
        "description":"Centar grada, sportski centar",
        "start":2018,
        "end":2019
    },
    {   "name":"Ovča",
        "id":"OVC",
        "location": [44.884440, 20.526433],
        "description":"Ulica 1. maja",
        "start":2018,
        "end":2019
    },
    {   "name":"Mesna zajednica Ušće",
        "id":"USC",
        "location": [44.628284, 20.003445],
        "description":"Mesna zajednica u Ušću, selo pored Obrenovca",
        "start":2018,
        "end":2019
    },
    {   "name":"Zemun – Tošin bunar",
        "id":"ZEM",
        "location": [44.835203, 20.403291],
        "description":"Ugao ulica Tošin bunar i Jerneja Kopitara",
        "start":2018,
        "end":2019
    },
    {   "name":"Veliki Crljeni",
        "id":"VEL",
        "location": [44.473793, 20.291123],
        "description":"Naselje u blizini rudnika uglja",
        "start":2018,
        "end":2019
    }
]