frameID,speed,steering,yaw
155909,8.423986,-2.3125,0.0
155910,8.351972,-2.3125,0.0
155911,8.351972,-2.3125,0.0
155912,8.315991,-2.3125,0.0
155913,8.315991,-2.3125,0.0
155914,8.315991,-2.3125,0.0
155915,8.243976,-2.3125,0.0
155916,8.243976,-2.3125,0.0
155917,8.243976,-2.3125,0.0
155918,8.207995,-2.3125,0.0
155919,8.207995,-2.3125,0.25
155920,8.207995,-2.3125,0.0
155921,8.207995,-2.3125,0.0
155922,8.207995,-2.3125,0.0
155923,8.135981,-2.3125,0.0
155924,8.063965,-2.3125,0.0
155925,8.063965,-2.3125,-0.1875
155926,8.063965,-2.3125,0.0
155927,8.027985,-2.3125,0.0
155928,8.027985,-2.3125,0.25
155929,7.99195,-2.3125,0.25
155930,7.955969,-2.3125,0.25
155931,7.955969,-2.3125,0.25
155932,7.955969,-2.3125,0.0
155933,7.955969,-2.25,0.25
155934,7.919989,-2.25,0.0
155935,7.919989,-2.25,0.0
155936,7.883954,-2.25,0.0
155937,7.883954,-2.25,0.0
155938,7.811994,-2.25,0.0
155939,7.847974,-2.25,0.0
155940,7.811994,-2.25,0.0
155941,7.775958,-2.25,0.0
155942,7.775958,-2.25,0.0
155943,7.775958,-2.25,0.25
155944,7.775958,-2.25,0.25
155945,7.739978,-2.125,0.25
155946,7.703998,-2.125,0.25
155947,7.667963,-1.9375,0.0
155948,7.667963,-1.8125,0.25
155949,7.667963,-1.75,0.0
155950,7.667963,-1.625,-0.1875
155951,7.667963,-1.5,0.0
155952,7.667963,-1.5,0.0
155953,7.631982,-1.5,0.0
155954,7.595947,-1.5,0.0
155955,7.595947,-1.5,0.0
155956,7.559967,-1.5,0.0
155957,7.559967,-1.5,0.0
155958,7.559967,-1.5,0.0
155959,7.559967,-1.5,0.0
155960,7.559967,-1.5,0.0
155961,7.559967,-1.5,0.0
155962,7.631982,-1.5,0.0
155963,7.631982,-1.5,0.0
155964,7.631982,-1.5,0.0
155965,7.667963,-1.5,0.0
155966,7.667963,-1.5,0.0
155967,7.667963,-1.5,0.25
155968,7.667963,-1.5,0.0
155969,7.667963,-1.5,0.25
155970,7.703998,-1.4375,0.25
155971,7.703998,-1.4375,0.25
155972,7.703998,-1.3125,0.25
155973,7.775958,-1.25,0.0
155974,7.775958,-1.125,0.25
155975,7.847974,-0.8125,0.0
155976,7.883954,-0.75,0.0
155977,7.883954,-0.625,0.25
155978,7.955969,-0.4375,0.25
155979,7.955969,-0.4375,0.0
155980,8.027985,-0.25,0.25
155981,8.063965,-0.125,0.25
155982,8.063965,0.0,0.25
155983,8.171961,0.5,0.0
155984,8.171961,1.0,0.0
155985,8.243976,2.1875,0.0
155986,8.315991,2.75,0.25
155987,8.351972,3.375,0.25
155988,8.459967,4.75,0.25
155989,8.459967,5.5,0.25
155990,8.531982,6.1875,0.25
155991,8.531982,7.75,0.25
155992,8.567963,8.5,0.5
155993,8.675959,10.25,0.25
155994,8.675959,11.375,0.25
155995,8.747973,12.5,0.5
155996,8.819989,15.0,0.5
155997,8.89195,16.25,0.5
155998,9.0,19.375,0.75
155999,9.03598,21.0625,0.75
156000,9.107996,24.875,1.0
156001,9.215991,26.875,1.25
156002,9.215991,29.0625,1.25
156003,9.287951,31.375,1.5
156004,9.359967,36.25,1.75
156005,9.431982,39.0,2.0
156006,9.575958,44.5,2.25
156007,9.611994,47.375,2.5
156008,9.683954,53.5625,2.9375
156009,9.755969,56.75,3.1875
156010,9.791949,60.0,3.6875
156011,9.9,66.6875,3.9375
156012,10.007996,70.25,3.9375
156013,10.079956,77.5625,4.6875
156014,10.115992,81.25,4.6875
156015,10.187952,84.875,5.1875
156016,10.259967,88.5625,5.375
156017,10.331983,95.875,6.125
156018,10.367963,99.5,6.375
156019,10.511993,106.1875,7.375
156020,10.547974,109.0625,7.8125
156021,10.619989,114.0,8.3125
156022,10.727984,116.0625,8.8125
156023,10.763965,118.0625,8.8125
156024,10.907995,121.875,9.3125
156025,10.943975,123.5,9.5625
156026,11.015991,124.875,9.5625
156027,11.159967,127.25,10.0625
156028,11.195948,128.375,10.0625
156029,11.303998,130.5,10.3125
156030,11.375958,131.5625,10.5
156031,11.519989,134.0,10.75
156032,11.555969,135.1875,11.0
156033,11.627985,136.375,11.25
156034,11.7,137.5625,11.5
156035,11.807996,140.0,12.0
156036,11.915991,141.25,12.0
156037,12.095947,143.75,12.5
156038,12.059967,145.0,12.75
156039,12.131983,146.0,12.75
156040,12.311994,148.25,13.1875
156041,12.311994,149.25,13.1875
156042,12.563965,151.0625,13.4375
156043,12.563965,152.0,13.6875
156044,12.815991,153.5625,14.1875
156045,12.923986,154.375,14.4375
156046,12.923986,155.25,14.6875
156047,13.031982,156.0625,14.9375
156048,13.175959,158.0,15.1875
156049,13.211993,158.75,15.1875
156050,13.283954,159.5625,15.1875
156051,13.319989,161.1875,15.625
156052,13.53598,162.6875,15.875
156053,13.57196,163.375,16.125
156054,13.643976,164.0625,16.375
156055,13.787951,165.1875,16.875
156056,13.859967,165.5625,17.125
156057,14.003998,166.5,17.375
156058,14.075958,167.0,17.625
156059,14.147974,167.375,17.625
156060,14.363965,168.25,17.875
156061,14.363965,168.6875,17.875
156062,14.47196,169.0,17.875
156063,14.615992,169.5,18.125
156064,14.651972,169.5625,18.125
156065,14.795947,169.6875,18.5625
156066,14.867963,169.6875,18.5625
156067,14.867963,169.5,18.5625
156068,15.083954,169.1875,18.8125
156069,15.119989,169.0,18.8125
156070,15.19195,168.6875,18.8125
156071,15.371961,168.1875,19.0625
156072,15.443975,167.875,19.0625
156073,15.587952,167.25,19.0625
156074,15.623987,167.0,19.0625
156075,15.731982,166.6875,19.0625
156076,15.875958,166.0,19.3125
156077,15.911993,165.5,19.3125
156078,16.091949,164.5,19.3125
156079,16.163965,163.875,19.5625
156080,16.163965,163.375,19.5625
156081,16.307995,161.875,19.5625
156082,16.379955,161.0625,19.5625
156083,16.559967,159.25,19.8125
156084,16.667963,158.375,19.5625
156085,16.739979,156.375,19.5625
156086,16.847973,155.25,19.5625
156087,16.919989,154.25,19.3125
156088,16.919989,153.25,19.0625
156089,17.063965,151.25,19.0625
156090,17.063965,150.375,18.8125
156091,17.207996,148.375,18.8125
156092,17.31599,147.375,18.5625
156093,17.387951,146.5,18.3125
156094,17.531982,144.75,18.3125
156095,17.603998,144.0,18.3125
156096,17.783955,142.6875,18.125
156097,17.819988,142.1875,17.875
156098,17.855968,141.6875,18.125
156099,18.0,140.75,18.125
156100,18.07196,140.375,18.125
156101,18.215992,139.875,18.3125
156102,18.251972,138.875,18.3125
156103,18.359966,138.375,18.3125
156104,18.467962,137.375,18.125
156105,18.539978,136.75,18.3125
156106,18.611994,136.1875,18.3125
156107,18.71999,135.1875,18.125
156108,18.79195,134.5625,17.875
156109,19.007996,133.375,17.875
156110,19.043976,132.75,17.875
156111,19.115992,132.1875,17.875
156112,19.259968,130.875,17.625
156113,19.367962,130.1875,17.875
156114,19.511993,128.75,17.625
156115,19.583954,128.0,17.625
156116,19.65597,127.25,17.375
156117,19.763966,126.0625,17.625
156118,19.835979,125.6875,17.375
156119,19.943975,125.25,17.625
156120,20.123987,124.6875,17.625
156121,20.303997,124.5,17.625
156122,20.303997,124.1875,17.625
156123,20.375957,124.0,17.625
156124,20.483953,123.5,17.875
156125,20.555969,123.0625,17.625
156126,20.700001,122.75,17.875
156127,20.771961,121.875,17.875
156128,20.879955,121.375,17.625
156129,21.059967,120.25,17.875
156130,21.167963,119.5625,17.875
156131,21.203999,119.0,17.625
156132,21.419989,117.5625,17.375
156133,21.455969,117.0,17.375
156134,21.563965,116.375,17.375
156135,21.743977,115.0625,17.125
156136,21.81599,114.375,17.125
156137,21.887951,113.1875,16.875
156138,21.959967,112.5,16.875
156139,22.067963,112.0,16.875
156140,22.211994,110.75,16.875
156141,22.319988,110.25,16.875
156142,22.391949,109.25,16.625
156143,22.5,108.875,16.625
156144,22.643976,108.5,16.625
156145,22.715992,107.875,16.625
156146,22.823986,107.5625,16.375
156147,22.895947,107.5,16.375
156148,23.075958,107.0625,16.375
156149,23.147974,107.0625,16.375
156150,23.29195,107.0,16.375
156151,23.47196,106.875,16.375
156152,23.47196,106.875,16.375
156153,23.615992,106.75,16.625
156154,23.723988,106.6875,16.625
156155,23.831982,106.5,16.875
156156,23.939978,106.1875,16.875
156157,23.975958,106.0,16.875
156158,24.119989,105.375,17.125
156159,24.227985,105.1875,17.125
156160,24.263966,104.875,16.875
156161,24.443975,104.1875,17.125
156162,24.515991,103.75,17.125
156163,24.623987,102.6875,16.875
156164,24.659967,102.0625,16.875
156165,24.803997,101.375,16.875
156166,24.875957,99.75,16.625
156167,25.019989,99.0,16.625
156168,24.947973,97.0625,16.625
156169,25.200001,96.0625,16.375
156170,25.271961,95.0,16.125
156171,25.343975,93.875,15.875
156172,25.559967,91.375,15.4375
156173,25.559967,90.1875,15.1875
156174,25.703999,87.75,14.9375
156175,25.739979,86.5625,14.9375
156176,25.847973,84.1875,14.6875
156177,25.883953,83.0,14.1875
156178,25.991949,81.875,14.1875
156179,26.1,80.0,13.9375
156180,26.171961,79.0,13.9375
156181,26.31599,78.0,13.6875
156182,26.459967,75.75,13.1875
156183,26.531982,75.0,13.0
156184,26.711994,73.375,12.75
156185,26.747974,72.5625,12.75
156186,26.855968,71.6875,12.5
156187,27.0,69.5625,12.0
156188,27.107996,68.75,12.0
156189,27.251972,68.375,11.5
156190,27.251972,68.5,11.5
156191,27.323986,68.375,11.5
156192,27.503998,68.25,11.5
156193,27.611994,67.6875,11.5
156194,27.71999,66.1875,11.75
156195,27.79195,65.0,11.5
156196,27.863964,62.0,11.5
156197,27.93598,60.25,11.25
156198,28.043976,58.25,11.25
156199,28.151972,56.25,10.75
156200,28.295948,52.25,10.3125
156201,28.367962,50.375,10.0625
156202,28.583954,46.75,9.0625
156203,28.619989,45.1875,8.8125
156204,28.763966,42.5625,8.0625
156205,28.87196,41.5,7.625
156206,28.87196,40.375,7.375
156207,29.015991,38.375,7.125
156208,29.159967,37.1875,6.875
156209,29.231983,35.1875,6.625
156210,29.303997,34.1875,6.625
156211,29.375957,33.1875,6.375
156212,29.555969,31.5,6.125
156213,29.663965,30.6875,5.875
156214,29.735981,29.6875,5.375
156215,29.771961,29.1875,5.375
156216,29.807995,28.75,5.1875
156217,29.879955,27.5625,4.9375
156218,29.987951,26.6875,4.9375
156219,30.131983,25.5625,4.9375
156220,30.167963,23.375,4.4375
156221,30.311993,22.1875,4.4375
156222,30.563965,20.0625,4.1875
156223,30.671961,19.1875,3.9375
156224,30.743977,18.25,3.9375
156225,30.707996,16.875,3.4375
156226,30.81599,16.5,3.1875
156227,30.923986,16.0625,3.1875
156228,31.103998,15.6875,2.9375
156229,31.103998,15.6875,2.6875
156230,31.319988,15.6875,2.6875
156231,31.463964,15.6875,2.6875
156232,31.53598,15.6875,2.5
156233,31.607996,15.6875,2.5
156234,31.715992,15.6875,2.6875
156235,31.823986,15.6875,2.5
156236,31.895947,15.6875,2.6875
156237,31.967962,15.6875,2.6875
156238,32.075958,15.6875,2.6875
156239,32.21999,15.6875,2.6875
156240,32.400002,15.6875,2.6875
156241,32.507996,15.6875,2.6875
156242,32.65197,15.6875,2.6875
156243,32.68795,15.6875,2.9375
156244,32.723988,15.6875,2.6875
156245,32.795948,15.6875,2.6875
156246,32.97596,15.5625,2.9375
156247,33.047974,15.5,2.9375
156248,33.191948,15.1875,2.9375
156249,33.335979,15.0625,2.9375
156250,33.407997,15.0,2.6875
156251,33.515991,14.6875,2.6875
156252,33.587952,14.5625,2.6875
156253,33.731983,14.5,2.6875
156254,33.839977,14.375,2.6875
156255,33.911995,14.25,2.6875
156256,34.091949,14.0,2.6875
156257,34.163963,13.75,2.6875
156258,34.271961,13.5625,2.5
156259,34.415993,13.0625,2.5
156260,34.451973,12.75,2.25
156261,34.559967,12.25,2.5
156262,34.667961,12.0,2.25
156263,34.739979,11.75,2.25
156264,34.919991,11.1875,2.25
156265,35.027985,10.875,2.25
156266,35.207996,10.1875,2.0
156267,35.31599,9.75,2.0
156268,35.423988,9.0625,2.0
156269,35.459969,8.6875,1.75
156270,35.531982,8.375,1.75
156271,35.603996,8.0,1.5
156272,35.783955,7.375,1.5
156273,35.891949,7.0625,1.5
156274,36.107994,6.5,1.25
156275,36.179955,6.1875,1.0
156276,36.251972,5.6875,1.0
156277,36.287952,5.5,1.0
156278,36.359966,5.25,1.0
156279,36.503998,4.875,0.75
156280,36.575958,4.6875,0.75
156281,36.79195,4.375,0.75
156282,36.863964,4.25,0.5
156283,37.007996,4.0625,0.75
156284,37.11599,3.75,0.75
156285,37.15197,3.375,0.5
156286,37.223988,2.75,0.75
156287,37.403999,1.1875,0.5
156288,37.47596,0.375,0.5
156289,37.655968,-1.0,0.25
156290,37.727985,-1.625,0.25
156291,37.763966,-2.125,0.0
156292,37.907997,-2.75,-0.1875
156293,37.979958,-2.9375,-0.4375
156294,38.087952,-3.0,-0.4375
156295,38.123985,-3.125,-0.6875
156296,38.303997,-3.25,-0.6875
156297,38.447975,-3.25,-0.6875
156298,38.555969,-3.3125,-0.6875
156299,38.627983,-3.3125,-0.6875
156300,38.700001,-3.3125,-0.4375
156301,38.807995,-3.3125,-0.6875
156302,38.915993,-3.3125,-0.4375
156303,38.951973,-3.3125,-0.4375
156304,39.131981,-3.3125,-0.4375
156305,39.275959,-3.25,-0.4375
156306,39.347973,-3.25,-0.4375
156307,39.419991,-3.125,-0.6875
156308,39.527985,-2.9375,-0.6875
156309,39.635979,-2.5,-0.4375
156310,39.707996,-2.3125,-0.4375
156311,39.851971,-2.125,-0.1875
156312,39.959969,-2.0,-0.4375
156313,40.067963,-2.0,-0.1875
156314,40.103996,-2.0,-0.4375
156315,40.211994,-1.9375,-0.4375
156316,40.319988,-1.9375,-0.1875
156317,40.463966,-1.9375,-0.1875
156318,40.57196,-1.9375,0.0
156319,40.643974,-1.9375,-0.1875
156320,40.751972,-1.9375,-0.1875
156321,40.823986,-1.9375,-0.1875
156322,40.859966,-1.9375,-0.1875
156323,41.003998,-1.9375,-0.1875
156324,41.075958,-1.9375,-0.1875
156325,41.21999,-1.9375,-0.1875
156326,41.29195,-1.9375,-0.1875
156327,41.327984,-1.9375,-0.1875
156328,41.507996,-1.9375,-0.1875
156329,41.507996,-1.9375,-0.1875
156330,41.61599,-1.9375,-0.4375
156331,41.68795,-1.9375,-0.1875
156332,41.759968,-1.9375,-0.1875
156333,41.903999,-1.8125,-0.1875
156334,42.011993,-1.8125,-0.1875
156335,42.011993,-1.8125,-0.1875
156336,42.083954,-1.8125,-0.1875
156337,42.119987,-1.8125,-0.1875
156338,42.299999,-1.75,-0.1875
156339,42.407997,-1.75,-0.1875
156340,42.515991,-1.75,-0.1875
156341,42.515991,-1.75,-0.1875
156342,42.623985,-1.75,-0.1875
156343,42.623985,-1.75,-0.1875
156344,42.695946,-1.75,-0.1875
156345,42.731983,-1.75,-0.1875
156346,42.911995,-1.75,-0.1875
156347,42.983955,-1.75,-0.1875
156348,43.019989,-1.75,-0.1875
156349,43.091949,-1.75,-0.1875
156350,43.127983,-1.75,-0.1875
156351,43.200001,-1.75,-0.1875
156352,43.271961,-1.75,-0.1875
156353,43.487953,-1.75,-0.1875
156354,43.451973,-1.75,-0.1875
156355,43.415993,-1.75,-0.1875
156356,43.523987,-1.75,-0.1875
156357,43.559967,-1.625,-0.1875
156358,43.631981,-1.625,-0.1875
156359,43.847973,-1.625,0.0
156360,43.919991,-1.625,-0.1875
156361,43.955971,-1.625,0.0
156362,43.919991,-1.625,0.0
156363,43.991951,-1.625,-0.1875
156364,44.099998,-1.625,-0.1875
156365,44.063965,-1.625,0.0
156366,44.31599,-1.625,-0.1875
156367,44.31599,-1.625,-0.1875
156368,44.31599,-1.625,-0.4375
156369,44.459969,-1.625,-0.1875
156370,44.423988,-1.625,0.0
156371,44.351971,-1.625,-0.1875
156372,44.495949,-1.625,-0.1875
156373,44.675957,-1.625,-0.1875
156374,44.603996,-1.5,-0.1875
156375,44.675957,-1.4375,-0.1875
156376,44.819988,-1.3125,-0.1875
156377,44.711994,-1.25,-0.4375
156378,44.747974,-1.25,-0.1875
156379,44.711994,-1.25,-0.4375
156380,45.07196,-1.125,-0.1875
156381,45.0,-0.8125,-0.1875
156382,45.03598,-0.75,-0.1875
156383,45.03598,-0.625,0.0
156384,45.03598,-0.5,0.0
156385,45.287952,-0.25,0.25
156386,45.251972,-0.125,0.0
156387,45.287952,0.0,0.25
156388,45.323986,0.1875,0.25
156389,45.251972,0.6875,0.25
156390,45.359966,0.875,0.25
156391,45.575958,1.0625,0.25
156392,45.611992,1.1875,0.25
156393,45.647972,1.1875,0.25
156394,45.611992,1.1875,0.25
156395,45.683952,1.1875,0.25
156396,45.683952,1.0625,0.25
156397,45.71999,1.0625,0.25
156398,45.900002,1.0625,0.25
156399,45.863964,1.0625,0.25
156400,45.863964,1.0,0.25
156401,45.900002,1.0,0.25
156402,45.935982,1.0,0.25
156403,46.007996,1.0,0.25
156404,46.11599,1.0,0.25
156405,46.11599,0.875,0.25
156406,46.11599,0.875,0.25
156407,46.11599,0.875,0.25
156408,46.15197,0.6875,0.25
156409,46.18795,0.6875,0.25
156410,46.331982,0.5,0.25
156411,46.259968,0.375,0.25
156412,46.259968,0.25,0.25
156413,46.295948,0.0625,0.25
156414,46.295948,0.0,0.25
156415,46.295948,0.0,0.25
156416,46.403999,-0.25,0.25
156417,46.43998,-0.3125,0.25
156418,46.43998,-0.4375,0.0
156419,46.403999,-0.4375,0.25
156420,46.43998,-0.4375,0.0
156421,46.43998,-0.5,0.0
156422,46.547974,-0.5,0.0
156423,46.583954,-0.5,0.0
156424,46.583954,-0.5,-0.1875
156425,46.583954,-0.625,0.0
156426,46.619987,-0.625,0.0
156427,46.583954,-0.625,0.0
156428,46.691948,-0.625,0.0
156429,46.763966,-0.625,0.0
156430,46.763966,-0.625,0.0
156431,46.655968,-0.5,0.0
156432,46.691948,-0.5,0.0
156433,46.727985,-0.5,0.0
156434,46.799999,-0.4375,0.0
156435,46.87196,-0.4375,0.0
156436,46.907997,-0.4375,0.0
156437,46.835979,-0.3125,0.0
156438,46.907997,-0.3125,0.0
156439,46.907997,-0.25,0.0
156440,46.943977,-0.25,0.0
156441,47.087952,-0.25,0.0
156442,47.051971,-0.25,0.0
156443,47.015991,-0.125,0.0
156444,47.051971,-0.125,0.0
156445,47.051971,-0.125,0.0
156446,47.051971,-0.125,0.0
156447,47.159966,-0.125,0.25
156448,47.231983,-0.125,0.25
156449,47.159966,-0.125,0.0
156450,47.159966,-0.125,0.0
156451,47.231983,-0.125,0.25
156452,47.339977,-0.125,0.0
156453,47.375957,-0.25,0.0
156454,47.375957,-0.25,0.0
156455,47.303997,-0.25,0.0
156456,47.303997,-0.25,0.0
156457,47.339977,-0.25,0.25
156458,47.375957,-0.25,0.0
156459,47.519989,-0.25,0.0
156460,47.519989,-0.25,0.0
156461,47.447975,-0.25,0.25
156462,47.519989,-0.25,0.0
156463,47.555969,-0.25,0.25
156464,47.519989,-0.25,0.0
156465,47.591949,-0.25,0.0
156466,47.591949,-0.25,0.0
156467,47.555969,-0.25,0.0
156468,47.447975,-0.25,0.0
156469,47.555969,-0.3125,0.0
156470,47.519989,-0.4375,0.0
156471,47.663963,-0.4375,0.0
156472,47.771961,-0.625,0.0
156473,47.771961,-0.625,0.0
156474,47.843975,-0.75,0.0
156475,47.700001,-0.8125,0.0
156476,47.700001,-0.8125,0.0
156477,47.879955,-0.9375,0.25
156478,47.879955,-0.9375,0.25
156479,47.843975,-1.0,0.0
156480,47.879955,-1.0,0.0
156481,47.915993,-1.0,0.0
156482,47.915993,-1.0,0.0
156483,47.915993,-1.0,0.0
156484,47.915993,-1.0,0.0
156485,48.059967,-1.0,-0.1875
156486,47.915993,-1.0,-0.1875
156487,47.915993,-1.0,-0.1875
156488,48.023987,-1.0,-0.1875
156489,48.059967,-1.0,-0.1875
156490,48.167961,-1.125,-0.1875
156491,48.095947,-1.125,-0.1875
156492,48.095947,-1.125,0.0
156493,48.059967,-1.125,0.0
156494,48.203999,-1.125,0.0
156495,48.203999,-1.25,0.0
156496,48.239979,-1.25,0.0
156497,48.167961,-1.25,-0.1875
156498,48.239979,-1.25,0.0
156499,48.167961,-1.25,0.0
156500,48.095947,-1.25,0.0
156501,48.239979,-1.25,0.0
156502,48.275959,-1.25,0.0
156503,48.239979,-1.25,0.0
156504,48.203999,-1.25,0.0
156505,48.311993,-1.25,-0.1875
156506,48.311993,-1.25,-0.1875
156507,48.419991,-1.25,-0.1875
156508,48.419991,-1.25,-0.1875
156509,48.347973,-1.25,-0.1875
156510,48.419991,-1.25,-0.1875
156511,48.311993,-1.25,-0.1875
156512,48.311993,-1.25,-0.1875
156513,48.527985,-1.25,-0.1875
156514,48.455971,-1.25,-0.1875
156515,48.455971,-1.25,-0.1875
156516,48.527985,-1.25,-0.1875
156517,48.563965,-1.25,0.0
156518,48.527985,-1.25,0.0
156519,48.599998,-1.25,-0.1875
156520,48.599998,-1.25,0.0
156521,48.491951,-1.25,0.0
156522,48.563965,-1.25,-0.1875
156523,48.563965,-1.25,-0.1875
156524,48.563965,-1.25,-0.1875
156525,48.707996,-1.25,-0.1875
156526,48.635979,-1.25,-0.1875
156527,48.599998,-1.25,0.0
156528,48.599998,-1.25,0.0
156529,48.671959,-1.125,-0.1875
156530,48.707996,-1.125,-0.1875
156531,48.81599,-1.125,0.0
156532,48.671959,-1.125,0.0
156533,48.635979,-1.125,0.0
156534,48.743977,-1.125,0.0
156535,48.707996,-1.0,0.0
156536,48.779957,-0.9375,-0.1875
156537,48.743977,-0.9375,0.0
156538,48.707996,-0.9375,0.0
156539,48.707996,-0.8125,0.0
156540,48.707996,-0.75,-0.1875
156541,48.671959,-0.75,0.0
156542,48.779957,-0.625,-0.1875
156543,48.851971,-0.625,-0.1875
156544,48.707996,-0.625,-0.1875
156545,48.743977,-0.5,0.0
156546,48.779957,-0.5,0.0
156547,48.743977,-0.4375,0.0
156548,48.779957,-0.4375,0.0
156549,48.81599,-0.4375,0.0
156550,48.743977,-0.4375,0.0
156551,48.707996,-0.4375,0.25
156552,48.707996,-0.4375,0.25
156553,48.743977,-0.3125,0.25
156554,48.81599,-0.25,0.25
156555,48.851971,0.0,0.25
156556,48.81599,0.0,0.25
156557,48.671959,0.25,0.0
156558,48.707996,0.5,0.0
156559,48.779957,0.6875,0.25
156560,48.851971,0.875,0.25
156561,48.887951,1.0,0.25
156562,48.743977,1.0625,0.25
156563,48.743977,1.0625,0.25
156564,48.419991,1.0625,0.25
156565,48.779957,1.0625,0.25
156566,48.923988,1.0625,0.25
156567,48.887951,1.0625,0.25
156568,48.81599,1.0625,0.25
156569,48.81599,1.0625,0.25
156570,48.81599,1.0625,0.25
156571,48.81599,1.0625,0.25
156572,48.81599,1.0625,0.25
156573,48.81599,1.0625,0.25
156574,48.779957,1.0625,0.25
156575,48.779957,1.0625,0.25
156576,48.743977,1.0625,0.25
156577,48.779957,1.0625,0.25
156578,48.81599,1.0625,0.25
156579,48.81599,1.0,0.25
156580,48.707996,1.0,0.25
156581,48.779957,1.0,0.25
156582,48.743977,1.0,0.25
156583,48.81599,1.0,0.25
156584,48.851971,1.0,0.25
156585,48.81599,1.0,0.25
156586,48.743977,1.0,0.25
156587,48.743977,1.0,0.25
156588,48.707996,1.0,0.25
156589,48.743977,1.0,0.25
156590,48.779957,1.0,0.25
156591,48.707996,1.0,0.25
156592,48.671959,1.0,0.25
156593,48.635979,1.0,0.25
156594,48.707996,0.875,0.25
156595,48.743977,0.875,0.25
156596,48.743977,0.875,0.25
156597,48.707996,0.875,0.25
156598,48.599998,0.75,0.25
156599,48.599998,0.75,0.25
156600,48.671959,0.6875,0.25
156601,48.707996,0.5625,0.25
156602,48.779957,0.5625,0.25
156603,48.743977,0.5,0.25
156604,48.671959,0.375,0.25
156605,48.743977,0.25,0.25
156606,48.743977,0.25,0.25
156607,48.743977,0.1875,0.25
156608,48.599998,0.1875,0.25
156609,48.563965,0.0625,0.25
156610,48.563965,0.0,0.0
156611,48.563965,0.0,0.0
156612,48.707996,-0.3125,0.0
156613,48.743977,-0.4375,0.0
156614,48.743977,-0.625,0.0
156615,48.599998,-0.75,0.0
156616,48.635979,-0.75,0.0
156617,48.671959,-0.75,-0.1875
156618,48.707996,-0.75,-0.1875
156619,48.671959,-0.75,-0.1875
156620,48.671959,-0.75,0.0
156621,48.527985,-0.75,-0.1875
156622,48.563965,-0.625,-0.1875
156623,48.563965,-0.625,-0.1875
156624,48.635979,-0.5,0.0
156625,48.707996,-0.5,0.0
156626,48.635979,-0.4375,0.0
156627,48.599998,-0.25,0.25
156628,48.563965,-0.125,0.25
156629,48.599998,0.0,0.0
156630,48.599998,0.0625,0.25
156631,48.707996,0.1875,0.25
156632,48.707996,0.25,0.0
156633,48.599998,0.25,0.0
156634,48.563965,0.375,0.25
156635,48.527985,0.5,0.25
156636,48.599998,0.5,0.25
156637,48.599998,0.5625,0.25
156638,48.599998,0.5625,0.25
156639,48.563965,0.5625,0.25
156640,48.599998,0.5625,0.25
156641,48.527985,0.5625,0.25
156642,48.599998,0.6875,0.25
156643,48.599998,0.6875,0.25
156644,48.563965,0.6875,0.25
156645,48.455971,0.6875,0.25
156646,48.455971,0.6875,0.25
156647,48.455971,0.6875,0.25
156648,48.491951,0.6875,0.25
156649,48.563965,0.75,0.25
156650,48.527985,0.75,0.25
156651,48.491951,0.875,0.25
156652,48.419991,0.875,0.25
156653,48.455971,0.875,0.25
156654,48.527985,0.875,0.25
156655,48.779957,0.875,0.25
156656,48.239979,0.875,0.25
156657,48.347973,0.875,0.25
156658,48.167961,0.875,0.25
156659,48.419991,0.875,0.25
156660,48.491951,0.875,0.25
156661,48.491951,0.875,0.25
156662,48.491951,0.875,0.25
156663,48.347973,0.875,0.25
156664,48.347973,0.6875,0.25
156665,48.419991,0.25,0.25
156666,48.419991,0.0,0.25
156667,48.419991,-0.125,0.25
156668,48.347973,-0.75,0.25
156669,48.383953,-0.9375,0.0
156670,48.419991,-1.125,0.0
156671,48.347973,-1.5,0.0
156672,48.383953,-1.625,-0.1875
156673,48.383953,-1.75,-0.1875
156674,48.203999,-1.75,-0.1875
156675,48.167961,-1.75,-0.1875
156676,48.275959,-1.75,-0.1875
156677,48.239979,-1.75,-0.1875
156678,48.311993,-1.75,-0.1875
156679,48.347973,-1.75,-0.4375
156680,48.275959,-1.75,-0.4375
156681,48.239979,-1.75,-0.4375
156682,48.203999,-1.75,-0.4375
156683,48.203999,-1.75,-0.1875
156684,48.275959,-1.75,-0.4375
156685,48.311993,-1.75,-0.4375
156686,48.203999,-1.75,-0.4375
156687,48.239979,-1.75,-0.4375
156688,48.167961,-1.75,-0.1875
156689,48.311993,-1.75,-0.1875
156690,48.275959,-1.75,-0.1875
156691,48.275959,-1.75,-0.1875
156692,48.203999,-1.8125,-0.1875
156693,48.203999,-1.8125,-0.1875
156694,48.203999,-1.8125,-0.1875
156695,48.203999,-1.8125,-0.1875
156696,48.239979,-1.8125,-0.1875
156697,48.167961,-1.8125,-0.1875
156698,48.275959,-1.8125,-0.4375
156699,48.239979,-1.8125,-0.1875
156700,48.203999,-1.75,-0.4375
156701,48.347973,-1.625,-0.1875
156702,48.275959,-1.4375,-0.4375
156703,48.239979,-1.25,-0.1875
156704,48.167961,-0.9375,-0.4375
156705,48.167961,-0.75,-0.1875
156706,48.203999,-0.3125,-0.1875
156707,48.311993,-0.25,0.0
156708,48.275959,-0.125,0.0
156709,48.275959,0.0,0.0
156710,48.239979,0.0,0.0
156711,48.239979,0.0625,0.0
156712,48.275959,0.25,0.25
156713,48.275959,0.375,0.25
156714,48.347973,0.6875,0.25
156715,48.275959,0.75,0.25
156716,48.239979,0.875,0.25
156717,48.275959,1.0625,0.25
156718,48.275959,1.1875,0.25
156719,48.311993,1.25,0.25
156720,48.311993,1.25,0.25
156721,48.275959,1.375,0.25
156722,48.203999,1.375,0.25
156723,48.239979,1.375,0.25
156724,48.239979,1.375,0.25
156725,48.311993,1.375,0.25
156726,48.311993,1.375,0.25
156727,48.239979,1.375,0.25
156728,48.239979,1.375,0.25
156729,48.311993,1.375,0.25
156730,48.275959,1.375,0.25
156731,48.347973,1.375,0.25
156732,48.311993,1.375,0.25
156733,48.347973,1.375,0.25
156734,48.275959,1.375,0.25
156735,48.275959,1.375,0.25
156736,48.275959,1.375,0.25
156737,48.275959,1.375,0.25
156738,48.419991,1.25,0.25
156739,48.383953,1.25,0.25
156740,48.275959,1.25,0.5
156741,48.311993,1.25,0.25
156742,48.203999,1.25,0.25
156743,48.311993,1.25,0.5
156744,48.203999,1.25,0.25
156745,48.455971,1.25,0.25
156746,48.347973,1.25,0.25
156747,48.347973,1.25,0.25
156748,48.131981,1.25,0.25
156749,48.419991,1.1875,0.25
156750,48.527985,1.1875,0.25
156751,48.347973,1.1875,0.25
156752,48.383953,1.1875,0.25
156753,48.275959,1.1875,0.25
156754,48.347973,1.1875,0.25
156755,48.311993,1.1875,0.25
156756,48.383953,1.0625,0.25
156757,48.311993,1.0,0.25
156758,48.275959,0.75,0.25
156759,48.275959,0.6875,0.25
156760,48.347973,0.5,0.25
156761,48.311993,0.375,0.25
156762,48.311993,0.375,0.25
156763,48.419991,0.1875,0.25
156764,48.239979,0.0,0.25
156765,48.311993,0.0,0.25
156766,48.311993,-0.125,0.25
156767,48.383953,-0.4375,0.25
156768,48.383953,-0.75,0.0
156769,48.383953,-0.9375,0.0
156770,48.311993,-1.0,0.0
156771,48.311993,-1.25,0.0
156772,48.347973,-1.25,0.0
156773,48.383953,-1.3125,0.0
156774,48.383953,-1.3125,-0.1875
156775,48.239979,-1.3125,-0.1875
156776,48.275959,-1.3125,-0.1875
156777,48.239979,-1.25,-0.1875
156778,48.239979,-1.125,-0.1875
156779,48.419991,-1.0,-0.1875
156780,48.383953,-0.9375,-0.1875
156781,48.239979,-0.75,-0.1875
156782,48.239979,-0.625,-0.1875
156783,48.203999,-0.625,-0.1875
156784,48.275959,-0.5,-0.1875
156785,48.383953,-0.5,-0.1875
156786,48.347973,-0.5,0.0
156787,48.275959,-0.4375,0.0
156788,48.275959,-0.4375,0.0
156789,48.239979,-0.3125,0.0
156790,48.239979,-0.3125,0.0
156791,48.347973,-0.3125,0.0
156792,48.347973,-0.3125,0.0
156793,48.311993,-0.3125,0.0
156794,48.239979,-0.25,0.0
156795,48.239979,-0.125,0.0
156796,48.275959,-0.125,0.0
156797,48.275959,0.0,0.0
156798,48.275959,0.0,0.0
156799,48.167961,0.0,-0.1875
156800,48.203999,0.0,0.0
156801,48.239979,0.0,0.0
156802,48.203999,0.0625,0.25
156803,48.383953,0.0625,0.25
156804,48.275959,0.0625,0.25
156805,48.239979,0.0625,0.0
156806,48.275959,0.0625,0.0
156807,48.203999,0.0625,0.0
156808,48.275959,0.0625,0.0
156809,48.311993,0.0625,0.0
156810,48.347973,0.0625,0.0
156811,48.275959,0.0625,0.0
156812,48.239979,0.0625,0.0
156813,48.239979,0.0625,0.0
156814,48.275959,0.0625,0.25
156815,48.383953,0.0625,0.25
156816,48.311993,0.0625,0.0
156817,48.311993,0.0625,0.0
156818,48.419991,0.0625,0.0
156819,48.347973,0.0625,0.25
156820,48.347973,0.0625,0.25
156821,48.419991,0.0625,0.0
156822,48.419991,0.0625,0.0
156823,48.419991,0.0,0.0
156824,48.527985,0.0,0.0
156825,48.419991,0.0,0.0
156826,48.491951,0.0,0.0
156827,48.563965,0.0,0.0
156828,48.527985,0.0,0.0
156829,48.491951,0.0,0.25
156830,48.527985,-0.25,0.25
156831,48.599998,-0.3125,0.25
156832,48.671959,-0.4375,0.25
156833,48.707996,-0.4375,0.25
156834,48.707996,-0.4375,0.0
156835,48.635979,-0.4375,0.0
156836,48.635979,-0.4375,0.0
156837,48.635979,-0.4375,-0.1875
156838,48.707996,-0.5,0.0
156839,48.707996,-0.5,-0.1875
156840,48.743977,-0.5,0.0
156841,48.707996,-0.5,0.0
156842,48.707996,-0.5,0.0
156843,48.779957,-0.5,0.0
156844,48.81599,-0.5,0.0
156845,48.779957,-0.5,0.0
156846,48.743977,-0.625,0.0
156847,48.707996,-0.625,0.0
156848,48.779957,-0.75,0.0
156849,48.81599,-0.8125,0.0
156850,48.81599,-0.8125,0.0
156851,48.81599,-0.9375,0.0
156852,48.707996,-0.9375,0.0
156853,48.707996,-1.0,-0.1875
156854,48.671959,-1.0,-0.1875
156855,48.671959,-1.125,-0.1875
156856,48.887951,-1.25,-0.1875
156857,48.707996,-1.25,0.0
156858,48.707996,-1.25,-0.1875
156859,48.81599,-1.3125,-0.1875
156860,48.779957,-1.3125,-0.1875
156861,48.779957,-1.3125,-0.1875
156862,48.81599,-1.3125,-0.1875
156863,48.81599,-1.3125,-0.1875
156864,48.707996,-1.3125,-0.1875
156865,48.743977,-1.3125,-0.1875
156866,48.707996,-1.4375,-0.1875
156867,48.743977,-1.4375,-0.1875
156868,48.81599,-1.4375,-0.1875
156869,48.743977,-1.4375,-0.1875
156870,48.707996,-1.4375,-0.1875
156871,48.743977,-1.4375,-0.1875
156872,48.779957,-1.4375,-0.1875
156873,48.707996,-1.4375,-0.1875
156874,48.81599,-1.4375,-0.1875
156875,48.81599,-1.4375,-0.1875
156876,48.707996,-1.4375,-0.1875
156877,48.743977,-1.4375,-0.1875
156878,48.743977,-1.4375,-0.1875
156879,48.743977,-1.4375,-0.1875
156880,48.779957,-1.4375,-0.1875
156881,48.743977,-1.4375,-0.1875
156882,48.779957,-1.4375,-0.1875
156883,48.743977,-1.4375,-0.1875
156884,48.707996,-1.4375,-0.1875
156885,48.779957,-1.4375,-0.1875
156886,48.81599,-1.4375,-0.1875
156887,48.707996,-1.4375,-0.1875
156888,48.707996,-1.4375,-0.1875
156889,48.671959,-1.4375,-0.1875
156890,48.707996,-1.4375,-0.1875
156891,48.779957,-1.3125,-0.1875
156892,48.81599,-1.3125,-0.1875
156893,48.743977,-1.3125,-0.1875
156894,48.81599,-1.125,-0.1875
156895,48.779957,-1.125,-0.1875
156896,48.743977,-1.0,-0.1875
156897,48.81599,-0.9375,-0.1875
156898,48.779957,-0.8125,0.0
156899,48.743977,-0.8125,-0.1875
156900,48.707996,-0.75,0.0
156901,48.707996,-0.75,0.0
156902,48.671959,-0.625,-0.1875
156903,48.707996,-0.625,0.0
156904,48.707996,-0.625,0.0
156905,48.599998,-0.625,-0.1875
156906,48.599998,-0.625,-0.1875
156907,48.563965,-0.625,-0.1875
156908,48.527985,-0.625,-0.1875
156909,48.563965,-0.5,-0.1875
156910,48.455971,-0.5,0.0
156911,48.419991,-0.5,-0.1875
156912,48.347973,-0.5,-0.1875
156913,48.275959,-0.5,0.0
156914,48.275959,-0.5,0.0
156915,48.167961,-0.5,0.0
156916,48.167961,-0.5,0.0
156917,48.059967,-0.5,-0.1875
156918,48.059967,-0.5,-0.1875
156919,47.987953,-0.5,-0.1875
156920,47.951973,-0.5,-0.1875
156921,47.951973,-0.5,-0.1875
156922,47.915993,-0.5,-0.1875
156923,47.807995,-0.5,-0.1875
156924,47.771961,-0.5,-0.1875
156925,47.735981,-0.5,0.0
156926,47.771961,-0.5,0.0
156927,47.735981,-0.5,0.0
156928,47.663963,-0.5,-0.1875
156929,47.627983,-0.5,-0.1875
156930,47.519989,-0.5,-0.1875
156931,47.447975,-0.5,0.0
156932,47.411995,-0.5,0.0
156933,47.483955,-0.5,-0.1875
156934,47.375957,-0.5,0.0
156935,47.267963,-0.5,0.0
156936,47.231983,-0.625,0.0
156937,47.195946,-0.75,0.25
156938,47.231983,-0.75,0.0
156939,47.267963,-0.8125,0.0
156940,47.123985,-0.9375,0.0
156941,47.051971,-0.9375,0.0
156942,47.015991,-1.0,-0.1875
156943,47.015991,-1.0,0.0
156944,46.87196,-1.0,0.0
156945,46.87196,-1.0,0.0
156946,46.835979,-1.125,-0.1875
156947,46.763966,-1.25,-0.1875
156948,46.763966,-1.25,-0.1875
156949,46.691948,-1.3125,-0.1875
156950,46.619987,-1.3125,-0.1875
156951,46.655968,-1.3125,-0.1875
156952,46.547974,-1.3125,-0.1875
156953,46.43998,-1.3125,-0.1875
156954,46.367962,-1.3125,-0.1875
156955,46.367962,-1.3125,-0.1875
156956,46.295948,-1.3125,-0.1875
156957,46.331982,-1.3125,-0.1875
156958,46.259968,-1.4375,-0.4375
156959,46.223988,-1.4375,-0.1875
156960,46.11599,-1.4375,-0.1875
156961,46.11599,-1.5,-0.1875
156962,46.007996,-1.5,0.0
156963,45.971962,-1.5,-0.1875
156964,46.007996,-1.625,-0.1875
156965,45.935982,-1.75,-0.1875
156966,45.79195,-1.8125,0.0
156967,45.75597,-1.8125,0.0
156968,45.71999,-1.9375,0.0
156969,45.647972,-2.0,-0.1875
156970,45.71999,-2.0,-0.1875
156971,45.683952,-2.125,-0.1875
156972,45.539978,-2.25,-0.4375
156973,45.467964,-2.25,-0.4375
156974,45.359966,-2.25,-0.4375
156975,45.359966,-2.25,-0.4375
156976,45.359966,-2.25,-0.6875
156977,45.359966,-2.0,-0.4375
156978,45.251972,-1.9375,-0.4375
156979,45.215992,-1.4375,-0.4375
156980,45.143974,-1.125,-0.4375
156981,45.107994,-0.8125,-0.1875
156982,45.107994,-0.25,-0.1875
156983,45.07196,0.0,-0.1875
156984,45.03598,0.0625,0.0
156985,44.891949,0.375,0.0
156986,44.819988,0.375,0.25
156987,44.711994,0.5625,0.25
156988,44.747974,0.5625,0.25
156989,44.747974,0.5625,0.25
156990,44.675957,0.5625,0.25
156991,44.639977,0.5625,0.25
156992,44.495949,0.5625,0.25
156993,44.495949,0.5625,0.25
156994,44.567963,0.5625,0.25
156995,44.675957,0.5625,0.25
156996,44.531982,0.6875,0.0
156997,44.31599,0.75,0.25
156998,44.279957,0.75,0.25
156999,44.279957,0.75,0.25
157000,44.171959,0.75,0.25
157001,44.135979,0.75,0.25
157002,44.243977,0.75,0.25
157003,44.099998,0.75,0.25
157004,44.135979,0.75,0.25
157005,43.919991,0.75,0.25
157006,43.955971,0.75,0.25
157007,43.883953,0.75,0.25
157008,44.027985,0.6875,0.25
157009,43.883953,0.6875,0.25
157010,43.667961,0.5625,0.25
157011,43.739979,0.5,0.25
157012,43.667961,0.5,0.25
157013,43.631981,0.5,0.25
157014,43.523987,0.5,0.25
157015,43.523987,0.5,0.0
157016,43.523987,0.5,0.0
157017,43.343975,0.375,0.0
157018,43.343975,0.375,0.0
157019,43.307995,0.25,0.25
157020,43.235981,0.25,0.0
157021,43.271961,0.25,0.25
157022,43.235981,0.25,0.0
157023,43.055969,0.25,0.0
157024,42.983955,0.25,0.25
157025,42.983955,0.25,0.25
157026,42.911995,0.25,0.25
157027,42.875957,0.25,0.25
157028,42.911995,0.1875,0.25
157029,42.803997,0.1875,0.25
157030,42.767963,0.1875,0.25
157031,42.659966,0.1875,0.25
157032,42.623985,0.1875,0.25
157033,42.443977,0.1875,0.25
157034,42.407997,0.1875,0.25
157035,42.407997,0.1875,0.0
157036,42.299999,0.0625,0.0
157037,42.155968,0.0625,0.0
157038,42.155968,0.0625,0.0
157039,42.011993,0.0625,0.0
157040,42.011993,0.0625,0.25
157041,41.97596,0.0,0.25
157042,41.93998,0.0,0.25
157043,41.867962,0.0,0.25
157044,41.68795,0.0,0.0
157045,41.61599,0.0,0.0
157046,41.507996,0.0,0.25
157047,41.435982,0.0,0.25
157048,41.400002,0.0,0.0
157049,41.327984,0.0,0.25
157050,41.21999,0.0,0.0
157051,41.147972,0.0,0.0
157052,41.111992,0.0,0.0
157053,40.967964,0.0,0.25
157054,40.967964,0.0,0.0
157055,40.931984,0.0,0.0
157056,40.895947,0.0,0.0
157057,40.679955,0.0,0.0
157058,40.643974,0.0,0.25
157059,40.607994,0.0,0.25
157060,40.5,0.0,0.0
157061,40.391949,0.0,0.25
157062,40.355968,0.0,0.25
157063,40.319988,0.0,0.0
157064,40.067963,0.0,0.0
157065,40.139977,0.0,0.0
157066,40.031982,0.0,0.0
157067,39.923988,0.0,0.0
157068,39.81599,0.0,0.25
157069,39.81599,0.0,0.25
157070,39.779957,0.0,0.25
157071,39.707996,0.0,0.25
157072,39.419991,0.0,0.25
157073,39.383953,0.0,0.0
157074,39.347973,0.0,0.0
157075,39.239979,0.0,0.25
157076,39.275959,0.0,0.25
157077,39.167961,0.0,0.0
157078,39.167961,0.0,0.0
157079,39.023987,0.0,0.0
157080,38.915993,0.0,-0.1875
157081,38.879955,0.0,0.0
157082,38.735981,0.0,0.0
157083,38.663963,0.0,0.0
157084,38.627983,0.0,0.0
157085,38.555969,0.0,0.25
157086,38.519989,0.0,0.25
157087,38.411995,0.0,0.25
157088,38.303997,0.0,0.25
157089,38.123985,0.0,0.25
157090,38.123985,0.0,0.25
157091,38.051971,0.0,0.0
157092,37.979958,0.0,0.0
157093,37.907997,0.0,0.25
157094,37.87196,0.0,0.0
157095,37.799999,0.0,0.0
157096,37.727985,0.0,0.0
157097,37.619987,0.0,0.0
157098,37.583954,0.0,0.0
157099,37.43998,0.0,0.0
157100,37.43998,0.0,0.0
157101,37.331982,0.0,0.0
157102,37.223988,0.0,0.0
157103,37.15197,0.0,0.0
157104,37.11599,0.0,0.0
157105,36.971962,0.0,0.25
157106,36.935982,0.0,0.25
157107,36.863964,0.0,0.0
157108,36.79195,0.0,0.25
157109,36.71999,0.0,0.25
157110,36.611992,0.0625,0.0
157111,36.503998,0.25,0.0
157112,36.359966,0.5,0.0
157113,36.359966,0.875,0.25
157114,36.359966,1.0625,0.25
157115,36.359966,1.25,0.25
157116,36.215992,1.5625,0.25
157117,36.107994,1.75,0.25
157118,36.0,2.0625,0.25
157119,35.927986,2.1875,0.25
157120,35.855968,2.25,0.25
157121,35.783955,2.5,0.25
157122,35.711994,2.5625,0.25
157123,35.675957,2.5625,0.25
157124,35.531982,2.5625,0.5
157125,35.459969,2.5625,0.25
157126,35.351971,2.5625,0.25
157127,35.387951,2.5625,0.25
157128,35.243977,2.5625,0.25
157129,35.099998,2.5625,0.25
157130,35.099998,2.5625,0.25
157131,35.099998,2.5625,0.25
157132,34.955971,2.5625,0.25
157133,34.883953,2.5625,0.25
157134,34.739979,2.6875,0.25
157135,34.703999,2.6875,0.25
157136,34.667961,2.6875,0.25
157137,34.523987,2.6875,0.5
157138,34.487953,2.6875,0.25
157139,34.379955,2.75,0.25
157140,34.271961,2.875,0.25
157141,34.200001,2.875,0.25
157142,34.019989,2.875,0.25
157143,34.019989,2.875,0.25
157144,33.875957,2.875,0.25
157145,33.803997,2.875,0.25
157146,33.767963,2.875,0.25
157147,33.731983,3.0,0.25
157148,33.659966,3.0625,0.25
157149,33.623985,3.0625,0.25
157150,33.407997,3.1875,0.25
157151,33.335979,3.1875,0.25
157152,33.155968,3.1875,0.5
157153,33.083954,3.25,0.25
157154,33.011993,3.25,0.5
157155,32.93998,3.375,0.25
157156,32.903999,3.375,0.25
157157,32.759968,3.5,0.5
157158,32.61599,3.5625,0.5
157159,32.507996,3.5625,0.5
157160,32.363964,3.6875,0.25
157161,32.327984,3.6875,0.25
157162,32.147972,3.6875,0.5
157163,32.111992,3.75,0.25
157164,32.075958,3.875,0.5
157165,32.003998,4.0,0.25
157166,31.967962,4.0625,0.25
157167,31.895947,4.0625,0.5
157168,31.715992,4.25,0.5
157169,31.607996,4.25,0.25
157170,31.427984,4.25,0.5
157171,31.391949,4.25,0.5
157172,31.319988,4.25,0.5
157173,31.211994,4.25,0.75
157174,31.139978,4.25,0.5
157175,31.031982,4.25,0.5
157176,30.959967,4.25,0.5
157177,30.779957,4.25,0.75
157178,30.6,4.25,0.5
157179,30.563965,4.25,0.5
157180,30.527985,4.1875,0.5
157181,30.419989,4.1875,0.5
157182,30.383953,4.1875,0.5
157183,30.275959,4.1875,0.5
157184,30.239979,4.1875,0.5
157185,29.987951,4.1875,0.25
157186,29.951971,4.1875,0.5
157187,29.879955,4.1875,0.5
157188,29.663965,4.1875,0.5
157189,29.627985,4.1875,0.5
157190,29.447973,4.0625,0.5
157191,29.375957,4.0625,0.25
157192,29.339977,4.0,0.5
157193,29.267963,3.875,0.5
157194,29.159967,3.75,0.25
157195,29.159967,3.6875,0.5
157196,28.943975,3.5625,0.5
157197,28.835979,3.5625,0.25
157198,28.763966,3.5625,0.25
157199,28.65597,3.5625,0.25
157200,28.547974,3.5625,0.5
157201,28.475958,3.5625,0.5
157202,28.403997,3.5625,0.25
157203,28.223988,3.5625,0.25
157204,28.115992,3.5625,0.25
157205,27.863964,3.5625,0.5
157206,27.79195,3.5625,0.25
157207,27.71999,3.5625,0.25
157208,27.611994,3.5625,0.25
157209,27.575958,3.5625,0.25
157210,27.503998,3.6875,0.25
157211,27.431982,3.6875,0.5
157212,27.323986,3.6875,0.5
157213,27.251972,3.6875,0.5
157214,27.143976,3.6875,0.5
157215,27.07196,3.6875,0.5
157216,26.855968,3.5625,0.25
157217,26.675959,3.5625,0.25
157218,26.567963,3.5625,0.25
157219,26.531982,3.5625,0.25
157220,26.351971,3.5625,0.25
157221,26.243977,3.5625,0.25
157222,26.207996,3.5625,0.5
157223,26.135981,3.5625,0.25
157224,25.955969,3.5625,0.25
157225,25.883953,3.5625,0.25
157226,25.667963,3.5625,0.25
157227,25.667963,3.5625,0.25
157228,25.487951,3.5625,0.25
157229,25.379955,3.5625,0.25
157230,25.379955,3.5625,0.25
157231,25.235981,3.5625,0.5
157232,25.127985,3.5625,0.25
157233,24.983953,3.5,0.25
157234,24.911993,3.5,0.25
157235,24.875957,3.5,0.25
157236,24.659967,3.25,0.25
157237,24.587952,3.25,0.25
157238,24.443975,3.0625,0.25
157239,24.335979,3.0,0.25
157240,24.227985,2.875,0.25
157241,24.119989,2.6875,0.25
157242,24.047974,2.5625,0.25
157243,23.867962,2.375,0.25
157244,23.795948,2.25,0.25
157245,23.723988,2.0625,0.25
157246,23.615992,2.0,0.25
157247,23.543976,1.875,0.25
157248,23.4,1.6875,0.25
157249,23.25597,1.5,0.25
157250,23.075958,1.1875,0.25
157251,23.075958,1.0625,0.25
157252,22.967962,1.0,0.25
157253,22.751972,0.6875,0.25
157254,22.715992,0.5,0.25
157255,22.5,0.25,0.25
157256,22.463964,0.1875,0.0
157257,22.283955,0.0625,0.0
157258,22.175959,0.0625,0.0
157259,22.031982,0.0625,-0.1875
157260,22.031982,0.0625,0.0
157261,21.81599,0.0625,0.0
157262,21.743977,0.0625,0.0
157263,21.6,0.0625,0.0
157264,21.527985,0.0625,0.0
157265,21.347973,0.0625,0.0
157266,21.275959,0.0625,0.25
157267,21.203999,0.0625,0.25
157268,20.951971,0.0,0.25
157269,20.915991,0.0,0.25
157270,20.807995,0.0,0.25
157271,20.663965,0.0,0.0
157272,20.627985,0.0,0.25
157273,20.375957,0.0,0.0
157274,20.267963,0.0,0.0
157275,20.159967,0.0,0.0
157276,20.015991,0.0,0.0
157277,19.87196,0.0,0.0
157278,19.727985,0.0,0.25
157279,19.619989,0.0,0.25
157280,19.511993,0.0,0.25
157281,19.475958,0.0,0.25
157282,19.259968,-0.4375,0.0
157283,19.187952,-0.625,0.0
157284,19.115992,-0.9375,0.0
157285,18.93598,-1.625,-0.1875
157286,18.863964,-1.9375,-0.1875
157287,18.575958,-2.75,-0.1875
157288,18.611994,-3.125,0.0
157289,18.359966,-3.8125,0.0
157290,18.359966,-4.125,0.0
157291,18.251972,-4.5,-0.1875
157292,18.03598,-5.3125,-0.1875
157293,17.963964,-5.625,-0.1875
157294,17.819988,-5.8125,-0.4375
157295,17.675959,-6.3125,-0.1875
157296,17.567963,-6.5,-0.4375
157297,17.423986,-6.8125,-0.4375
157298,17.31599,-6.9375,-0.4375
157299,17.1,-7.25,-0.4375
157300,17.027985,-7.3125,-0.4375
157301,16.919989,-7.4375,-0.4375
157302,16.739979,-7.5,-0.4375
157303,16.667963,-7.5,-0.4375
157304,16.523987,-7.5,-0.6875
157305,16.415991,-7.5,-0.4375
157306,16.307995,-7.5,-0.6875
157307,16.091949,-7.5,-0.4375
157308,16.019989,-7.5,-0.4375
157309,15.947973,-7.5,-0.6875
157310,15.731982,-7.4375,-0.6875
157311,15.695948,-7.4375,-0.4375
157312,15.479956,-7.25,-0.4375
157313,15.407995,-7.0,-0.6875
157314,15.15597,-6.3125,-0.4375
157315,15.119989,-6.0,-0.4375
157316,15.047974,-5.75,-0.1875
157317,14.903997,-4.9375,-0.1875
157318,14.831983,-4.5,-0.1875
157319,14.579956,-3.8125,-0.1875
157320,14.579956,-3.625,-0.1875
157321,14.47196,-3.4375,-0.1875
157322,14.219989,-3.3125,0.0
157323,14.075958,-3.3125,0.0
157324,13.931982,-3.3125,0.0
157325,13.859967,-3.3125,-0.1875
157326,13.643976,-3.3125,0.0
157327,13.607996,-3.3125,0.0
157328,13.5,-3.3125,0.0
157329,13.39195,-3.3125,-0.1875
157330,13.067963,-3.3125,-0.1875
157331,12.995947,-3.3125,0.0
157332,12.923986,-3.3125,0.0
157333,12.815991,-3.3125,-0.1875
157334,12.707995,-3.25,-0.1875
157335,12.563965,-3.25,0.0
157336,12.347974,-3.125,-0.1875
157337,12.275958,-3.125,0.0
157338,12.203998,-3.0,0.0
157339,11.987951,-2.9375,0.0
157340,11.915991,-2.8125,0.0
157341,11.7,-2.625,0.0
157342,11.663965,-2.5,-0.1875
157343,11.447973,-2.3125,0.0
157344,11.339978,-2.3125,0.0
157345,11.303998,-2.3125,0.0
157346,11.051971,-2.3125,0.0
157347,10.907995,-2.25,0.0
157348,10.8,-2.25,0.0
157349,10.69195,-2.25,0.0
157350,10.475958,-2.125,0.0
157351,10.367963,-2.0,0.0
157352,10.259967,-2.0,0.0
157353,10.151972,-1.9375,0.0
157354,10.007996,-1.9375,0.0
157355,9.9,-1.9375,0.0
157356,9.755969,-1.8125,0.0
157357,9.719989,-1.8125,0.0
157358,9.359967,-1.8125,0.0
157359,9.359967,-1.8125,0.25
157360,9.179956,-1.8125,0.25
157361,9.107996,-1.8125,0.25
157362,9.0,-1.75,0.25
157363,8.819989,-1.75,0.25
157364,8.711993,-1.75,0.25
157365,8.675959,-1.75,0.25
157366,8.459967,-1.625,0.25
157367,8.315991,-1.625,0.0
157368,8.207995,-1.5,0.0
157369,8.171961,-1.5,0.0
157370,8.027985,-1.5,0.0
157371,7.847974,-1.5,0.0
157372,7.739978,-1.5,0.25
157373,7.631982,-1.5,0.25
157374,7.559967,-1.5,0.25
157375,7.415991,-1.5,0.25
157376,7.307996,-1.5,0.0
157377,7.23598,-1.4375,0.0
157378,7.163965,-1.4375,0.25
157379,6.947974,-1.4375,0.0
157380,6.839978,-1.4375,0.0
157381,6.767962,-1.4375,0.0
157382,6.659967,-1.4375,0.25
157383,6.551971,-1.4375,0.0
157384,6.407996,-1.4375,0.0
157385,6.3,-1.4375,0.0
157386,6.191949,-1.4375,0.0
157387,6.119989,-1.4375,0.25
157388,5.939978,-1.4375,0.25
157389,5.867963,-1.4375,0.25
157390,5.795947,-1.4375,0.0
157391,5.615991,-1.4375,0.0
157392,5.543976,-1.4375,0.0
157393,5.471961,-1.4375,0.25
157394,5.327985,-1.4375,0.0
157395,5.255969,-1.4375,0.0
157396,5.183954,-1.4375,0.0
157397,5.003998,-1.4375,0.0
157398,4.931983,-1.4375,0.0
157399,4.787951,-1.4375,0.0
157400,4.715991,-1.4375,0.25
157401,4.643976,-1.4375,0.0
157402,4.5,-1.4375,0.0
157403,4.427985,-1.4375,0.25
157404,4.247973,-1.4375,0.25
157405,4.175958,-1.4375,0.0
157406,4.067963,-1.4375,0.25
157407,3.959967,-1.4375,0.25
157408,3.923987,-1.4375,0.25
157409,3.851971,-1.4375,0.25
157410,3.707996,-1.4375,0.0
157411,3.63598,-1.4375,0.0
157412,3.49195,-1.4375,0.0
157413,3.419989,-1.4375,0.25
157414,3.311993,-1.4375,0.0
157415,3.203998,-1.4375,0.25
157416,3.167963,-1.4375,0.25
157417,3.023987,-1.4375,0.25
157418,2.951972,-1.4375,0.25
157419,2.807996,-1.4375,0.0
157420,2.73598,-1.4375,0.0
157421,2.7,-1.4375,0.0
157422,2.627985,-1.4375,0.0
157423,2.519989,-1.4375,0.0
157424,2.375958,-1.4375,0.0
157425,2.339978,-1.4375,0.0
157426,2.303998,-1.4375,0.25
157427,2.159967,-1.4375,0.25
157428,2.123987,-1.4375,0.25
157429,2.015991,-1.4375,0.25
157430,1.007996,-1.4375,0.25
157431,0.0,-1.4375,0.25
157432,0.0,-1.4375,0.0
157433,0.0,-1.4375,0.0
157434,0.0,-1.5,0.0
157435,0.0,-1.5,0.0
157436,0.0,-1.5,0.0
157437,0.0,-1.5,0.0
157438,0.0,-1.5,0.0
157439,0.0,-1.5,0.0
157440,0.0,-1.5,0.0
157441,0.0,-1.5,0.25
157442,0.0,-1.5,0.0
157443,0.0,-1.5,0.25
157444,0.0,-1.5,0.25
157445,0.0,-1.5,0.0
157446,0.0,-1.5,0.0
157447,0.0,-1.5,0.0
157448,0.0,-1.5,0.0
157449,0.0,-1.5,0.0
157450,0.0,-1.5,0.0
157451,0.0,-1.5,0.25
157452,0.0,-1.5,0.25
157453,0.0,-1.5,0.25
157454,0.0,-1.5,0.25
157455,0.0,-1.5,0.25
157456,0.0,-1.5,0.0
157457,0.0,-1.5,0.25
157458,0.0,-1.5,0.25
157459,0.0,-1.5,0.0
157460,0.0,-1.5,0.0
157461,0.0,-1.5,0.0
157462,0.0,-1.5,0.25
157463,0.0,-1.5,0.25
157464,0.0,-1.5,0.0
157465,0.0,-1.5,0.25
157466,0.0,-1.5,0.25
157467,0.0,-1.5,0.0
157468,0.0,-1.5,0.25
157469,0.0,-1.5,0.25
157470,0.0,-1.5,0.0
157471,0.0,-1.5,0.0
157472,0.0,-1.5,0.25
157473,0.0,-1.5,0.0
157474,0.0,-1.5,0.25
157475,0.0,-1.5,0.25
157476,0.0,-1.5,0.0
157477,0.0,-1.5,0.0
157478,0.0,-1.5,0.25
157479,0.0,-1.5,0.25
157480,0.0,-1.5,0.0
157481,0.0,-1.5,0.25
157482,0.0,-1.5,0.25
157483,0.0,-1.5,0.25
157484,0.0,-1.5,0.25
157485,0.0,-1.5,0.0
157486,0.0,-1.625,0.25
157487,0.0,-1.625,0.25
157488,0.0,-1.625,0.25
157489,0.0,-1.625,0.25
157490,0.0,-1.625,0.25
157491,0.0,-1.625,0.25
157492,0.0,-1.625,0.0
157493,0.0,-1.625,0.25
157494,0.0,-1.625,0.25
157495,0.0,-1.625,0.25
157496,0.0,-1.625,0.25
157497,0.0,-1.625,0.25
157498,0.0,-1.625,0.25
157499,0.0,-1.625,0.0
157500,0.0,-1.625,0.0
157501,0.0,-1.625,0.25
157502,0.0,-1.625,0.0
157503,0.0,-1.625,0.25
157504,0.0,-1.625,0.25
157505,0.0,-1.625,0.0
157506,0.0,-1.625,0.25
157507,0.0,-1.625,0.0
157508,0.0,-1.625,0.0
157509,0.0,-1.625,0.25
157510,0.0,-1.625,0.0
157511,0.0,-1.625,0.25
157512,0.0,-1.625,0.25
157513,0.0,-1.625,0.25
157514,0.0,-1.625,0.0
157515,0.0,-1.625,0.25
157516,0.0,-1.625,0.25
157517,0.0,-1.625,0.0
157518,0.0,-1.625,0.25
157519,0.0,-1.625,0.25
157520,0.0,-1.625,0.25
157521,0.0,-1.625,0.0
157522,0.0,-1.625,0.25
157523,0.0,-1.625,0.25
157524,0.0,-1.625,0.0
157525,0.0,-1.625,0.25
157526,0.0,-1.625,0.0
157527,0.0,-1.625,0.25
157528,0.0,-1.625,0.25
157529,0.0,-1.625,0.0
157530,0.0,-1.625,0.25
157531,0.0,-1.625,0.25
157532,0.0,-1.625,0.0
157533,0.0,-1.625,0.25
157534,0.0,-1.625,0.25
157535,0.0,-1.625,0.25
157536,0.0,-1.625,0.0
157537,0.0,-1.625,0.0
157538,0.0,-1.625,0.25
157539,0.0,-1.625,0.25
157540,0.0,-1.625,0.25
157541,0.0,-1.625,0.25
157542,0.0,-1.625,0.0
157543,0.0,-1.625,0.0
157544,0.0,-1.625,0.25
157545,0.0,-1.625,0.25
157546,0.0,-1.625,0.25
157547,0.0,-1.625,0.25
157548,0.0,-1.625,0.25
157549,0.0,-1.625,0.25
157550,0.0,-1.625,0.25
157551,0.0,-1.625,0.25
157552,0.0,-1.625,0.25
157553,0.0,-1.625,0.0
157554,0.0,-1.625,0.0
157555,0.0,-1.625,0.0
157556,0.0,-1.625,0.25
157557,0.0,-1.625,0.25
157558,0.0,-1.625,0.25
157559,0.0,-1.625,0.25
157560,0.0,-1.625,0.25
157561,0.0,-1.625,0.0
157562,0.0,-1.625,0.0
157563,0.0,-1.625,0.25
157564,0.0,-1.625,0.25
157565,0.0,-1.625,0.25
157566,0.0,-1.625,0.0
157567,0.0,-1.625,0.0
157568,0.0,-1.625,0.0
157569,0.0,-1.625,0.0
157570,0.0,-1.625,0.0
157571,0.0,-1.625,0.0
157572,0.0,-1.625,0.0
157573,0.0,-1.625,0.25
157574,0.0,-1.625,0.25
157575,0.0,-1.625,0.0
157576,0.0,-1.625,0.25
157577,0.0,-1.625,0.25
157578,0.0,-1.625,0.0
157579,0.0,-1.625,0.0
157580,0.0,-1.625,0.0
157581,0.0,-1.625,0.0
157582,0.0,-1.625,0.25
157583,0.0,-1.625,0.0
157584,0.0,-1.625,0.0
157585,0.0,-1.625,0.25
157586,0.0,-1.625,0.25
157587,0.0,-1.625,0.25
157588,0.0,-1.625,0.25
157589,0.0,-1.625,0.0
157590,0.0,-1.625,0.25
157591,0.0,-1.625,0.0
157592,0.0,-1.625,0.25
157593,0.0,-1.625,0.0
157594,0.0,-1.625,0.0
157595,0.0,-1.625,0.0
157596,0.0,-1.625,0.0
157597,0.0,-1.625,0.25
157598,0.0,-1.625,0.0
157599,0.0,-1.625,0.0
157600,0.0,-1.625,0.0
157601,0.0,-1.625,0.0
157602,0.0,-1.625,0.0
157603,0.0,-1.625,0.0
157604,0.0,-1.625,0.25
157605,0.0,-1.625,0.0
157606,0.0,-1.625,0.25
157607,0.0,-1.625,0.0
157608,0.0,-1.625,0.0
157609,0.0,-1.625,0.0
157610,0.0,-1.625,0.25
157611,0.0,-1.625,0.0
157612,0.0,-1.625,0.25
157613,0.0,-1.625,0.0
157614,0.0,-1.625,0.0
157615,0.0,-1.625,0.25
157616,0.0,-1.625,0.0
157617,0.0,-1.625,0.25
157618,0.0,-1.625,0.25
157619,0.0,-1.625,0.25
157620,0.0,-1.625,0.25
157621,0.0,-1.625,0.25
157622,0.0,-1.625,0.25
157623,0.0,-1.625,0.0
157624,0.0,-1.625,0.0
157625,0.0,-1.625,0.25
157626,0.0,-1.625,0.0
157627,0.0,-1.625,0.0
157628,0.0,-1.625,0.25
157629,0.0,-1.625,0.0
157630,0.0,-1.625,0.0
157631,0.0,-1.625,0.25
157632,0.0,-1.625,0.0
157633,0.0,-1.625,0.0
157634,0.0,-1.625,0.0
157635,0.0,-1.625,0.25
157636,0.0,-1.625,0.0
157637,0.0,-1.625,0.25
157638,0.0,-1.625,0.0
157639,0.0,-1.625,0.25
157640,0.0,-1.625,0.25
157641,0.0,-1.625,0.0
157642,0.0,-1.625,0.25
157643,0.0,-1.625,0.25
157644,0.0,-1.625,0.0
157645,0.0,-1.625,0.0
157646,0.0,-1.625,0.0
157647,0.0,-1.625,0.0
157648,0.0,-1.625,0.25
157649,0.0,-1.625,0.25
157650,0.0,-1.625,0.0
157651,0.0,-1.625,0.25
157652,0.0,-1.625,0.25
157653,0.0,-1.625,0.25
157654,0.0,-1.625,0.0
157655,0.0,-1.625,0.25
157656,0.0,-1.625,0.0
157657,0.0,-1.625,0.0
157658,0.0,-1.625,0.25
157659,0.0,-1.625,0.0
157660,0.0,-1.625,0.0
157661,0.0,-1.625,0.0
157662,0.0,-1.625,0.25
157663,0.0,-1.625,0.25
157664,0.0,-1.625,0.25
157665,0.0,-1.625,0.25
157666,0.0,-1.625,0.0
157667,0.0,-1.625,0.0
157668,0.0,-1.625,0.0
157669,0.0,-1.625,0.0
157670,0.0,-1.625,0.0
157671,0.0,-1.625,0.25
157672,0.0,-1.625,0.25
157673,0.0,-1.625,0.25
157674,0.0,-1.625,0.25
157675,0.0,-1.625,0.25
157676,0.0,-1.625,0.25
157677,0.0,-1.625,0.0
157678,0.0,-1.625,0.0
157679,0.0,-1.625,0.25
157680,0.0,-1.625,0.0
157681,0.0,-1.625,0.25
157682,0.0,-1.625,0.25
157683,0.0,-1.625,0.0
157684,0.0,-1.625,0.0
157685,0.0,-1.625,0.0
157686,0.0,-1.625,0.25
157687,0.0,-1.625,0.0
157688,0.0,-1.625,0.0
157689,0.0,-1.625,0.25
157690,0.0,-1.625,0.0
157691,0.0,-1.625,0.25
157692,0.0,-1.625,0.25
157693,0.0,-1.625,0.25
157694,0.0,-1.625,0.25
157695,0.0,-1.625,0.25
157696,0.0,-1.625,0.0
157697,0.0,-1.625,0.0
157698,0.0,-1.625,0.0
157699,0.0,-1.625,0.25
157700,0.0,-1.625,0.0
157701,0.0,-1.625,0.25
157702,0.0,-1.625,0.25
157703,0.0,-1.625,0.25
157704,0.0,-1.625,0.0
157705,0.0,-1.625,0.0
157706,0.0,-1.625,0.25
157707,0.0,-1.625,0.0
157708,0.0,-1.625,0.25
157709,0.0,-1.625,0.0
157710,0.0,-1.625,0.0
157711,0.0,-1.625,0.25
157712,0.0,-1.625,0.25
157713,0.0,-1.625,0.0
157714,0.0,-1.625,0.0
157715,0.0,-1.625,0.0
157716,0.0,-1.625,0.0
157717,0.0,-1.625,0.0
157718,0.0,-1.625,0.25
157719,0.0,-1.625,0.0
157720,0.0,-1.625,0.0
157721,0.0,-1.625,0.25
157722,0.0,-1.625,0.25
157723,0.0,-1.625,0.25
157724,0.0,-1.625,0.25
157725,0.0,-1.625,0.25
157726,0.0,-1.625,0.25
157727,0.0,-1.625,0.0
157728,0.0,-1.625,0.0
157729,0.0,-1.625,0.0
157730,0.0,-1.625,0.0
157731,0.0,-1.625,0.0
157732,0.0,-1.625,0.25
157733,0.0,-1.625,0.0
157734,0.0,-1.625,0.0
157735,0.0,-1.625,0.0
157736,0.0,-1.625,0.0
157737,0.0,-1.625,0.0
157738,0.0,-1.625,0.0
157739,0.0,-1.625,0.0
157740,0.0,-1.625,0.0
157741,0.0,-1.625,0.0
157742,0.0,-1.625,0.0
157743,0.0,-1.625,0.25
157744,0.0,-1.625,0.0
157745,0.0,-1.625,0.0
157746,0.0,-1.625,0.0
157747,0.0,-1.625,0.0
157748,0.0,-1.625,0.0
157749,0.0,-1.625,0.0
157750,0.0,-1.625,0.0
157751,0.0,-1.625,0.25
157752,0.0,-1.625,0.0
157753,0.0,-1.625,0.25
157754,0.0,-1.625,0.0
157755,0.0,-1.625,0.25
157756,0.0,-1.625,0.0
157757,0.0,-1.625,0.0
157758,0.0,-1.625,0.25
157759,0.0,-1.625,0.0
157760,0.0,-1.625,0.25
157761,0.0,-1.625,0.0
157762,0.0,-1.625,0.0
157763,0.0,-1.625,0.0
157764,0.0,-1.625,0.0
157765,0.0,-1.625,0.25
157766,0.0,-1.625,0.0
157767,0.0,-1.625,0.0
157768,0.0,-1.625,0.0
157769,0.0,-1.625,0.0
157770,0.0,-1.625,0.0
157771,0.0,-1.625,0.0
157772,0.0,-1.625,0.0
157773,0.0,-1.625,0.25
157774,0.0,-1.625,0.25
157775,0.0,-1.625,0.25
157776,0.0,-1.625,0.0
157777,0.0,-1.625,0.0
157778,0.0,-1.625,0.25
157779,0.0,-1.625,0.25
157780,0.0,-1.625,0.0
157781,0.0,-1.625,0.0
157782,0.0,-1.625,0.25
157783,0.0,-1.625,0.25
157784,0.0,-1.625,0.0
157785,0.0,-1.625,0.25
157786,0.0,-1.625,0.0
157787,0.0,-1.625,0.0
157788,0.0,-1.625,0.25
157789,0.0,-1.625,0.0
157790,0.0,-1.625,0.0
157791,0.0,-1.625,0.25
157792,0.0,-1.625,0.0
157793,0.0,-1.625,0.25
157794,0.0,-1.625,0.0
157795,0.0,-1.625,0.0
157796,0.0,-1.625,0.0
157797,0.0,-1.625,0.25
157798,0.0,-1.625,0.25
157799,0.0,-1.625,0.25
157800,0.0,-1.625,0.0
157801,0.0,-1.625,0.0
157802,0.0,-1.625,0.25
157803,0.0,-1.625,0.0
157804,0.0,-1.625,0.25
157805,0.0,-1.625,0.0
157806,0.0,-1.625,0.25
157807,0.0,-1.625,0.0
157808,0.0,-1.625,0.25
157809,0.0,-1.625,0.0
157810,0.0,-1.625,0.25
157811,0.0,-1.625,0.0
157812,0.0,-1.625,0.0
157813,0.0,-1.625,0.25
157814,0.0,-1.625,0.0
157815,0.0,-1.625,0.25
157816,0.0,-1.625,0.0
157817,0.0,-1.625,0.25
157818,0.0,-1.625,0.0
157819,0.0,-1.625,0.25
157820,0.0,-1.625,0.0
157821,0.0,-1.625,0.0
157822,0.0,-1.625,0.0
157823,0.0,-1.625,0.25
157824,0.0,-1.625,0.25
157825,0.0,-1.625,0.0
157826,0.0,-1.625,0.25
157827,0.0,-1.625,0.0
157828,0.0,-1.625,0.0
157829,0.0,-1.625,0.25
157830,0.0,-1.625,0.25
157831,0.0,-1.625,0.0
157832,0.0,-1.625,0.0
157833,0.0,-1.625,0.0
157834,0.0,-1.625,0.25
157835,0.0,-1.625,0.0
157836,0.0,-1.625,0.0
157837,0.0,-1.625,0.0
157838,0.0,-1.625,0.0
157839,0.0,-1.625,0.25
157840,0.0,-1.625,0.0
157841,0.0,-1.625,0.25
157842,0.0,-1.625,0.25
157843,0.0,-1.625,0.0
157844,0.0,-1.625,0.0
157845,0.0,-1.625,0.0
157846,0.0,-1.625,0.0
157847,0.0,-1.625,0.0
157848,0.0,-1.625,0.0
157849,0.0,-1.625,0.25
157850,0.0,-1.625,0.0
157851,0.0,-1.625,0.0
157852,0.0,-1.625,0.0
157853,0.0,-1.625,0.0
157854,0.0,-1.625,0.25
157855,0.0,-1.625,0.25
157856,0.0,-1.625,0.0
157857,0.0,-1.625,0.0
157858,0.0,-1.625,0.0
157859,0.0,-1.625,0.0
157860,0.0,-1.625,0.0
157861,0.0,-1.625,0.0
157862,0.0,-1.625,0.0
157863,0.0,-1.625,0.0
157864,0.0,-1.625,0.0
157865,0.0,-1.625,0.0
157866,0.0,-1.625,0.25
157867,0.0,-1.625,0.0
157868,0.0,-1.625,0.0
157869,0.0,-1.625,0.25
157870,0.0,-1.625,0.0
157871,0.0,-1.625,0.0
157872,0.0,-1.625,0.0
157873,0.0,-1.625,0.0
157874,0.0,-1.625,0.0
157875,0.0,-1.625,0.0
157876,0.0,-1.625,0.25
157877,0.0,-1.625,0.0
157878,0.0,-1.625,0.0
157879,0.0,-1.625,0.0
157880,0.0,-1.625,0.0
157881,0.0,-1.625,0.25
157882,0.0,-1.625,0.0
157883,0.0,-1.625,0.0
157884,0.0,-1.625,0.25
157885,0.0,-1.625,0.0
157886,0.0,-1.625,0.0
157887,0.0,-1.625,0.0
157888,0.0,-1.625,0.0
157889,0.0,-1.625,0.25
157890,0.0,-1.625,0.0
157891,0.0,-1.625,0.0
157892,0.0,-1.625,0.0
157893,0.0,-1.625,0.0
157894,0.0,-1.625,0.0
157895,0.0,-1.625,0.0
157896,0.0,-1.625,0.0
157897,0.0,-1.625,0.0
157898,0.0,-1.625,0.25
157899,0.0,-1.625,0.0
157900,0.0,-1.625,0.0
157901,0.0,-1.625,0.0
157902,0.0,-1.625,0.25
157903,0.0,-1.625,0.25
157904,0.0,-1.625,0.0
157905,0.0,-1.625,0.25
