[0217/130057.780:ERROR:crash_report_database_win.cc(469)] failed to stat report
[0217/131057.780:ERROR:crash_report_database_win.cc(469)] failed to stat report
[0217/131057.788:ERROR:crash_report_database_win.cc(469)] failed to stat report
[0217/131557.804:ERROR:crash_report_database_win.cc(469)] failed to stat report
[0217/141549.843:ERROR:crash_report_database_win.cc(469)] failed to stat report
[0217/143049.883:ERROR:crash_report_database_win.cc(469)] failed to stat report
[0217/144549.937:ERROR:crash_report_database_win.cc(469)] failed to stat report
[0217/150049.947:ERROR:crash_report_database_win.cc(469)] failed to stat report
[0217/151549.973:ERROR:crash_report_database_win.cc(469)] failed to stat report
[0217/153050.027:ERROR:crash_report_database_win.cc(469)] failed to stat report
[0217/154550.066:ERROR:crash_report_database_win.cc(469)] failed to stat report
[0217/160050.137:ERROR:crash_report_database_win.cc(469)] failed to stat report
[0217/161550.176:ERROR:crash_report_database_win.cc(469)] failed to stat report
[0217/163050.201:ERROR:crash_report_database_win.cc(469)] failed to stat report
[0217/164550.217:ERROR:crash_report_database_win.cc(469)] failed to stat report
[0217/183531.079:ERROR:crash_report_database_win.cc(469)] failed to stat report
[0217/185031.084:ERROR:crash_report_database_win.cc(469)] failed to stat report
[0217/190531.123:ERROR:crash_report_database_win.cc(469)] failed to stat report
[0217/192031.181:ERROR:crash_report_database_win.cc(469)] failed to stat report
[0217/193531.250:ERROR:crash_report_database_win.cc(469)] failed to stat report
[0217/194816.026:ERROR:process_info.cc(359)] UncheckedAllocate
[0217/194816.243:ERROR:crash_report_database_win.cc(469)] failed to stat report
[0217/194816.252:ERROR:crash_report_database_win.cc(469)] failed to stat report
[0217/194816.276:ERROR:crash_report_database_win.cc(469)] failed to stat report
[0217/194816.284:ERROR:crash_report_database_win.cc(469)] failed to stat report
