<svg xmlns="http://www.w3.org/2000/svg" width="20" height="20" viewBox="0 0 20 20">
    <defs>
        <style>
            .cls-1{fill:#152935}.cls-2{fill:#fff}
        </style>
    </defs>
    <g id="Group_335" data-name="Group 335" transform="translate(-1191 -340)">
        <path id="Rectangle_41" d="M0 0h20v20H0z" class="cls-1" data-name="Rectangle 41" transform="translate(1191 340)"/>
        <g id="Group_334" data-name="Group 334" transform="translate(-284 -1419)">
            <path id="Path_116" d="M8 5v5l3-2.5z" class="cls-2" data-name="Path 116" transform="translate(1473 1762)"/>
            <path id="Path_118" d="M8 5v5l3-2.5z" class="cls-2" data-name="Path 118" transform="translate(1476 1762)"/>
            <path id="Path_119" d="M8 5v5l3-2.5z" class="cls-2" data-name="Path 119" transform="translate(1479 1762)"/>
        </g>
    </g>
</svg>
