<svg xmlns="http://www.w3.org/2000/svg" width="18" height="20" viewBox="0 0 18 20">
    <defs>
        <style>
            .cls-1{fill:#152935}.cls-2{fill:#fff}
        </style>
    </defs>
    <g id="Group_81" data-name="Group 81" transform="translate(-993 -407)">
        <path id="Rectangle_44" d="M0 0h18v20H0z" class="cls-1" data-name="Rectangle 44" transform="translate(993 407)"/>
        <path id="Path_13" d="M8 6.241a1.029 1.029 0 0 0-.653.232L4.97 5.223a.756.756 0 0 0 0-.422l2.35-1.238a1.055 1.055 0 0 0 .68.244.954.954 0 0 0 1-.9A.954.954 0 0 0 8 2a.954.954 0 0 0-1 .9.9.9 0 0 0 .03.211L4.68 4.352A1.055 1.055 0 0 0 4 4.108a.954.954 0 0 0-1 .9.954.954 0 0 0 1 .9 1.055 1.055 0 0 0 .68-.244l2.373 1.261a.772.772 0 0 0-.027.2A.931.931 0 0 0 8 8a.931.931 0 0 0 .973-.88A.931.931 0 0 0 8 6.241z" class="cls-2" data-name="Path 13" transform="translate(996 412)"/>
    </g>
</svg>
