<svg xmlns="http://www.w3.org/2000/svg" width="18" height="20" viewBox="0 0 18 20">
    <defs>
        <style>
            .cls-1{fill:#152935}.cls-2{fill:#fff}
        </style>
    </defs>
    <g id="Group_129" data-name="Group 129" transform="translate(-818 -448)">
        <path id="Rectangle_41" d="M0 0h18v20H0z" class="cls-1" data-name="Rectangle 41" transform="translate(818 448)"/>
        <path id="send-email-3" d="M5.963.088a.125.125 0 0 0-.139-.027L.074 2.546a.126.126 0 0 0-.009.226l1.668.886a.062.062 0 0 0 .067-.005l2.574-2.084a.062.062 0 0 1 .084 0 .063.063 0 0 1 0 .084L2.387 4.24a.063.063 0 0 0-.007.069l.883 1.674a.125.125 0 0 0 .111.067.125.125 0 0 0 .11-.075L5.989.227a.126.126 0 0 0-.026-.139z" class="cls-2" transform="translate(824.001 454.95)"/>
    </g>
</svg>
