<svg xmlns="http://www.w3.org/2000/svg" width="17" height="12" viewBox="0 0 17 12">
    <g fill="#FFF" fill-rule="evenodd">
        <path d="M12.134 6.88c-.688 0-1.369.146-1.996.427a.396.396 0 0 0-.147.617 5.892 5.892 0 0 1 1.342 3.356v.02c.012.212.19.379.405.378h4.96a.306.306 0 0 0 .22-.095.299.299 0 0 0 .082-.223c-.176-2.526-2.304-4.485-4.866-4.48z"/>
        <ellipse cx="11.749" cy="3.278" rx="2.844" ry="2.8"/>
        <path d="M10.119 11.36c-.166-2.492-2.23-4.446-4.757-4.502C2.836 6.802.684 8.662.405 11.144a.476.476 0 0 0 .121.375c.093.102.226.16.364.159h8.924a.306.306 0 0 0 .222-.095.299.299 0 0 0 .082-.225l.001.002z"/>
        <ellipse cx="4.868" cy="3.278" rx="2.844" ry="2.8"/>
    </g>
</svg>
