
        digraph turtle_status {
            __start [shape=point]
            __start -> ON_SURFACE
            
            ON_SURFACE -> IN_WATER 
            
            IN_WATER -> ON_SURFACE 
            
        }
    