
        digraph control_mode {
            __start [shape=point]
            __start -> IDLE
            
            IDLE -> MOVING 
            
            MOVING -> IDLE 
            
        }
    