
        digraph sensor {
            __start [shape=point]
            __start -> OFF
            
            OFF -> ON 
            
            ON -> OFF 
            
            ON -> OUT_OF_SERVICE [style=dashed]
            
            OFF -> OUT_OF_SERVICE [style=dashed]
            
        }
    