<?xml version="1.0" encoding="UTF-8" standalone="no"?>
<!-- Created with Inkscape (http://www.inkscape.org/) -->

<svg
   xmlns:dc="http://purl.org/dc/elements/1.1/"
   xmlns:cc="http://creativecommons.org/ns#"
   xmlns:rdf="http://www.w3.org/1999/02/22-rdf-syntax-ns#"
   xmlns:svg="http://www.w3.org/2000/svg"
   xmlns="http://www.w3.org/2000/svg"
   xmlns:sodipodi="http://sodipodi.sourceforge.net/DTD/sodipodi-0.dtd"
   xmlns:inkscape="http://www.inkscape.org/namespaces/inkscape"
   width="6.6318984mm"
   height="6.625607mm"
   viewBox="0 0 23.498853 23.47656"
   id="svg6884"
   version="1.1"
   inkscape:version="0.91 r13725"
   sodipodi:docname="graph-view-oaam-allocations.svg">
  <defs
     id="defs6886" />
  <sodipodi:namedview
     id="base"
     pagecolor="#ffffff"
     bordercolor="#666666"
     borderopacity="1.0"
     inkscape:pageopacity="0.0"
     inkscape:pageshadow="2"
     inkscape:zoom="15.839192"
     inkscape:cx="8.8175243"
     inkscape:cy="12.323162"
     inkscape:document-units="px"
     inkscape:current-layer="layer1"
     showgrid="false"
     fit-margin-top="0"
     fit-margin-left="0"
     fit-margin-right="0"
     fit-margin-bottom="0"
     inkscape:window-width="1280"
     inkscape:window-height="657"
     inkscape:window-x="-8"
     inkscape:window-y="-8"
     inkscape:window-maximized="1" />
  <metadata
     id="metadata6889">
    <rdf:RDF>
      <cc:Work
         rdf:about="">
        <dc:format>image/svg+xml</dc:format>
        <dc:type
           rdf:resource="http://purl.org/dc/dcmitype/StillImage" />
        <dc:title></dc:title>
      </cc:Work>
    </rdf:RDF>
  </metadata>
  <g
     inkscape:label="Ebene 1"
     inkscape:groupmode="layer"
     id="layer1"
     transform="translate(-339.67914,-492.0525)">
    <path
       style="opacity:1;fill:none;fill-opacity:1;stroke:#ffffff;stroke-width:1.00000012;stroke-miterlimit:4;stroke-dasharray:none;stroke-dashoffset:0;stroke-opacity:1"
       d="M 0.97070312 10.634766 L 0.97070312 22.292969 L 10.208984 22.292969 L 14.269531 17.875 L 14.269531 13.238281 L 13.841797 13.238281 C 12.472314 13.238281 11.369141 12.276631 11.369141 11.082031 L 11.369141 10.634766 L 0.97070312 10.634766 z "
       transform="translate(339.67914,492.0525)"
       id="rect4286-1" />
    <path
       style="opacity:1;fill:none;fill-opacity:1;stroke:#ffffff;stroke-width:1.00000012;stroke-miterlimit:4;stroke-dasharray:none;stroke-dashoffset:0;stroke-opacity:1"
       d="m 341.98745,505.86117 c -0.70944,0 -1.28059,0.53929 -1.28059,1.20914 l 0,0.0873 0,3.21779 0,4.09745 2.56118,0 0,-4.09745 0,-3.21779 0,-0.0873 c 0,-0.66985 -0.57113,-1.20914 -1.28059,-1.20914 z"
       id="rect4430-68"
       inkscape:connector-curvature="0"
       inkscape:export-xdpi="21.966198"
       inkscape:export-ydpi="21.966198" />
    <rect
       style="opacity:1;fill:none;fill-opacity:1;stroke:#ffffff;stroke-width:1.00000012;stroke-linecap:round;stroke-linejoin:round;stroke-miterlimit:4;stroke-dasharray:none;stroke-dashoffset:0;stroke-opacity:1"
       id="rect4134"
       width="11.479335"
       height="12.730873"
       x="351.04895"
       y="492.55917"
       ry="2.1563177"
       rx="2.4719906" />
    <path
       style="fill:none;fill-rule:evenodd;stroke:#ffffff;stroke-width:1px;stroke-linecap:butt;stroke-linejoin:miter;stroke-opacity:1"
       d="m 357.54621,499.8717 c -5.42957,0.1894 -9.53331,8.52316 -9.53331,8.52316 m -1.45209,-3.85121 1.07328,3.97748 3.97748,-0.37881"
       id="path4168"
       inkscape:connector-curvature="0"
       sodipodi:nodetypes="ccccc" />
  </g>
</svg>
