#FIG 3.2
Landscape
Center
Inches
Letter  
100.00
Single
-2
1200 2
6 1875 1275 2475 1650
6 1950 1275 2400 1575
4 0 0 100 0 0 8 0.0000 4 105 330 1950 1425 Driver\001
4 0 0 100 0 0 8 0.0000 4 90 450 1950 1575 SYBASE\001
-6
2 2 0 1 0 7 100 0 -1 0.000 0 0 -1 0 0 5
	 1875 1275 2475 1275 2475 1650 1875 1650 1875 1275
-6
6 1875 750 2475 1125
6 1950 750 2475 1050
4 0 0 100 0 0 8 0.0000 4 105 330 1950 900 Driver\001
4 0 0 100 0 0 8 0.0000 4 90 480 1950 1050 ORACLE\001
-6
2 2 0 1 0 7 100 0 -1 0.000 0 0 -1 0 0 5
	 1875 750 2475 750 2475 1125 1875 1125 1875 750
-6
6 1125 675 1650 975
4 0 0 100 0 0 8 0.0000 4 105 525 1125 825 Connexion\001
4 0 0 100 0 0 8 0.0000 4 90 480 1125 975 ORACLE\001
-6
6 600 975 1050 1200
4 0 0 100 0 0 8 0.0000 4 120 450 600 1125 Requetes\001
-6
6 1125 1350 1650 1650
4 0 0 100 0 0 8 0.0000 4 105 525 1125 1500 Connexion\001
4 0 0 100 0 0 8 0.0000 4 90 450 1125 1650 SYBASE\001
-6
6 3450 300 5625 900
6 4125 375 5625 825
1 1 0 1 0 7 100 0 -1 0.000 1 0.0000 4875 600 750 225 4875 600 5625 825
4 0 0 100 0 0 10 0.0000 4 105 1095 4350 675 Serveur ORACLE\001
-6
1 3 0 1 0 7 100 0 0 0.000 1 0.0000 3525 600 53 53 3525 600 3562 638
2 1 0 1 0 7 100 0 -1 0.000 0 0 7 0 0 4
	 3825 300 3525 300 3525 900 3825 900
2 1 0 1 0 7 100 0 -1 0.000 0 0 -1 1 1 2
	1 1 1.00 60.00 120.00
	1 1 1.00 60.00 120.00
	 3600 600 4125 600
-6
6 4125 1650 5625 2100
1 1 0 1 0 7 100 0 -1 0.000 1 0.0000 4875 1875 750 225 4875 1875 5625 2100
4 0 0 100 0 0 10 0.0000 4 105 1080 4350 1950 Serveur SYBASE\001
-6
1 3 0 1 0 7 100 0 0 0.000 1 0.0000 2533 925 53 53 2533 925 2570 963
1 3 0 1 0 7 100 0 0 0.000 1 0.0000 2550 1500 53 53 2550 1500 2587 1538
1 3 0 1 0 7 100 0 0 0.000 1 0.0000 3525 1875 53 53 3525 1875 3562 1913
2 4 0 1 0 7 100 0 -1 0.000 0 0 7 0 0 5
	 2550 1800 2550 675 1725 675 1725 1800 2550 1800
2 1 0 1 0 7 100 0 -1 0.000 0 0 7 1 1 2
	1 1 1.00 60.00 120.00
	1 1 1.00 60.00 120.00
	 1875 1050 1050 1050
2 1 0 1 0 7 100 0 -1 0.000 0 0 7 1 1 2
	1 1 1.00 60.00 120.00
	1 1 1.00 60.00 120.00
	 1875 1275 1050 1275
2 4 0 1 0 7 100 0 -1 0.000 0 0 7 0 0 5
	 2700 2175 2700 375 450 375 450 2175 2700 2175
2 1 0 1 0 7 100 0 -1 0.000 0 0 7 0 0 4
	 3825 1575 3525 1575 3525 2175 3825 2175
2 1 0 1 0 7 100 0 -1 0.000 0 0 -1 1 1 2
	1 1 1.00 60.00 120.00
	1 1 1.00 60.00 120.00
	 3600 1875 4125 1875
2 1 0 1 0 7 100 0 -1 0.000 0 0 -1 0 0 2
	 2550 1500 3525 1875
2 1 0 1 0 7 100 0 -1 0.000 0 0 -1 0 0 2
	 2550 900 3525 600
4 0 0 100 0 0 8 0.0000 4 135 780 1725 600 DriverManager\001
4 0 0 100 0 0 8 0.0000 4 120 225 600 1275 SQL\001
4 0 0 100 0 0 10 0.0000 4 105 420 2925 1350 Reseau\001
4 0 0 100 0 0 10 0.0000 4 105 1185 4125 2475 Les SGBD serveurs\001
4 0 0 100 0 0 10 0.0000 4 135 1425 900 2475 Applet Java avec JDBC\001
