#FIG 3.2
Landscape
Center
Inches
A4      
100.00
Single
-2
1200 2
6 825 4050 2100 4800
2 2 0 1 -1 7 0 0 -1 0.000 0 0 0 0 0 5
	 825 4050 2100 4050 2100 4800 825 4800 825 4050
4 0 0 100 0 -1 10 0.0000 4 135 1095 975 4275 Impitoyable 1992\001
4 0 0 100 0 -1 10 0.0000 4 135 795 975 4500 Shining 1980\001
4 0 0 100 0 -1 10 0.0000 4 105 735 975 4725 Smoke 1995\001
-6
6 825 825 2100 1725
2 2 0 1 -1 7 0 0 -1 0.000 0 0 0 0 0 5
	 825 825 2100 825 2100 1725 825 1725 825 825
4 0 0 100 0 -1 10 0.0000 4 105 1125 900 1050 Jurassic Park 1992\001
4 0 0 100 0 -1 10 0.0000 4 105 1035 900 1275 Twin Peaks 1990\001
4 0 0 100 0 -1 10 0.0000 4 135 990 900 1500 Easy Rider 1969\001
-6
6 2550 3750 3975 4725
2 2 0 1 -1 7 0 0 -1 0.000 0 0 0 0 0 5
	 2550 3750 3975 3750 3975 4725 2550 4725 2550 3750
4 0 0 100 0 -1 10 0.0000 4 105 1005 2625 3975 Manhattan 1979\001
4 0 0 100 0 -1 10 0.0000 4 135 1050 2625 4200 Metropolis 1926\001
4 0 0 100 0 -1 10 0.0000 4 105 1005 2625 4425 Casablanca 1942\001
4 0 0 100 0 -1 10 0.0000 4 135 1275 2625 4650 Reservoir Dogs 1992\001
-6
2 1 0 1 -1 7 0 0 -1 0.000 0 0 -1 1 0 3
	1 1 1.00 60.00 120.00
	 600 3300 1575 3300 1575 4050
2 1 0 1 -1 7 0 0 -1 0.000 0 0 -1 1 0 3
	1 1 1.00 60.00 120.00
	 600 3000 2775 3000 2775 3750
2 1 0 1 -1 7 0 0 -1 0.000 0 0 -1 1 0 2
	1 1 1.00 60.00 120.00
	 600 2700 3900 2700
2 1 0 1 -1 7 0 0 -1 0.000 0 0 -1 1 0 3
	1 1 1.00 60.00 120.00
	 600 2400 3525 2400 3525 1725
2 1 0 1 -1 7 0 0 -1 0.000 0 0 -1 1 0 3
	1 1 1.00 60.00 120.00
	 600 2100 1575 2100 1575 1725
2 1 0 1 -1 7 0 0 -1 0.000 0 0 -1 0 0 2
	 226 2251 601 2251
2 1 0 1 -1 7 0 0 -1 0.000 0 0 -1 0 0 2
	 226 2551 601 2551
2 1 0 1 -1 7 0 0 -1 0.000 0 0 -1 0 0 2
	 226 2851 601 2851
2 1 0 1 -1 7 0 0 -1 0.000 0 0 -1 0 0 2
	 226 3151 601 3151
2 1 0 1 -1 7 0 0 -1 0.000 0 0 -1 0 0 2
	 226 3451 601 3451
2 2 0 1 -1 7 0 0 -1 0.000 0 0 0 0 0 5
	 226 1951 601 1951 601 3451 226 3451 226 1951
2 2 0 1 -1 7 0 0 -1 0.000 0 0 0 0 0 5
	 2475 825 3900 825 3900 1725 2475 1725 2475 825
2 2 0 1 -1 7 0 0 -1 0.000 0 0 0 0 0 5
	 4425 3750 5700 3750 5700 4500 4425 4500 4425 3750
2 1 0 1 0 7 100 0 -1 0.000 0 0 -1 1 0 2
	1 1 1.00 60.00 120.00
	 3975 4125 4425 4125
2 2 0 1 -1 7 0 0 -1 0.000 0 0 0 0 0 5
	 3900 2175 5100 2175 5100 3000 3900 3000 3900 2175
4 0 0 100 0 0 10 0.0000 4 105 75 376 2176 0\001
4 0 0 100 0 0 10 0.0000 4 105 75 376 2476 1\001
4 0 0 100 0 0 10 0.0000 4 105 75 376 2776 2\001
4 0 0 100 0 0 10 0.0000 4 105 75 376 3076 3\001
4 0 0 100 0 0 10 0.0000 4 105 75 376 3376 4\001
4 0 0 100 0 -1 10 0.0000 4 135 1155 2625 1275 Underground 1995\001
4 0 0 100 0 0 10 0.0000 4 150 660 150 3675 R\351pertoire\001
4 0 0 100 0 -1 10 0.0000 4 105 1125 4575 3975 Citizen Kane 1941\001
4 0 0 100 0 -1 10 0.0000 4 135 825 4050 2625 Vertigo 1958\001
4 0 0 100 0 -1 10 0.0000 4 135 960 4050 2850 Greystoke 1984\001
