#FIG 3.2
Portrait
Center
Inches
Letter  
100.00
Single
-2
1200 2
1 3 0 1 -1 -1 0 0 -1 0.000 1 0.0000 3442 1810 66 66 3442 1810 3508 1877
1 3 0 1 -1 -1 0 0 -1 0.000 1 0.0000 4203 1810 66 66 4203 1810 4270 1877
1 3 0 1 -1 -1 0 0 -1 0.000 1 0.0000 5013 1810 66 66 5013 1810 5079 1877
1 3 0 1 -1 -1 0 0 -1 0.000 1 0.0000 5917 1810 66 66 5917 1810 5984 1877
1 3 0 1 -1 -1 0 0 -1 0.000 1 0.0000 4613 1268 88 88 4613 1268 4657 1192
2 2 0 2 -1 -1 0 0 -1 0.000 0 0 7 0 0 5
	 2511 2727 2511 633 510 633 510 2727 2511 2727
2 2 0 1 0 7 1 0 10 1.000 0 0 7 0 0 5
	 844 1680 844 1538 558 1538 558 1680 844 1680
2 2 0 1 0 7 1 0 10 1.000 0 0 7 0 0 5
	 2130 1871 2130 1680 1749 1680 1749 1871 2130 1871
2 2 0 1 0 7 1 0 10 1.000 0 0 7 0 0 5
	 1559 1014 1559 776 1320 776 1320 1014 1559 1014
2 2 0 1 0 7 1 0 10 1.000 0 0 7 0 0 5
	 1130 1490 1130 1014 986 1014 986 1490 1130 1490
2 2 0 1 0 7 1 0 10 1.000 0 0 7 0 0 5
	 939 1156 939 1014 654 1014 654 1156 939 1156
2 2 0 1 0 7 1 0 10 1.000 0 0 7 0 0 5
	 1225 871 1225 728 844 728 844 871 1225 871
2 2 0 1 0 7 1 0 10 1.000 0 0 7 0 0 5
	 796 871 796 680 605 680 605 871 796 871
2 2 2 1 0 7 0 0 -1 1.000 0 0 7 0 0 5
	 2082 2680 558 2680 558 1538 2082 1538 2082 2680
2 2 2 1 0 7 0 0 -1 1.000 0 0 7 0 0 5
	 1225 1490 605 1490 605 680 1225 680 1225 1490
2 2 2 1 0 7 0 0 -1 1.000 0 0 7 0 0 5
	 1749 1680 2462 1680 2462 680 1749 680 1749 1680
2 1 0 1 -1 -1 0 0 -1 0.000 0 0 -1 0 0 2
	 4525 1275 3487 1762
2 1 0 1 -1 -1 0 0 -1 0.000 0 0 -1 0 0 2
	 4679 1334 5025 1747
2 1 0 1 -1 -1 0 0 -1 0.000 0 0 -1 0 0 2
	 4575 1335 4215 1755
2 1 0 1 -1 -1 0 0 -1 0.000 0 0 -1 0 0 2
	 4710 1270 5895 1747
2 2 0 1 0 7 100 0 10 0.000 0 0 7 0 0 5
	 891 2680 891 2537 605 2537 605 2680 891 2680
2 2 0 1 0 7 100 0 10 0.000 0 0 7 0 0 5
	 1462 2490 1462 2300 1081 2300 1081 2490 1462 2490
2 2 2 1 0 7 0 0 -1 1.000 0 0 7 0 0 5
	 2130 1871 1320 1871 1320 776 2130 776 2130 1871
2 2 0 1 0 7 100 0 10 0.000 0 0 7 0 0 5
	 1891 1585 1891 824 1654 824 1654 1585 1891 1585
2 2 0 1 0 7 100 0 10 0.000 0 0 7 0 0 5
	 2272 919 2272 680 1939 680 1939 919 2272 919
2 2 0 1 0 7 100 0 10 0.000 0 0 7 0 0 5
	 2082 2109 2082 1966 1701 1966 1701 2109 2082 2109
2 2 0 1 0 7 99 0 10 0.000 0 0 7 0 0 5
	 2367 1443 2367 1251 1749 1251 1749 1443 2367 1443
2 2 0 1 0 7 100 0 10 0.000 0 0 7 0 0 5
	 2462 1680 2462 1395 2272 1395 2272 1680 2462 1680
4 0 -1 0 0 0 8 0.0000 4 90 60 654 824 1\001
4 0 -1 0 0 0 8 0.0000 4 90 120 1986 871 11\001
4 0 -1 0 0 0 8 0.0000 4 90 120 2320 1585 13\001
4 0 -1 0 0 0 8 0.0000 4 90 60 1796 1824 9\001
4 0 -1 0 0 0 8 0.0000 4 90 120 1939 1395 12\001
4 0 -1 0 0 0 8 0.0000 4 90 120 1367 919 14\001
4 0 -1 0 0 0 8 0.0000 4 90 60 1034 1300 6\001
4 0 -1 0 0 0 8 0.0000 4 90 60 1796 1109 8\001
4 0 -1 0 0 0 8 0.0000 4 90 60 986 824 5\001
4 0 -1 0 0 0 8 0.0000 4 90 120 1796 2061 10\001
4 0 -1 0 0 0 8 0.0000 4 90 60 654 1633 3\001
4 0 -1 0 0 0 8 0.0000 4 90 60 749 1109 2\001
4 0 -1 0 0 1 10 0.0000 4 105 75 1950 2550 b\001
4 0 -1 0 0 1 10 0.0000 4 105 75 2325 1050 d\001
4 0 -1 0 0 1 10 0.0000 4 75 60 1425 1275 c\001
4 0 -1 0 0 1 10 0.0000 4 75 75 675 1425 a\001
4 0 -1 0 0 1 10 0.0000 4 105 90 2625 2400 R\001
4 0 0 1 0 -1 8 0.0000 4 90 60 654 2632 4\001
4 0 0 1 0 -1 8 0.0000 4 90 60 1130 2442 7\001
4 0 -1 0 0 1 10 0.0000 4 105 90 4537 1049 R\001
4 0 0 1 0 -1 8 0.0000 4 120 420 3300 2100 [1,2,5,6]\001
4 0 0 1 0 -1 8 0.0000 4 120 480 4050 2100 [3,4,7,10]\001
4 0 0 1 0 -1 8 0.0000 4 120 390 4875 2100 [8,9,14]\001
4 0 0 1 0 -1 8 0.0000 4 120 510 5625 2100 [11,12,13]\001
4 0 -1 0 0 1 10 0.0000 4 105 75 5700 1875 d\001
4 0 -1 0 0 1 10 0.0000 4 75 60 4800 1875 c\001
4 0 -1 0 0 1 10 0.0000 4 105 75 3975 1875 b\001
4 0 -1 0 0 1 10 0.0000 4 75 75 3225 1875 a\001
