#FIG 3.2  Produced by xfig version 3.2.5-alpha5
Landscape
Center
Metric
A4      
100.00
Single
-2
1200 2
2 1 0 1 0 7 50 -1 -1 0.000 0 0 -1 1 0 2
	1 1 1.00 60.00 120.00
	 180 1890 5490 1890
2 1 0 1 0 7 50 -1 -1 0.000 0 0 7 0 0 2
	 540 1125 2835 1125
2 1 0 1 0 7 50 -1 -1 0.000 0 0 -1 0 0 2
	 495 1800 495 1980
2 1 0 1 0 7 50 -1 -1 0.000 0 0 -1 0 0 2
	 540 1035 540 1215
2 1 0 1 0 7 50 -1 -1 0.000 0 0 -1 0 0 2
	 900 1035 900 1215
2 1 0 1 0 7 50 -1 -1 0.000 0 0 -1 0 0 2
	 1395 1035 1395 1215
2 1 0 1 0 7 50 -1 -1 0.000 0 0 -1 0 0 2
	 2070 1800 2070 1980
2 1 0 1 0 7 50 -1 -1 0.000 0 0 -1 0 0 2
	 2610 1800 2610 1980
2 1 0 1 0 7 50 -1 -1 0.000 0 0 7 0 0 2
	 3060 360 4950 360
2 1 0 1 0 7 50 -1 -1 0.000 0 0 -1 0 0 2
	 3285 270 3285 450
2 1 0 1 0 7 50 -1 -1 0.000 0 0 -1 0 0 2
	 3780 270 3780 450
2 1 0 1 0 7 50 -1 -1 0.000 0 0 -1 0 0 2
	 4275 270 4275 450
2 1 0 1 0 7 50 -1 -1 0.000 0 0 -1 0 0 2
	 4770 270 4770 450
2 1 0 1 0 7 50 -1 -1 0.000 0 0 -1 0 0 2
	 4950 270 4950 450
2 1 0 1 0 7 50 -1 -1 0.000 0 0 -1 0 0 2
	 3060 270 3060 450
2 1 0 1 0 7 50 -1 -1 0.000 0 0 -1 0 0 2
	 4275 1800 4275 1980
2 1 0 1 0 7 50 -1 -1 0.000 0 0 -1 0 0 2
	 4770 1800 4770 1980
2 1 0 1 0 7 50 -1 -1 0.000 0 0 -1 0 0 2
	 2835 1035 2835 1215
2 1 0 1 0 7 50 -1 -1 0.000 0 0 -1 0 0 2
	 2070 1035 2070 1215
2 1 0 1 0 7 50 -1 -1 0.000 0 0 -1 0 0 2
	 2610 1035 2610 1215
4 0 0 50 -1 0 10 0.0000 6 135 450 135 2115 $s=50$\001
4 0 0 50 -1 0 10 0.0000 6 165 975 135 2340 $c_1=0; c_2=0$\001
4 0 0 50 -1 0 10 0.0000 6 165 540 720 945 $r_1(s)$\001
4 0 0 50 -1 0 10 0.0000 6 165 690 1215 945 $r_1(c_1)$\001
4 0 0 50 -1 0 10 0.0000 6 135 450 720 1395 $s=50$\001
4 0 0 50 -1 0 10 0.0000 6 165 390 90 1170 $T_1$\001
4 0 0 50 -1 0 10 0.0000 6 135 450 1890 2115 $s=45$\001
4 0 0 50 -1 0 10 0.0000 6 165 525 2430 2115 $c_1=5$\001
4 0 0 50 -1 0 10 0.0000 6 165 540 3105 180 $r_2(s)$\001
4 0 0 50 -1 0 10 0.0000 6 165 690 3600 180 $r_2(c_2)$\001
4 0 0 50 -1 0 10 0.0000 6 165 600 4050 180 $w_2(s)$\001
4 0 0 50 -1 0 10 0.0000 6 165 750 4545 180 $w_2(c_2)$\001
4 0 0 50 -1 0 10 0.0000 6 135 450 3105 630 $s=45$\001
4 0 0 50 -1 0 10 0.0000 6 165 390 2565 405 $T_2$\001
4 0 0 50 -1 0 10 0.0000 6 165 525 4635 2115 $c_2=2$\001
4 0 0 50 -1 0 10 0.0000 6 150 405 5265 2115 Temps\001
4 0 0 50 -1 0 10 0.0000 6 135 450 4140 2115 $s=43$\001
4 0 0 50 -1 0 10 0.0000 6 135 585 4005 630 $s=45-2$\001
4 0 0 50 -1 0 10 0.0000 6 165 600 1845 945 $w_1(s)$\001
4 0 0 50 -1 0 10 0.0000 6 165 750 2385 945 $w_1(c_1)$\001
4 0 0 50 -1 0 10 0.0000 6 135 585 1755 1395 $s=50-5$\001
