#FIG 3.2  Produced by xfig version 3.2.5-alpha5
Landscape
Center
Inches
Letter  
100.00
Single
-2
1200 2
2 2 1 1 -1 7 0 0 -1 4.000 0 0 0 0 0 5
	 1875 375 2550 375 2550 1125 1875 1125 1875 375
2 2 0 1 -1 7 0 0 -1 0.000 0 0 0 0 0 5
	 225 300 1575 300 1575 1350 225 1350 225 300
2 2 0 1 -1 7 0 0 -1 0.000 0 0 0 0 0 5
	 1876 301 3226 301 3226 1351 1876 1351 1876 301
2 2 0 1 -1 7 0 0 -1 0.000 0 0 0 0 0 5
	 3526 301 4876 301 4876 1351 3526 1351 3526 301
2 2 1 1 -1 7 0 0 -1 4.000 0 0 0 0 0 5
	 2400 525 3150 525 3150 1350 2400 1350 2400 525
2 2 1 1 -1 7 0 0 -1 4.000 0 0 0 0 0 5
	 3675 825 4800 825 4800 1350 3675 1350 3675 825
2 2 1 1 -1 7 0 0 -1 4.000 0 0 0 0 0 5
	 3525 375 4275 375 4275 750 3525 750 3525 375
2 2 0 1 0 7 1 0 10 0.000 0 0 7 0 0 5
	 225 375 450 375 450 600 225 600 225 375
2 2 0 1 0 7 1 0 10 0.000 0 0 7 0 0 5
	 750 525 975 525 975 750 750 750 750 525
2 2 0 1 0 7 1 0 10 0.000 0 0 7 0 0 5
	 600 900 900 900 900 975 600 975 600 900
2 2 0 1 0 7 1 0 10 0.000 0 0 7 0 0 5
	 375 825 450 825 450 1125 375 1125 375 825
2 2 0 1 0 7 1 0 10 0.000 0 0 7 0 0 5
	 1876 376 2101 376 2101 601 1876 601 1876 376
2 2 0 1 0 7 1 0 10 0.000 0 0 7 0 0 5
	 2400 525 2626 525 2626 751 2400 751 2400 525
2 2 0 1 0 7 1 0 10 0.000 0 0 7 0 0 5
	 2251 901 2551 901 2551 976 2251 976 2251 901
2 2 0 1 0 7 1 0 10 0.000 0 0 7 0 0 5
	 2026 826 2101 826 2101 1126 2026 1126 2026 826
2 2 0 1 0 7 1 0 10 0.000 0 0 7 0 0 5
	 3526 376 3751 376 3751 601 3526 601 3526 376
2 2 0 1 0 7 1 0 10 0.000 0 0 7 0 0 5
	 4050 525 4276 525 4276 751 4050 751 4050 525
2 2 0 1 0 7 1 0 10 0.000 0 0 7 0 0 5
	 3901 901 4201 901 4201 976 3901 976 3901 901
2 2 0 1 0 7 1 0 10 0.000 0 0 7 0 0 5
	 3676 826 3751 826 3751 1126 3676 1126 3676 826
2 2 0 1 0 7 1 0 10 0.000 0 0 7 0 0 5
	 4726 1201 4801 1201 4801 1351 4726 1351 4726 1201
2 2 0 1 0 7 1 0 10 0.000 0 0 7 0 0 5
	 3076 1201 3151 1201 3151 1351 3076 1351 3076 1201
2 2 0 1 0 7 1 0 10 0.000 0 0 7 0 0 5
	 1425 1200 1500 1200 1500 1350 1425 1350 1425 1200
4 0 0 105 0 1 10 0.0000 4 105 105 525 450 A\001
4 0 0 105 0 1 10 0.0000 4 105 90 1425 1125 B\001
4 0 0 105 0 0 10 0.0000 4 105 1080 300 1650 Bloc d'un arbre-R\001
4 0 0 105 0 0 10 0.0000 4 165 1245 1950 1650 Premi\350re possibilit\351\001
4 0 0 105 0 0 10 0.0000 4 165 1170 3675 1650 Seconde possibilit\351\001
