[
    {
        "questions": [
            "hoe kan ik ictivity bereiken",
            "hoe kan ik de helpdesk bereiken",
            "hoe bereik ik de helpdesk"
        ],
        "answer": "Het Ictivity Servicecenter is bereikbaar via 088-4284814 (ma-vr 8:00-18:00) en op het mail adres servicecenter@ictivity.nl Je kunt ook een melding maken via Ictivity Service Center (kies voor automatisch inloggen).",
        "enrichment": {
            "actions": [
                {
                    "type": "Action.OpenUrl",
                    "title": "Ga naar Ictivity Servicecenter",
                    "url": "https://ictivity.topdesk.net/tas/public/"
                }
            ]
        },
        "category": "Ondersteuning",
        "alias": "ondersteuning",
        "id": 0
    },
    {
        "questions": [
            "heeft welten een helpdesk"
        ],
        "answer": "Binnen onze organisatie maken we gebruik van de helpdesk van Ictivity. Het Ictivity Servicecenter is bereikbaar via 088-4284814 (ma-vr 8:00-18:00) en op het mail adres servicecenter@ictivity.nl Je kunt ook een melding maken via Ictivity Servicecenter (kies voor automatisch inloggen).",
        "enrichment": {
            "actions": [
                {
                    "type": "Action.OpenUrl",
                    "title": "Ga naar Ictivity Servicecenter",
                    "url": "https://ictivity.topdesk.net/tas/public/"
                }
            ]
        },
        "category": "Ondersteuning",
        "alias": "ondersteuning",
        "id": 1
    },
    {
        "questions": [
            "wat zijn de openingstijden van ictivity",
            "wat is het email adres van de helpdesk",
            "wat is het e-mail adres van de helpdesk",
            "wat zijn de openingstijden van de helpdesk",
            "wat is het email adres van ictivity",
            "wat is het e-mail adres van ictivity",
            "wat zijn de contactgegevens van ictivity"
        ],
        "answer": "Het Ictivity Servicecenter is bereikbaar via 088-4284814 (ma-vr 8:00-18:00) en op het mail adres servicecenter@ictivity.nl Je kunt ook een melding maken via Ictivity Servicecenter (kies voor automatisch inloggen).",
        "enrichment": {
            "actions": [
                {
                    "type": "Action.OpenUrl",
                    "title": "Ga naar Ictivity Servicecenter",
                    "url": "https://ictivity.topdesk.net/tas/public/"
                }
            ]
        },
        "category": "Ondersteuning",
        "alias": "ondersteuning",
        "id": 2
    },
    {
        "questions": [
            "waar kan ik mijn wijzigingsverzoek terugzien",
            "waar kan ik mijn ticket terugzien",
            "hoe zie ik mijn ticket terug"
        ],
        "answer": "Je kunt je ticket en/of wijzigingsverzoek terugzien in het self sevice portaal van Ictivity. Deze kan je benaderen via Ictivity Servicecenter (kies voor automatisch inloggen). Het is tevens mogelijk om telefonisch contact op te nemen via 088-4284814 (ma-vr 8:00-18:00) en op het mail adres servicecenter@ictivity.nl",
        "enrichment": {
            "actions": [
                {
                    "type": "Action.OpenUrl",
                    "title": "Ga naar Ictivity Servicecenter",
                    "url": "https://ictivity.topdesk.net/tas/public/"
                }
            ]
        },
        "category": "Ondersteuning",
        "alias": "ondersteuning",
        "id": 3
    },
    {
        "questions": [
            "hoe maak ik een ticket aan"
        ],
        "answer": "Binnen onze organisatie maken we gebruik van de helpdesk van ictivity. Daar kan je een ticket aanmaken. Het Ictivity Servicecenter is bereikbaar via 088-4284814 (ma-vr 8:00-18:00) en op het mail adres servicecenter@ictivity.nl Je kunt ook een melding maken via Ictivity Servicecenter (kies voor automatisch inloggen).",
        "enrichment": {
            "actions": [
                {
                    "type": "Action.OpenUrl",
                    "title": "Ga naar Ictivity Servicecenter",
                    "url": "https://ictivity.topdesk.net/tas/public/"
                }
            ]
        },
        "category": "Ondersteuning",
        "alias": "ondersteuning",
        "id": 4
    },
    {
        "questions": [
            "hoe doe ik een wijzigingsverzoek",
            "hoe dien ik een wijzigingsverzoek in",
            "waar dien ik een wijzigingsverzoek in"
        ],
        "answer": "Binnen onze organisatie maken we gebruik van de helpdesk van ictivity. Daar kan je een wijzigingsverzoek indienen. Het Ictivity Servicecenter is bereikbaar via 088-4284814 (ma-vr 8:00-18:00) en op het mail adres servicecenter@ictivity.nl Je kunt ook een melding maken via Ictivity Servicecenter (kies voor automatisch inloggen).",
        "enrichment": {
            "actions": [
                {
                    "type": "Action.OpenUrl",
                    "title": "Ga naar Ictivity Servicecenter",
                    "url": "https://ictivity.topdesk.net/tas/public/"
                }
            ]
        },
        "category": "Ondersteuning",
        "alias": "ondersteuning",
        "id": 5
    },
    {
        "questions": [
            "waar kan ik incidenten melden"
        ],
        "answer": "Binnen onze organisatie maken we gebruik van de helpdesk van Ictivity. Daar kan je een ticket rondom het incident indienen. Het Ictivity Servicecenter is bereikbaar via 088-4284814 (ma-vr 8:00-18:00) en op het mail adres servicecenter@ictivity.nl Je kunt ook een melding maken via Ictivity Servicecenter (kies voor automatisch inloggen).",
        "enrichment": {
            "actions": [
                {
                    "type": "Action.OpenUrl",
                    "title": "Ga naar Ictivity Servicecenter",
                    "url": "https://ictivity.topdesk.net/tas/public/"
                }
            ]
        },
        "category": "Ondersteuning",
        "alias": "ondersteuning",
        "id": 6
    },
    {
        "questions": [
            "hoe kan ik een e-coach aanvragen"
        ],
        "answer": "Een eCoach aanvraag doe je via het daarvoor bestemde formulier, deze kan je terugvinden op de hoofdpagina van de portal of via onderstaande link.",
        "enrichment": {
            "actions": [
                {
                    "type": "Action.OpenUrl",
                    "title": "Ga naar de eCoach",
                    "url": "https://forms.office.com/Pages/ResponsePage.aspx?id=klXwg6je-k-oGyxWD-a_M4lPwcC0U7tLrVhJ8hBQNP5UNDZWR0lTUFQ3QkZDNUdaME5CSjlZTUlWWi4u"
                }
            ]
        },
        "category": "Ondersteuning",
        "alias": "ondersteuning",
        "id": 7
    },
    {
        "questions": [
            "waar kan de e-coach mij bij helpen",
            "wat is een e-coach",
            "wat kan de e-coach voor mij betekenen",
            "welke meerwaarde heeft een e-coach",
            "wat doet de e-coach",
            "wat kan een e-coach mij bieden"
        ],
        "answer": "De eCoach heeft als doel jou te helpen bij uitdagingen die Microsoft gerelateerd zijn, heb je bijvoorbeeld een vraag over een functie binnen Word of Excel, dan ben je bij de eCoach aan het juiste adres!",
        "category": "Ondersteuning",
        "alias": "ondersteuning",
        "id": 8
    },
    {
        "questions": [
            "waar vind ik de e-coach"
        ],
        "answer": "Een eCoach aanvraag doe je via het daarvoor bestemde formulier, deze kan je terugvinden op de hoofdpagina van de portal of via onderstaande link",
        "enrichment": {
            "actions": [
                {
                    "type": "Action.OpenUrl",
                    "title": "Ga naar de eCoach",
                    "url": "https://forms.office.com/Pages/ResponsePage.aspx?id=klXwg6je-k-oGyxWD-a_M4lPwcC0U7tLrVhJ8hBQNP5UNDZWR0lTUFQ3QkZDNUdaME5CSjlZTUlWWi4u"
                }
            ]
        },
        "category": "Ondersteuning",
        "alias": "ondersteuning",
        "id": 9
    },
    {
        "questions": [
            "mag ik gebruik maken van de e-coach"
        ],
        "answer": "Alle collega's binnen Welten mogen gebruikmaken van de eCoach, vul het formulier in en plan een sessie of training.",
        "enrichment": {
            "actions": [
                {
                    "type": "Action.OpenUrl",
                    "title": "Ga naar de eCoach",
                    "url": "https://forms.office.com/Pages/ResponsePage.aspx?id=klXwg6je-k-oGyxWD-a_M4lPwcC0U7tLrVhJ8hBQNP5UNDZWR0lTUFQ3QkZDNUdaME5CSjlZTUlWWi4u"
                }
            ]
        },
        "category": "Ondersteuning",
        "alias": "ondersteuning",
        "id": 10
    },
    {
        "questions": [
            "Ik heb een vraag over IT"
        ],
        "answer": "Wat leuk, waar kan ik je mee helpen? Probeer het onderwerp duidelijk te specificeren zodat ik het beste antwoord voor je kan vinden.",
        "category": "Ondersteuning",
        "alias": "ondersteuning",
        "id": 11
    },
    {
        "questions": [
            "hoe vraag ik een IT gerelateerde training aan"
        ],
        "answer": "In jouw opleidingsportaal vind je verschillende trainingen en cursussen terug die tot je beschikking staan. Ga naar https://welten.dukers-baelemans.nl/ en klik bovenaan op ontdek om te kijken wat interessant is voor jou. Heb je interesse in een andere training, dan is misschien de eCoach iets voor jou.",
        "enrichment": {
            "actions": [
                {
                    "type": "Action.OpenUrl",
                    "title": "Ga naar de opleidingsportaal",
                    "url": "https://welten.dukers-baelemans.nl/"
                }
            ]
        },
        "category": "Ondersteuning",
        "alias": "ondersteuning",
        "id": 12
    },
    {
        "questions": [
            "kan ik extra hulp krijgen rondom MS teams",
            "waar vind ik de trainingen rondom ms teams",
            "waar vind ik de trainingen rondom sharepoint",
            "waar vind ik de trainingen rondom excel",
            "waar vind ik de trainingen rondom onedrive"
        ],
        "answer": "Voor vragen met betrekking tot Microsoft-gerelateerde producten bieden wij de eCoach aan. De eCoach heeft als doel jou te helpen bij uitdagingen die Microsoft gerelateerd zijn, heb je bijvoorbeeld een vraag over een functie binnen Word of Excel, dan ben je bij de eCoach aan het juiste adres!",
        "category": "Ondersteuning",
        "alias": "ondersteuning",
        "id": 13
    },
    {
        "questions": [
            "welke it trainingen zijn er",
            "waar vind ik de trainingen betreft de gebruikte applicaties binnen welten",
            "zijn er binnen welten trainingen om te leren hoe ik met de applicaties moet werken"
        ],
        "answer": "In jouw opleidingsportaal vind je verschillende trainingen en cursussen terug die tot je beschikking staan. Ga naar https://welten.dukers-baelemans.nl/ en klik bovenaan op ontdek om te kijken wat interessant is voor jou.",
        "enrichment": {
            "actions": [
                {
                    "type": "Action.OpenUrl",
                    "title": "Ga naar de opleidingsportaal",
                    "url": "https://welten.dukers-baelemans.nl/"
                }
            ]
        },
        "category": "Ondersteuning",
        "alias": "ondersteuning",
        "id": 14
    },
    {
        "questions": [
            "autorisatie",
            "afas rechten",
            "toegang afas",
            "afas autorisatie"
        ],
        "answer": "Autorisatie in AFAS is op functieniveau is volledig geautomatiseerd. Wanneer je tijdelijk aanvullende autorisatie nodig hebt, kun je deze aanvragen via Mijn Welten Portal > Mijn Welten > Tijdelijke autorisatierol. Voor autorisatieverzoeken van andere applicaties maak je een ticket aan bij Ictivity via onderstaande link",
        "enrichment": {
            "actions": [
                {
                    "type": "Action.OpenUrl",
                    "title": "Ticket aanmaken",
                    "url": "https://ictivity.topdesk.net/tas/public/"
                }
            ]
        },
        "category": "Autorisatie",
        "alias": "autorisatie",
        "id": 15
    },
    {
        "questions": [
            "AFAS Pocket app",
            "omgevingssleutel",
            "pocket app",
            "PocketApp"
        ],
        "answer": "Met de AFAS Pocket App kun je diverse zaken regelen en inzien vanaf je smartphone (zoals het indienen van een declaratie of het opvragen van je loonstrook). De installatieinstructie vind je via onderstaande link.",
        "enrichment": {
            "actions": [
                {
                    "type": "Action.OpenUrl",
                    "title": "Instructies voor installatie",
                    "url": "https://62857.afasinsite.nl/portal-insite-prs/installatie-pocket-app"
                }
            ]
        },
        "category": "Afas",
        "alias": "afas",
        "id": 16
    },
    {
        "questions": [
            "AFAS App"
        ],
        "answer": "Met de AFAS Pocket App kun je diverse zaken regelen en inzien vanaf je smartphone. De installatieinstructie vind je via onderstaande link.",
        "enrichment": {
            "actions": [
                {
                    "type": "Action.OpenUrl",
                    "title": "Instructies voor installatie",
                    "url": "https://62857.afasinsite.nl/portal-insite-prs/installatie-pocket-app"
                }
            ]
        },
        "category": "Afas",
        "alias": "afas",
        "id": 17
    },
    {
        "questions": [
            "AFAS PCC",
            "PCC",
            "Profit Communication Center",
            "afas vastleggen knop in outlook",
            "AFAS knop in Outlook",
            "AFAS knop in Office"
        ],
        "answer": "Met Profit Communication Center (PCC) kun je documenten en e-mails vastleggen in AFAS via Microsoft Office applicaties en documenten in AFAS openen in MS Office applicaties. De software staat reeds ge\u00efnstalleerd op je computer. De instructie voor het koppelen met AFAS vind je via onderstaande link.",
        "enrichment": {
            "actions": [
                {
                    "type": "Action.OpenUrl",
                    "title": "Instructies voor koppelen",
                    "url": "https://62857.afasinsite.nl/portal-insite-prs/installatie-profit-communication-center-pcc"
                }
            ]
        },
        "category": "Afas",
        "alias": "afas",
        "id": 18
    },
    {
        "questions": [
            "AFAS Profit sessie herstarten",
            "Inlogproblemen AFAS",
            "AFAS vastgelopen",
            "AFAS werkt niet meer",
            "AFAS geblokkeerd",
            "AFAS Profit wil niet openen",
            "AFAS Profit opent niet",
            "AFAS storing",
            "Ik kan niet inloggen in AFAS",
            "AFAS start niet op",
            "AFAS heeft een storing",
            "Er is een AFAS storing"
        ],
        "answer": "Wanneer AFAS Profit niet meer reageert, moet de sessie opnieuw opgestart worden. De instructie vind via onderstaande link. Je kunt ook kijken op https://afasstatus.nl/ of er een algemene storing is. Lost dit het probleem niet op, neem dan contact op met Ictivity ServiceCenter op 088-4284814 (ma-vr 8:00-18:00).",
        "enrichment": {
            "actions": [
                {
                    "type": "Action.OpenUrl",
                    "title": "Instructies voor herstarten",
                    "url": "https://62857.afasinsite.nl/portal-insite-prs/afas-profit-herstarten"
                }
            ]
        },
        "category": "Afas",
        "alias": "afas",
        "id": 19
    },
    {
        "questions": [
            "afas verzoek",
            "afas vraag",
            "afas wens",
            "afas probleem",
            "afas change",
            "afas user story"
        ],
        "answer": "Verzoeken voor aanpassingen in AFAS kunnen worden ingediend via de SCRUM Portal in de vorm van een User Story.",
        "enrichment": {
            "actions": [
                {
                    "type": "Action.OpenUrl",
                    "title": "AFAS verzoek indienen",
                    "url": "https://62857.afasinsite.nl/portal-insite-prs/scrum-portal"
                }
            ]
        },
        "category": "Afas",
        "alias": "afas",
        "id": 20
    },
    {
        "questions": [
            "Wat is AFAS"
        ],
        "answer": "AFAS is het bedrijfssysteem van Welten. Hierin zijn de meeste bedrijfsprocessen georganiseerd. Kan ik je ergens mee helpen op het gebied van AFAS? Gebruik dan het woord AFAS in je vraag.",
        "category": "Afas",
        "alias": "afas",
        "id": 21
    },
    {
        "questions": [
            "de AFAS pocket app doet het niet meer",
            "ik kan niet meer inloggen op mijn afas pocket app"
        ],
        "answer": "Wanneer de AFAS pocket App niet meer reageert, moet de sessie opnieuw opgestart worden. Je kunt ook kijken op https://afasstatus.nl/ of er een algemene storing is. Lost dit het probleem niet op, neem dan contact op met Ictivity ServiceCenter op 088-4284814 (ma-vr 8:00-18:00).",
        "category": "Afas",
        "alias": "afas",
        "id": 22
    },
    {
        "questions": [
            "Ik heb een toegangsbadge gevonden",
            "Ik heb een toegangspas gevonden",
            "Ik heb een toegangspasje gevonden",
            "Mijn toegangspas is kwijt",
            "Mijn toegangspasje is kwijt",
            "Mijn toegangsbadge ben ik kwijt.",
            "Mijn toegangstoegangspasje ben ik kwijt."
        ],
        "answer": "Bij verloren of gevonden toegangspassen maak je een facilitaire melding in de KantoorApp",
        "category": "Toegangsbadge",
        "alias": "toegangsbadge",
        "id": 23
    },
    {
        "questions": [
            "Mijn toegangspasje is beschadigd",
            "mijn toegangsbadge is beschadigd"
        ],
        "answer": "Wanneer je toegangspas is beschadigd, maak je een facilitaire melding aan in de KantoorApp",
        "category": "Toegangsbadge",
        "alias": "toegangsbadge",
        "id": 24
    },
    {
        "questions": [
            "Moet ik een toegangspasje voor mijn bezoekers aanvragen?"
        ],
        "answer": "Jouw bezoek krijgt bij de receptie een visitorsbadge, hiermee is duidelijk zichtbaar dat het een bezoeker van Welten is. Deze pas werkt niet op de deuren dus vergezel je bezoek bij het verplaatsen door het pand.",
        "category": "Toegangsbadge",
        "alias": "toegangsbadge",
        "id": 25
    },
    {
        "questions": [
            "toegangsbadge aanvragen",
            "toegangsbadge bestellen",
            "toegangsbadge regelen",
            "toegangsbadge verzoek",
            "toegangsbadge nodig",
            "toegangspas aanvragen",
            "toegangspas bestellen",
            "toegangspas regelen",
            "toegangspas verzoek",
            "toegangspas nodig"
        ],
        "answer": "Het bestellen van een toegangsbadge kan uitsluitend door leidinggevenden worden gedaan via Ictivity Servicecenter en klik op \u201cAutomatisch inloggen\u201d. Neem voor dringende zaken daarna direct telefonisch contact op met Ictivity ServiceCenter via 088-4284814 (ma-vr 8:00-18:00)",
        "enrichment": {
            "actions": [
                {
                    "type": "Action.OpenUrl",
                    "title": "Ga naar Ictivity Servicecenter",
                    "url": "https://ictivity.topdesk.net/tas/public/"
                }
            ]
        },
        "category": "Toegangsbadge",
        "alias": "toegangsbadge",
        "id": 26
    },
    {
        "questions": [
            "Mijn muis doet het niet",
            "Mijn muis is kapot",
            "Mijn muis is stuk",
            "Mijn toetsenbord doet het niet",
            "Mijn toetsenbord is kapot",
            "Mijn toetsenbord is stuk"
        ],
        "answer": "Wanneer randapparatuur defect is, mail dan naar servicecenter@ictivity.nl met een vervangingsverzoek. Ictivity Servicecenter is tevens bereikbaar via 088-4284814 (ma-vr 8:00-18:00) of maak een melding via onderstaande link",
        "enrichment": {
            "actions": [
                {
                    "type": "Action.OpenUrl",
                    "title": "Ga naar Ictivity Servicecenter",
                    "url": "https://ictivity.topdesk.net/tas/public/"
                }
            ]
        },
        "category": "Randapparatuur",
        "alias": "randapparatuur",
        "id": 27
    },
    {
        "questions": [
            "Mijn beeldscherm is stuk",
            "Mijn beeldscherm is defect",
            "Mijn beeldscherm is kapot",
            "Mijn beeldscherm doet het niet",
            "Mijn monitor is defect",
            "Mijn monitor is stuk",
            "Mijn monitor is kapot",
            "Mijn monitor doet het niet"
        ],
        "answer": "Is een laptop of beeldscherm defect? Maak dan direct een melding bij Ictivity Servicecenter via 088-4284814 (ma-vr 8:00-18:00) of via het e-mail adres servicecenter@ictivity.nl",
        "enrichment": {
            "actions": [
                {
                    "type": "Action.OpenUrl",
                    "title": "Ga naar Ictivity Servicecenter",
                    "url": "https://ictivity.topdesk.net/tas/public/"
                }
            ]
        },
        "category": "Randapparatuur",
        "alias": "randapparatuur",
        "id": 28
    },
    {
        "questions": [
            "Mijn laptoptas is stuk",
            "Mijn laptoptas is kapot",
            "Mijn laptoptas is versleten",
            "In heb een laptoptas nodig",
            "Ik wil een nieuwe laptoptas"
        ],
        "answer": "Elke laptop wordt geleverd met een nieuwe laptoptas. Wanneer deze aan vervanging toe is maak je een melding bij Ictivity Servicecenter via 088-4284814 (ma-vr 8:00-18:00) of via het e-mail adres servicecenter@ictivity.nl",
        "enrichment": {
            "actions": [
                {
                    "type": "Action.OpenUrl",
                    "title": "Ga naar Ictivity Servicecenter",
                    "url": "https://ictivity.topdesk.net/tas/public/"
                }
            ]
        },
        "category": "Randapparatuur",
        "alias": "randapparatuur",
        "id": 29
    },
    {
        "questions": [
            "Advanced Threat Protection",
            "ATP"
        ],
        "answer": "Welten maakt gebruik van Advanced Threat Protection van Microsoft voor e-mailbescherming. E-mails en bijlagen worden eerst gescand voordat ze bij je worden afgeleverd. Soms heb je een mail al ontvangen maar wordt de bijlage nog door ATP gescand. deze wordt dan enkele ogenblikken later zichtbaar nadat de scan is afgerond.",
        "category": "Security",
        "alias": "security",
        "id": 30
    },
    {
        "questions": [
            "Ik heb een bestand ontvangen in een mail maar deze opent niet"
        ],
        "answer": "Welten maakt gebruik van Advanced Threat Protection van Microsoft voor e-mailbescherming. E-mails en bijlagen worden eerst gescand voordat ze bij je worden afgeleverd. Soms heb je een mail al ontvangen maar wordt de bijlage nog door ATP gescand. deze wordt zodra hij gescand is beschikbaar om te openen.",
        "category": "Security",
        "alias": "security",
        "id": 31
    },
    {
        "questions": [
            "spam ontvangen",
            "Ik heb spam ontvangen",
            "Wat te doen bij spam",
            "spam",
            "ik heb reclame ontvangen",
            "wat moet ik doen bij spam",
            "verdachte email"
        ],
        "answer": "Als je spam ontvangt markeer deze dan direct  als ongewenst. Dit doe je door met je rechtermuisknop op de e-mail in je postvak te klikken en te kiezen voor 'ongewenste email'. Nadat je dit hebt gedaan, verwijder je de mail en leeg je de prullenbak dat de e-mail definitief wordt verwijderd.  Twijfel je of de mail spam of phishing bevat? Verwijder de mail dan alsnog, mocht de mail wel echt zijn, dan zal de afzender zich vanzelf weer melden. Stuur twijfelachtige mail NOOIT door naar anderen.",
        "category": "Security",
        "alias": "security",
        "id": 32
    },
    {
        "questions": [
            "2-factor authentication",
            "Multi factor authentication",
            "mfa",
            "authenticator app activeren",
            "Multi factor authenticatie",
            "two factor authentication",
            "Microsoft authenticator app activeren",
            "2fa"
        ],
        "answer": "Bij Welten maken we gebruik van MultiFactor Authentication om zeker te weten dat de juiste persoon probeert in te loggen. Hiervoor maken we gebruik van de Microsoft Authenticator. Deze app kun je downloaden via de Apple Appstore of Google Playstore en (her)activeren via https://aka.ms/mfasetup",
        "enrichment": {
            "actions": [
                {
                    "type": "Action.OpenUrl",
                    "title": "Ga naar https://aka.ms/mfasetup",
                    "url": "https://aka.ms/mfasetup"
                }
            ]
        },
        "category": "Security",
        "alias": "security",
        "id": 33
    },
    {
        "questions": [
            "MFA opnieuw instellen",
            "Ik wil inloggen met mijn nieuwe telefoon"
        ],
        "answer": "Heb je een nieuwe telefoon, dan moet je je Authenticator app opnieuw instellen. Dit doe je door via een browser te gaan naar: https://aka.ms/mfasetup en daar te kiezen voor opnieuw instellen",
        "enrichment": {
            "actions": [
                {
                    "type": "Action.OpenUrl",
                    "title": "Ga naar https://aka.ms/mfasetup",
                    "url": "https://aka.ms/mfasetup"
                }
            ]
        },
        "category": "Security",
        "alias": "security",
        "id": 34
    },
    {
        "questions": [
            "Is er een privacyverklaring voor medewerkers?"
        ],
        "answer": "De privacyverklaring van Welten vind je hier terug",
        "enrichment": {
            "actions": [
                {
                    "type": "Action.OpenUrl",
                    "title": "Ga naar privacyverklaring",
                    "url": "https://62857.afasinsite.nl/insite-content-privacy-kwaliteit/privacyverklaring-werkzame-personen-weltengroep-l-c-lvh-20191129"
                }
            ]
        },
        "category": "Security",
        "alias": "security",
        "id": 35
    },
    {
        "questions": [
            "Zijn er regels met betrekking tot informatiebeveiliging",
            "Waar kan ik de regels voor informatiebeveiliging terugvinden?",
            "Is er een communicatieblad voor informatiebeveiliging? "
        ],
        "answer": "We hebben een communicatieblad waarin de regels voor medewerkers worden uitgelegd, deze kan je hier lezen",
        "enrichment": {
            "actions": [
                {
                    "type": "Action.OpenUrl",
                    "title": "Ga naar regels voor informatiebeveiliging",
                    "url": "https://62857.afasinsite.nl/insite-content-marcom/communicatieblad-regels-informatiebeveiliging"
                }
            ]
        },
        "category": "Security",
        "alias": "security",
        "id": 36
    },
    {
        "questions": [
            "Wat is het privacybeleid binnen Welten"
        ],
        "answer": "Welten heeft een privacybeleid, deze kan je hier vinden",
        "enrichment": {
            "actions": [
                {
                    "type": "Action.OpenUrl",
                    "title": "Ga naar privacyverklaring",
                    "url": "https://62857.afasinsite.nl/insite-content-privacy-kwaliteit/welten-privacy-beleid"
                }
            ]
        },
        "category": "Security",
        "alias": "security",
        "id": 37
    },
    {
        "questions": [
            "wat is het ib beleid van welten",
            "wat is het informatie beheer beleid van welten"
        ],
        "answer": "Het informatiebeveiligingsbeleid van Welten kan je hier terugvinden.",
        "enrichment": {
            "actions": [
                {
                    "type": "Action.OpenUrl",
                    "title": "Ga naar informatiebeveiligingsbeleid",
                    "url": "https://62857.afasinsite.nl/insite-content-marcom/informatiebeveiligingsbeleid"
                }
            ]
        },
        "category": "Security",
        "alias": "security",
        "id": 38
    },
    {
        "questions": [
            "wanneer meld ik een ib incident",
            "wat is de procedure rondom een ib incident",
            "wanneer meld ik een informatie beveiligings incident",
            "waar meld ik een ib incident",
            "bij wie meld ik een ib incident"
        ],
        "answer": "Je kunt een IB (Informatiebeveiliging) incident en/of datalek melden via onderstaande link. Let op, een datalek waarbij een onbevoegde externe partij toegang had tot onze persoonsgegevens dient altijd direct telefonisch gemeld te worden op 088-8288732",
        "enrichment": {
            "actions": [
                {
                    "type": "Action.OpenUrl",
                    "title": "Ga naar incident melden",
                    "url": "https://62857.afasinsite.nl/aanmaken-ib-incidentenregister-ess/098-aanm-ib-incident-ess"
                }
            ]
        },
        "category": "Security",
        "alias": "security",
        "id": 39
    },
    {
        "questions": [
            "wat zijn voorbeelden van ib incidenten",
            "kan je me een voorbeeld geven van een IB incident",
            "kan je me een voorbeeld geven van een informatie beveiligings incident"
        ],
        "answer": "Voorbeelden van informatiebeveiligingsincidenten zijn: Verlies, diefstal of onbevoegde inzage van (zeer) vertrouwelijke gegevens. Kwijtraken van bedrijfsmiddelen (zoals laptops en sleutels). Het (on)opzettelijk lekken van gegevens. Ontvangen van verdachte e-mail en diefstal van hard- of software.",
        "category": "Security",
        "alias": "security",
        "id": 40
    },
    {
        "questions": [
            "wat is een informatie beveiligings incident",
            "wat is een ib incident"
        ],
        "answer": "Onder een informatiebeveiligingsincident wordt het volgende verstaan: een verstoring van de vertrouwelijkheid (informatie is alleen toegankelijk voor diegene die hiertoe geautoriseerd zijn), integriteit (de correctheid en de volledigheid van informatie) of beschikbaarheid (de informatie is op de juiste momenten beschikbaar) van informatie van Welten en van informatie van klanten waar Welten de beschikking over heeft.",
        "category": "Security",
        "alias": "security",
        "id": 41
    },
    {
        "questions": [
            "ik kan geen bestanden opslaan op mijn usb stick",
            "ik kan geen bestanden openen vanaf mijn usb stick"
        ],
        "answer": "In het kader van informatiebeveiliging is er binnen onze organisatie voor gekozen om alle bestanden op te slaan in de cloud. Het is niet mogelijk om bestanden op te slaan op de harde schijf of om bestanden te lezen en/of schijven op een digitale gegevensdrager zoals een usb stick.",
        "category": "Security",
        "alias": "security",
        "id": 42
    },
    {
        "questions": [
            "Wat is een data lek",
            "wat is het verschil tussen een interne datalek en een externe datalek",
            "wat is een externe datalek",
            "wanneer is iets een datalek",
            "wat is een interne datalek",
            "Wat is een datalek"
        ],
        "answer": "Het is een datalek wanneer een onbevoegde persoon toegang heeft gehad tot onze persoonsgegevens of op een andere manier persoonsgegevens onrechtmatig zijn verwerkt. Een onbevoegde persoon kan ook een collega zijn, dan gaat het om een intern lek. Werkt de onbevoegde persoon bij bijvoorbeeld een opdrachtgever of leverancier, dan is het een extern lek. Voor meer informatie en voorbeelden van datalekken zie ons 'Proces Meldplicht Datalekken'",
        "enrichment": {
            "actions": [
                {
                    "type": "Action.OpenUrl",
                    "title": "Ga naar Proces Meldplicht Datalekken",
                    "url": "https://62857.afasinsite.nl/insite-content-privacy-kwaliteit/welten-proces-meldplicht-datalekken-l-c-lvh-20191204"
                }
            ]
        },
        "category": "Security",
        "alias": "security",
        "id": 43
    },
    {
        "questions": [
            "Wat zijn voorbeelden van datalekken",
            "Wat is een voorbeeld van een datalek"
        ],
        "answer": "Voorbeelden van datalekken volgens de Autoriteit Persoonsgegevens (AP) zijn: een kwijtgeraakte USB-stick, een gestolen laptop, een inbraak door een hacker, een malware-besmetting of een calamiteit zoals een brand in een datacentrum. Voor meer informatie en voorbeelden van datalekken zie ons 'Proces Meldplicht Datalekken'",
        "enrichment": {
            "actions": [
                {
                    "type": "Action.OpenUrl",
                    "title": "Ga naar Proces Meldplicht Datalekken",
                    "url": "https://62857.afasinsite.nl/insite-content-privacy-kwaliteit/welten-proces-meldplicht-datalekken-l-c-lvh-20191204"
                }
            ]
        },
        "category": "Security",
        "alias": "security",
        "id": 44
    },
    {
        "questions": [
            "waar meld ik een datalek",
            "bij wie meld ik een datalek"
        ],
        "answer": "Je kunt een IB (Informatiebeveiliging) incident en/of datalek melden via 'Proces Meldplicht Datalekken'.  Let op, een datalek waarbij een onbevoegde externe partij toegang had tot onze persoonsgegevens dient altijd direct telefonisch gemeld te worden op 088-8288732",
        "enrichment": {
            "actions": [
                {
                    "type": "Action.OpenUrl",
                    "title": "Ga naar datalek melden",
                    "url": "https://62857.afasinsite.nl/aanmaken-ib-incidentenregister-ess/098-aanm-ib-incident-ess"
                }
            ]
        },
        "category": "Security",
        "alias": "security",
        "id": 45
    },
    {
        "questions": [
            "Help ik heb een virus, wie moet ik informeren?",
            "Ik heb een virus. Kan je me helpen?",
            "Volgens mij ben ik gehackt. Wat moet ik doen?",
            "virus",
            "malware",
            "worm",
            "infectie",
            "phishing",
            "ik heb een virus",
            "ik heb malware"
        ],
        "answer": "Wanneer je computer aangeeft dat er een (mogelijk) ge\u00efnfecteerd bestand is gedetecteerd of je een verdachte e-mail hebt ontvangen, neem je contact op met Ictivity ServiceCenter op 088-4284814 (ma-vr 8:00-18:00). Maak tevens een IB incident en/of datalek op 'Proces Meldplicht Datalekken'. Stuur verdachte e-mails NOOIT door!",
        "enrichment": {
            "actions": [
                {
                    "type": "Action.OpenUrl",
                    "title": "Ga naar incident melden",
                    "url": "https://62857.afasinsite.nl/aanmaken-ib-incidentenregister-ess/098-aanm-ib-incident-ess"
                }
            ]
        },
        "category": "Security",
        "alias": "security",
        "id": 46
    },
    {
        "questions": [
            "Wat is het WIFI wachtwoord?",
            "Wat is het wachtwoord van Welten-Guest",
            "Hoe maak ik gebruik van het WIFI netwerk",
            "Kunnen gasten gebruik maken van het WIFI netwerk?",
            "Wat is het wachtwoord voor internet op kantoor?"
        ],
        "answer": "Het wachtwoord van Welten-Guest is: cont@ct!",
        "category": "Connectivity",
        "alias": "connectivity",
        "id": 47
    },
    {
        "questions": [
            "Internet doet het niet meer. Bij wie moet ik dit melden?",
            "internet storing",
            "Internetstoring",
            "netwerk storing",
            "netwerkstoring"
        ],
        "answer": "Heb je thuis internetproblemen? Raadpleeg dan je provider. Heb je op kantoor internetproblemen neem dan direct contact op met Ictivity ServiceCenter via 088-4284814 (ma-vr 8:00-18:00)",
        "category": "Connectivity",
        "alias": "connectivity",
        "id": 48
    },
    {
        "questions": [
            "storing",
            "foutmelding",
            "probleem",
            "defect",
            "stuk",
            "ik heb een verzoek",
            "ik heb een vraag",
            "ik heb een wens",
            "ik wil iets aanvragen"
        ],
        "answer": "Wanneer je mij een gerichtere vraag stelt, heb ik mogelijk direct een oplossing voor je. Of maak een ticket aan bij Ictivity via onderataande link en klik op \u201cAutomatisch inloggen\u201d. Neem voor dringende zaken daarna direct telefonisch contact op met Ictivity ServiceCenter via 088-4284814 (ma-vr 8:00-18:00)",
        "enrichment": {
            "actions": [
                {
                    "type": "Action.OpenUrl",
                    "title": "Ticket aanmaken",
                    "url": "https://ictivity.topdesk.net/tas/public/"
                }
            ]
        },
        "category": "Algemeen",
        "alias": "algemeen",
        "id": 49
    },
    {
        "questions": [
            "Hoe kan ik iets uitprinten?",
            "Hoe voeg ik een printer toe?",
            "Hoe kan ik printen?",
            "Hoe moet ik printen?",
            "Hoe print ik?"
        ],
        "answer": "Printen kan op kantoor. Om gebruik te kunnen maken van het follow-me-printing systeem moet je een eenmalige aanmelding doen. Dit doe je door je toegangsbadge aan te bieden bij de paslezer. Vervolgens voer je de inloggegevens in. Nu is de pas gekoppeld en kun je printen via de follw-me printer.",
        "category": "Printing",
        "alias": "printing",
        "id": 50
    },
    {
        "questions": [
            "Hoe meld ik me de eerste keer aan bij een printer?"
        ],
        "answer": "Als je voor de eerste keer gaat printen wordt er gevraagd naar je inloggegevens, gebruik hier je voorletter.achternaam (zonder @welten.eu) en je wachtwoord.",
        "category": "Printing",
        "alias": "printing",
        "id": 51
    },
    {
        "questions": [
            "Hoe scan ik een document?",
            "Hoe kan ik scannen naar mijn e-mail?",
            "Hoe kan ik scannen naar mijn email?",
            "Hoe stuur ik een ingescand document naar mijn email"
        ],
        "answer": "Meld je aan op de printer en kies voor e-mail. Leg het te scannen document bovenin de papierinvoer. Start de scan. Het document wordt naar jouw mailadres verzonden.",
        "category": "Printing",
        "alias": "printing",
        "id": 52
    },
    {
        "questions": [
            "Wanneer ik wil printen krijg ik een error. Hoe los ik dit op?",
            "Printerstoring",
            "printer storing"
        ],
        "answer": "Wanneer de printer een storing heeft, volg dan de instructies op het scherm. De machine mag ook uit- en ingeschakeld worden. Helpen beide acties niet? maak dan een melding bij Ictivity Servicecenter en klik op \u201cAutomatisch inloggen\u201d. Neem voor dringende zaken daarna direct telefonisch contact op met Ictivity Servicecenter via 088-4284814 (ma-vr 8:00-18:00)",
        "enrichment": {
            "actions": [
                {
                    "type": "Action.OpenUrl",
                    "title": "Ga naar Ictivity Servicecenter",
                    "url": "https://ictivity.topdesk.net/tas/public/"
                }
            ]
        },
        "category": "Printing",
        "alias": "printing",
        "id": 53
    },
    {
        "questions": [
            "Help, ik kan niet printen. Wat moet ik doen?",
            "Help, ik kan niet printen. Bij wie moet ik zijn?",
            "De printer doet het niet, waar meld ik dit?"
        ],
        "answer": "Controleer eerst of je verbonden bent met Welten. Via een ander netwerk is het niet mogelijk om te printen op kantoor. Heb je dit gecontroleerd en werkt het nog niet, maak dan een melding bij Ictivity Servicecenter en klik op \u201cAutomatisch inloggen\u201d. Neem voor dringende zaken daarna direct telefonisch contact op met Ictivity Servicecenter via 088-4284814 (ma-vr 8:00-18:00)",
        "enrichment": {
            "actions": [
                {
                    "type": "Action.OpenUrl",
                    "title": "Ga naar Ictivity Servicecenter",
                    "url": "https://ictivity.topdesk.net/tas/public/"
                }
            ]
        },
        "category": "Printing",
        "alias": "printing",
        "id": 54
    },
    {
        "questions": [
            "Hoe voeg ik thuis een printer toe?",
            "Hoe voeg ik mijn thuisprinter toe?",
            "Kan ik een thuisprinter gebruiken?",
            "Hoe voeg ik mijn thuis printer toe?"
        ],
        "answer": "Het is mogelijk om een thuisprinter te gebruiken. Volg hiervoor de instructie die bij de printer geleverd is. Welten levert geen ondersteuning op het gebruik van thuisprinters",
        "category": "Printing",
        "alias": "printing",
        "id": 55
    },
    {
        "questions": [
            "er is geen papier meer",
            "het papier is op",
            "de printer heeft geen papier meer"
        ],
        "answer": "In Den Bosch kan je papier voor de printer vinden in de berging, de berging is te vinden naast het opleidingslokaal en gekenmerkt door twee dozen op de deur.",
        "category": "Printing",
        "alias": "printing",
        "id": 56
    },
    {
        "questions": [
            "printer inkt is op",
            "printer heeft geen inkt meer"
        ],
        "answer": "De inkt wordt automatisch besteld als deze bijna op is. Geeft de printer aan dat deze moet worden vervangen? maak dan een melding bij Ictivity Servicecenter via 088-4284814 (ma-vr 8:00-18:00)",
        "enrichment": {
            "actions": [
                {
                    "type": "Action.OpenUrl",
                    "title": "Ga naar Ictivity Servicecenter",
                    "url": "https://ictivity.topdesk.net/tas/public/"
                }
            ]
        },
        "category": "Printing",
        "alias": "printing",
        "id": 57
    },
    {
        "questions": [
            "er zit papier vast in de printer",
            "printer is verstopt"
        ],
        "answer": "Wanneer de printer een storing heeft, volg dan de instructies op het scherm. De machine mag ook uit- en ingeschakeld worden. Helpen beide acties niet? maak dan een melding  bij Ictivity Servicecenter",
        "enrichment": {
            "actions": [
                {
                    "type": "Action.OpenUrl",
                    "title": "Ga naar Ictivity Servicecenter",
                    "url": "https://ictivity.topdesk.net/tas/public/"
                }
            ]
        },
        "category": "Printing",
        "alias": "printing",
        "id": 58
    },
    {
        "questions": [
            "printer geeft strepen op mijn papier",
            "printer geeft strepen op mijn uitgeprinte documenten"
        ],
        "answer": "Wanneer je geprinte materiaal met strepen eruit komt mag je een melding aanmaken bij Ictivity Servicecenter en klik op \u201cAutomatisch inloggen\u201d.",
        "enrichment": {
            "actions": [
                {
                    "type": "Action.OpenUrl",
                    "title": "Ga naar Ictivity Servicecenter",
                    "url": "https://ictivity.topdesk.net/tas/public/"
                }
            ]
        },
        "category": "Printing",
        "alias": "printing",
        "id": 59
    },
    {
        "questions": [
            "Ik kan niet meer scannen",
            "Ik kan niet scannen naar mijn mail",
            "Scannen naar mail werkt niet",
            "ik kan niet scannen",
            "de scanner doet het niet meer"
        ],
        "answer": "Wanneer het scannen naar je eigen emailadres niet werkt, mag je de foutmelding noteren en een ticket aanmaken bij Ictivity Servicecenter en klik op \u201cAutomatisch inloggen\u201d. Vergeet niet te melden om welke printer het gaat aan de hand van de locatie.",
        "enrichment": {
            "actions": [
                {
                    "type": "Action.OpenUrl",
                    "title": "Ga naar Ictivity Servicecenter",
                    "url": "https://ictivity.topdesk.net/tas/public/"
                }
            ]
        },
        "category": "Printing",
        "alias": "printing",
        "id": 60
    },
    {
        "questions": [
            "ik kan niet kopieren",
            "de kopiefunctie doet het niet meer",
            "Ik kan geen kopieen maken",
            "de kopie functie doet het niet meer"
        ],
        "answer": "Indien het niet lukt om te kopi\u00ebren, maak dan een melding aan bij Ictivity Servicecenter en klik op \u201cAutomatisch inloggen\u201d. Vergeet niet te melden om welke printer het gaat aan de hand van de locatie.",
        "enrichment": {
            "actions": [
                {
                    "type": "Action.OpenUrl",
                    "title": "Ga naar Ictivity Servicecenter",
                    "url": "https://ictivity.topdesk.net/tas/public/"
                }
            ]
        },
        "category": "Printing",
        "alias": "printing",
        "id": 61
    },
    {
        "questions": [
            "de printer geeft foutmeldingen",
            "de printer geeft een foutmelding"
        ],
        "answer": "Foutmeldingen met de printer mag je melden bij Ictivity Servicecenter en klik op \u201cAutomatisch inloggen\u201d. Vergeet niet te melden om welke printer het gaat aan de hand van de locatie.",
        "enrichment": {
            "actions": [
                {
                    "type": "Action.OpenUrl",
                    "title": "Ga naar Ictivity Servicecenter",
                    "url": "https://ictivity.topdesk.net/tas/public/"
                }
            ]
        },
        "category": "Printing",
        "alias": "printing",
        "id": 62
    },
    {
        "questions": [
            "Ik ben mijn wachtwoord vergeten",
            "Mijn wachtwoord is verlopen",
            "Mijn wachtwoord gaat verlopen"
        ],
        "answer": "Je wachtwoord kun je wijzigen via onderstaande link.  Wanneer je wachtwoord verlopen is neem dan contact op met Ictivity Service Center op 088-4284814 (ma-vr 8:00-18:00) voor een wachtwoord reset. Per sms ontvang je een nieuw wachtwoord",
        "enrichment": {
            "actions": [
                {
                    "type": "Action.OpenUrl",
                    "title": "Wijzig je wachtwoord",
                    "url": "https://account.activedirectory.windowsazure.com/ChangePassword.aspx"
                }
            ]
        },
        "category": "Access",
        "alias": "access",
        "id": 63
    },
    {
        "questions": [
            "ik wil toegang tot een map",
            "ik kan niet bij een map",
            "ik kan niet meer bij een map",
            "mag ik toegang tot een map"
        ],
        "answer": "Toegang tot mappen in MS Teams/Sharepoint wordt door de eigenaar van het team gegeven. Heb je toegang nodig tot een persoonlijke OneDrive map? Neem dan contact op met de eigenaar.",
        "category": "Access",
        "alias": "access",
        "id": 64
    },
    {
        "questions": [
            "ik kan niet meer inloggen op mijn laptop"
        ],
        "answer": "Waarschijnlijk is je wachtwoord verlopen. Indien dit het geval is, neem dan contact op met Ictivity Service Center op 088-4284814 (ma-vr 8:00-18:00) voor een wachtwoord reset. Per sms ontvang je een nieuw wachtwoord",
        "category": "Access",
        "alias": "access",
        "id": 65
    },
    {
        "questions": [
            "thuiswerken",
            "thuiswerkplek",
            "wat heb ik nodig om thuis te kunnen werken",
            "vanuit huis werken"
        ],
        "answer": "Om thuis te kunnen werken heb je voor je laptop alleen Wifi of een bedrade internet aansluiting nodig en netstroom. Verder is het belangrijk om je werkplek goed in te richten. Hoe je dat doet lees je via onderstaande link.",
        "enrichment": {
            "actions": [
                {
                    "type": "Action.OpenUrl",
                    "title": "Ga naar checklist thuiswerken",
                    "url": "https://62857.afasinsite.nl/insite-content-marcom/checklist-arboregels-thuiswerken"
                }
            ]
        },
        "category": "Way Of Work",
        "alias": "way_of_work",
        "id": 66
    },
    {
        "questions": [
            "Kan je de bot ook via MS Teams contacteren?",
            "Is de bot ook via Microsoft teams te benaderen?",
            "Kan ik Robin ook toevoegen via MS Teams?",
            "Kan ik Robin ook benaderen via MS Teams?",
            "Kan je de bot ook via WhatsApp contacteren?",
            "Is de bot ook via WhatsApp te benaderen?",
            "Kan ik Robin ook toevoegen via WhatsApp?",
            "Kan ik Robin ook benaderen via WhatsApp?",
            "hoe kan ik de bot toevoegen aan WhatsApp?"
        ],
        "answer": "Je kunt mij benaderen via Whatsapp (088-8288880) via Mijn Welten Portal en via MS Teams door op mijn naam te zoeken",
        "category": "Support",
        "alias": "support",
        "id": 67
    },
    {
        "questions": [
            "Welten Mail op smartphone",
            "Welten Mail op iphone",
            "Welten Mail op android",
            "Welten Mail op samsung",
            "Welten Mail op je mobiel",
            "werkmail op mobiel",
            "werk e-mail op mobiel",
            "werkmail op smartphone",
            "werk e-mail op smartphone",
            "Hoe kan ik de welten mailbox op mijn telefoon instellen?",
            "Kan ik mijn mail ook bekijken op mijn telefoon?",
            "kan ik mijn mailbox ook bekijken op mijn mobiele telefoon?"
        ],
        "answer": "Welten maakt uit beveiligingsoverwegingen uitsluitend gebruik van de offici\u00eble Outlook app van Microsoft. Download de Outlook app voor iOS  https://apps.apple.com/nl/app/microsoft-outlook/id951937596 of Android https://play.google.com/store/apps/details?id=com.microsoft.office.outlook&hl=nl. Log in met je Welten gebruikersnaam en het bijbehorend wachtwoord ( interne collega's hebben aanvullend de MFA-app van Microsoft nodig).",
        "category": "Microsoft365",
        "alias": "microsoft365",
        "id": 68
    },
    {
        "questions": [
            "Maibox toevoegen outlook",
            "shared mailbox"
        ],
        "answer": "Wanneer je een gedeelde mailbox wilt toevoegen, volg dan de volgende stappen:\n > Outlook > Bestand > Account toevoegen > geef het e-mailadres op van de mailbox die je wilt toevoegen > OK.\n\nUiteraard dien je te beschikken over de benodigde autorisatie. Wanneer dat nog niet het geval is, krijg je bij het openen van de mailbox de foutmelding:Clientbewerking mislukt.",
        "category": "Microsoft365",
        "alias": "microsoft365",
        "id": 69
    },
    {
        "questions": [
            "Mailbox toevoegen in Outlook Web App"
        ],
        "answer": "De gedeelde postvakken kun je in de webmail toevoegen door links op MEER te klikken en dan rechtermuisknop op je Achternaam, Voornaam. Kies  voor Gedeelde map toevoegen en zoek naar de gedeelde mailbox en druk op ENTER. Daarna zoekt hij de mailbox, kun je deze selecteren en toevoegen.",
        "category": "Microsoft365",
        "alias": "microsoft365",
        "id": 70
    },
    {
        "questions": [
            "mailbox aanvragen"
        ],
        "answer": "Je kunt een extra groeps e-mailbox aanvragen via Ictivity Service Center",
        "enrichment": {
            "actions": [
                {
                    "type": "Action.OpenUrl",
                    "title": "Ga naar Ictivity Service Center",
                    "url": "https://ictivity.topdesk.net/tas/public/"
                }
            ]
        },
        "category": "Microsoft365",
        "alias": "microsoft365",
        "id": 71
    },
    {
        "questions": [
            "Outlook werkt niet meer na wachtwoord reset",
            "Outlook maakt geen verbinding meer na wachtwoord wijziging"
        ],
        "answer": "Na een wachtwoord wijziging kan het zijn dat Outlook geen verbinding meer kan maken omdat het oude wachtwoord nog lokaal staat opgeslagen. Je kunt het oude wachtwoord verwijderen via referentiebeheer, ga naar: Start > typ Referentiebeheer > druk op enter\n* Onder Algemene referenties vindt je MicrosoftOffice15_Data:******, klik deze aan\n* Klik op verwijderen uit kluis\n** Herstart Outlook. * Vul je nieuwe wachtwoord in in het pop-up scherm",
        "category": "Microsoft365",
        "alias": "microsoft365",
        "id": 72
    },
    {
        "questions": [
            "mijn laptop start niet meer op",
            "Mijn laptop is kapot",
            "Mijn laptop doet het niet",
            "mijn laptop is erg traag",
            "opstart problemen",
            "mijn laptop is op de grond gevallen",
            "Mijn laptop heeft kuren",
            "mijn laptop loopt constant vast",
            "ik heb vloeistof over mijn laptop laten vallen",
            "ik heb water over mijn laptop laten vallen",
            "mijn laptop maakt een raar geluid",
            "ik heb mijn laptop laten vallen",
            "de speakers van mijn laptop doen het niet meer",
            "mijn computer loopt constant vast",
            "de microfoon van mijn laptop doet het niet meer",
            "mijn computer start niet op",
            "mijn computer hapert",
            "ik heb koffie over mijn laptop laten vallen",
            "mijn laptop hapert",
            "mijn laptop start niet op",
            "Mijn laptop is defect",
            "Mijn laptop is stuk",
            "mijn computer is erg traag",
            "Mijn laptop start niet op",
            "mijn computer start niet meer op",
            "Mijn laptop heeft mankementen"
        ],
        "answer": "Is een laptop of beeldscherm defect? Maak dan direct een melding bij Ictivity Servicecenter via 088-4284814 (ma-vr 8:00-18:00) of via onderstaande link.",
        "enrichment": {
            "actions": [
                {
                    "type": "Action.OpenUrl",
                    "title": "Melding aanmaken bij Ictivity",
                    "url": "https://ictivity.topdesk.net/tas/public/"
                }
            ]
        },
        "category": "Laptop",
        "alias": "laptop",
        "id": 73
    },
    {
        "questions": [
            "Mijn laptop is gestolen",
            "Mijn laptop is verloren"
        ],
        "answer": "Wanneer een laptop gestolen of verloren is doe je direct aangifte bij de politie en neem je contact op met Ictivity ServiceCenter op 088-4284814 (ma-vr 8:00-18:00). Maak tevens een melding van het IB (Informatiebeveiliging) incident en/of datalek op: https://62857.afasinsite.nl/aanmaken-ib-incidentenregister-ess/098-aanm-ib-incident-ess Let op, een datalek waarbij een onbevoegde externe partij toegang had tot onze persoonsgegevens dient altijd direct telefonisch gemeld te worden op 088-8288732",
        "category": "Laptop",
        "alias": "laptop",
        "id": 74
    },
    {
        "questions": [
            "laptop aanvragen",
            "laptop bestellen",
            "laptop regelen",
            "laptop verzoek",
            "laptop nodig"
        ],
        "answer": "Het bestellen van laptops en software voor medewerkers kan uitsluitend door leidinggevenden worden gedaan via onderstaande link en klik op \u201cAutomatisch inloggen\u201d. Neem voor dringende zaken daarna direct telefonisch contact op met Ictivity ServiceCenter via 088-4284814 (ma-vr 8:00-18:00)",
        "enrichment": {
            "actions": [
                {
                    "type": "Action.OpenUrl",
                    "title": "Laptop aanvragen via Ictivity",
                    "url": "https://ictivity.topdesk.net/tas/public/"
                }
            ]
        },
        "category": "Laptop",
        "alias": "laptop",
        "id": 75
    },
    {
        "questions": [
            "laptop vervangen",
            "mijn laptop moet vervangen worden",
            "mijn laptop is aan vervanging toe",
            "ik wil een nieuwe laptop",
            "ik wil een andere laptop"
        ],
        "answer": "Laptops worden na 60 maanden vervangen. Je ontvangt een persoonlijke uitnodiging voor de vervanging wanneer het zover is. Wanneer je voortijdig problemen ervaart met je laptop maak dan een ticket aan bij Ictivity via onderstaande link en klik op \u201cAutomatisch inloggen\u201d. Neem voor dringende zaken daarna direct telefonisch contact op met Ictivity ServiceCenter via 088-4284814 (ma-vr 8:00-18:00)",
        "enrichment": {
            "actions": [
                {
                    "type": "Action.OpenUrl",
                    "title": "Laptop vervangen via Ictivity",
                    "url": "https://ictivity.topdesk.net/tas/public/"
                }
            ]
        },
        "category": "Laptop",
        "alias": "laptop",
        "id": 76
    },
    {
        "questions": [
            "mijncv",
            "cvportal"
        ],
        "answer": "Wanneer je problemen ondervindt met MijnCV, neem dan contact op met de afdeling Matching op 088-8288850 of mail naar matching@welten.eu",
        "category": "Apps",
        "alias": "apps",
        "id": 77
    },
    {
        "questions": [
            "Software Installeren",
            "App installeren",
            "download installeren"
        ],
        "answer": "Wil je zelf software installeren op je laptop? Dat kan. Alle software binnen de Microsoft Store kun je installeren zonder aanvraag bij IT. Wanneer je andere software wilt installeren maak dan een ticket aan bij Ictivity via onderstaande link en klik op \u201cAutomatisch inloggen\u201d. Neem voor dringende zaken daarna direct telefonisch contact op met Ictivity ServiceCenter via 088-4284814 (ma-vr 8:00-18:00)",
        "enrichment": {
            "actions": [
                {
                    "type": "Action.OpenUrl",
                    "title": "Ticket aanmaken",
                    "url": "https://ictivity.topdesk.net/tas/public/"
                }
            ]
        },
        "category": "Apps",
        "alias": "apps",
        "id": 78
    },
    {
        "questions": [
            "microsoft office pakket",
            "microsoft licentie"
        ],
        "answer": "Microsoft licenties worden automatisch toegekend op basis van je functie. Hiervoor is geen aanvraag benodigd. Interim Professionals en externe docenten hebben geen offline Microsoft Office pakket tot hun beschikking.",
        "category": "Licenties",
        "alias": "licenties",
        "id": 79
    },
    {
        "questions": [
            "adobe licentie",
            "Creative suite",
            "Indesign",
            "Acrobat Professional"
        ],
        "answer": "Adobe abonnementen worden op naam besteld door een leidinggevende. Maak hiervoor een ticket aan bij Ictivity via onderstaande link en klik op \u201cAutomatisch inloggen\u201d. Neem voor dringende zaken daarna direct telefonisch contact op met Ictivity ServiceCenter via 088-4284814 (ma-vr 8:00-18:00).",
        "enrichment": {
            "actions": [
                {
                    "type": "Action.OpenUrl",
                    "title": "Ticket aanmaken bij Ictivity",
                    "url": "https://ictivity.topdesk.net/tas/public/"
                }
            ]
        },
        "category": "Licenties",
        "alias": "licenties",
        "id": 80
    },
    {
        "questions": [
            "Microsoft Visio",
            "Visio licentie",
            "Microsoft Project",
            "Project licentie"
        ],
        "answer": "Specifieke Microsoft abonnementen worden op naam besteld door een leidinggevende. Maak hiervoor een ticket aan bij Ictivity via onderstaande link en klik op \u201cAutomatisch inloggen\u201d. Neem voor dringende zaken daarna direct telefonisch contact op met Ictivity ServiceCenter via 088-4284814 (ma-vr 8:00-18:00).",
        "enrichment": {
            "actions": [
                {
                    "type": "Action.OpenUrl",
                    "title": "Ticket aanmaken bij Ictivity",
                    "url": "https://ictivity.topdesk.net/tas/public/"
                }
            ]
        },
        "category": "Licenties",
        "alias": "licenties",
        "id": 81
    }
]