[
  {
    "name": "Штани зимові",
    "price": "1500грн",
    "url": "../images/photo1.jpg",
    "article": "2839657",
    "color": "cірий"
  },
  {
    "name": "Штани зимові",
    "price": "1500грн",
    "url": "./images/photo2.ppg",
    "article": "2839658",
    "color": "синый"
  },
  {
    "name": "Штани тактикал",
    "price": "1300грн",
    "url": "./images/photo3.jpeg",
    "article": "2839659",
    "color": "олива"
  },
  {
    "name": "Штани тактикал",
    "price": "1300грн",
    "url": "./images/photo4.ppg",
    "article": "2839660",
    "color": "сірий"
  },
  {
    "name": "Штани тактикал",
    "price": "1300грн",
    "url": "./images/photo5.jpg",
    "article": "2839661",
    "color": "чорний"
  },{
  "name": "Флісова кофта",
  "price": "990грн",
  "url": "./images/photo6.ppg",
  "article": "2839662",
  "color": "зелений"
},
  {
    "name": "Флісова кофта",
    "price": "990грн",
    "url": "./images/photo7.jpg",
    "article": "2839663",
    "color": "синій"
  },
  {
    "name": "Флісова кофта",
    "price": "1300грн",
    "url": "./images/photo8.ppg",
    "article": "2839664",
    "color": "чорний"
  },
  {
    "name": "Флісова кофта",
    "price": "1300грн",
    "url": "./images/photo9.ppg",
    "article": "2839665",
    "color": "олива"
  },
  {
    "name": "Штани тактичні",
    "price": "1300грн",
    "url": "./images/photo10.jpg",
    "article": "2839666",
    "color": "піксель"
  }
]