{
    "launches": [
        {
            "launchName": "L.1",
            "orbit": {
                "a": 7470,
                "e": 0.001,
                "i": 1.0463248865706005,
                "Om": 0,
                "om": 0
            },
            "payload": [
                {
                    "name": "P.1",
                    "f": 0
                },
                {
                    "name": "P.2",
                    "f": 0.12566370614359174
                },
                {
                    "name": "P.3",
                    "f": 0.25132741228718347
                },
                {
                    "name": "P.4",
                    "f": 0.37699111843077515
                },
                {
                    "name": "P.5",
                    "f": 0.50265482457436694
                },
                {
                    "name": "P.6",
                    "f": 0.62831853071795862
                },
                {
                    "name": "P.7",
                    "f": 0.7539822368615503
                },
                {
                    "name": "P.8",
                    "f": 0.87964594300514209
                },
                {
                    "name": "P.9",
                    "f": 1.0053096491487339
                },
                {
                    "name": "P.10",
                    "f": 1.1309733552923256
                },
                {
                    "name": "P.11",
                    "f": 1.2566370614359172
                },
                {
                    "name": "P.12",
                    "f": 1.3823007675795089
                },
                {
                    "name": "P.13",
                    "f": 1.5079644737231006
                },
                {
                    "name": "P.14",
                    "f": 1.6336281798666925
                },
                {
                    "name": "P.15",
                    "f": 1.7592918860102842
                },
                {
                    "name": "P.16",
                    "f": 1.8849555921538756
                },
                {
                    "name": "P.17",
                    "f": 2.0106192982974678
                },
                {
                    "name": "P.18",
                    "f": 2.1362830044410597
                },
                {
                    "name": "P.19",
                    "f": 2.2619467105846511
                },
                {
                    "name": "P.20",
                    "f": 2.3876104167282426
                },
                {
                    "name": "P.21",
                    "f": 2.5132741228718345
                },
                {
                    "name": "P.22",
                    "f": 2.6389378290154264
                },
                {
                    "name": "P.23",
                    "f": 2.7646015351590179
                },
                {
                    "name": "P.24",
                    "f": 2.8902652413026093
                },
                {
                    "name": "P.25",
                    "f": 3.0159289474462012
                },
                {
                    "name": "P.26",
                    "f": 3.1415926535897931
                },
                {
                    "name": "P.27",
                    "f": 3.267256359733385
                },
                {
                    "name": "P.28",
                    "f": 3.3929200658769765
                },
                {
                    "name": "P.29",
                    "f": 3.5185837720205684
                },
                {
                    "name": "P.30",
                    "f": 3.6442474781641603
                },
                {
                    "name": "P.31",
                    "f": 3.7699111843077513
                },
                {
                    "name": "P.32",
                    "f": 3.8955748904513432
                },
                {
                    "name": "P.33",
                    "f": 4.0212385965949355
                },
                {
                    "name": "P.34",
                    "f": 4.1469023027385274
                },
                {
                    "name": "P.35",
                    "f": 4.2725660088821193
                },
                {
                    "name": "P.36",
                    "f": 4.39822971502571
                },
                {
                    "name": "P.37",
                    "f": 4.5238934211693023
                },
                {
                    "name": "P.38",
                    "f": 4.6495571273128942
                },
                {
                    "name": "P.39",
                    "f": 4.7752208334564852
                },
                {
                    "name": "P.40",
                    "f": 4.9008845396000771
                },
                {
                    "name": "P.41",
                    "f": 5.026548245743669
                },
                {
                    "name": "P.42",
                    "f": 5.15221195188726
                },
                {
                    "name": "P.43",
                    "f": 5.2778756580308528
                },
                {
                    "name": "P.44",
                    "f": 5.4035393641744438
                },
                {
                    "name": "P.45",
                    "f": 5.5292030703180357
                },
                {
                    "name": "P.46",
                    "f": 5.6548667764616276
                },
                {
                    "name": "P.47",
                    "f": 5.7805304826052186
                },
                {
                    "name": "P.48",
                    "f": 5.9061941887488114
                },
                {
                    "name": "P.49",
                    "f": 6.0318578948924024
                },
                {
                    "name": "P.50",
                    "f": 6.1575216010359943
                }
            ]
        },
        {
            "launchName": "L.2",
            "orbit": {
                "a": 7450,
                "e": 0.001,
                "i": 1.0463248865706005,
                "Om": 1.2566370614359172,
                "om": 1.2566370614359172
            },
            "payload": [
                {
                    "name": "P.1",
                    "f": 0
                },
                {
                    "name": "P.2",
                    "f": 0.12566370614359174
                },
                {
                    "name": "P.3",
                    "f": 0.25132741228718347
                },
                {
                    "name": "P.4",
                    "f": 0.37699111843077515
                },
                {
                    "name": "P.5",
                    "f": 0.50265482457436694
                },
                {
                    "name": "P.6",
                    "f": 0.62831853071795862
                },
                {
                    "name": "P.7",
                    "f": 0.7539822368615503
                },
                {
                    "name": "P.8",
                    "f": 0.87964594300514209
                },
                {
                    "name": "P.9",
                    "f": 1.0053096491487339
                },
                {
                    "name": "P.10",
                    "f": 1.1309733552923256
                },
                {
                    "name": "P.11",
                    "f": 1.2566370614359172
                },
                {
                    "name": "P.12",
                    "f": 1.3823007675795089
                },
                {
                    "name": "P.13",
                    "f": 1.5079644737231006
                },
                {
                    "name": "P.14",
                    "f": 1.6336281798666925
                },
                {
                    "name": "P.15",
                    "f": 1.7592918860102842
                },
                {
                    "name": "P.16",
                    "f": 1.8849555921538756
                },
                {
                    "name": "P.17",
                    "f": 2.0106192982974678
                },
                {
                    "name": "P.18",
                    "f": 2.1362830044410597
                },
                {
                    "name": "P.19",
                    "f": 2.2619467105846511
                },
                {
                    "name": "P.20",
                    "f": 2.3876104167282426
                },
                {
                    "name": "P.21",
                    "f": 2.5132741228718345
                },
                {
                    "name": "P.22",
                    "f": 2.6389378290154264
                },
                {
                    "name": "P.23",
                    "f": 2.7646015351590179
                },
                {
                    "name": "P.24",
                    "f": 2.8902652413026093
                },
                {
                    "name": "P.25",
                    "f": 3.0159289474462012
                },
                {
                    "name": "P.26",
                    "f": 3.1415926535897931
                },
                {
                    "name": "P.27",
                    "f": 3.267256359733385
                },
                {
                    "name": "P.28",
                    "f": 3.3929200658769765
                },
                {
                    "name": "P.29",
                    "f": 3.5185837720205684
                },
                {
                    "name": "P.30",
                    "f": 3.6442474781641603
                },
                {
                    "name": "P.31",
                    "f": 3.7699111843077513
                },
                {
                    "name": "P.32",
                    "f": 3.8955748904513432
                },
                {
                    "name": "P.33",
                    "f": 4.0212385965949355
                },
                {
                    "name": "P.34",
                    "f": 4.1469023027385274
                },
                {
                    "name": "P.35",
                    "f": 4.2725660088821193
                },
                {
                    "name": "P.36",
                    "f": 4.39822971502571
                },
                {
                    "name": "P.37",
                    "f": 4.5238934211693023
                },
                {
                    "name": "P.38",
                    "f": 4.6495571273128942
                },
                {
                    "name": "P.39",
                    "f": 4.7752208334564852
                },
                {
                    "name": "P.40",
                    "f": 4.9008845396000771
                },
                {
                    "name": "P.41",
                    "f": 5.026548245743669
                },
                {
                    "name": "P.42",
                    "f": 5.15221195188726
                },
                {
                    "name": "P.43",
                    "f": 5.2778756580308528
                },
                {
                    "name": "P.44",
                    "f": 5.4035393641744438
                },
                {
                    "name": "P.45",
                    "f": 5.5292030703180357
                },
                {
                    "name": "P.46",
                    "f": 5.6548667764616276
                },
                {
                    "name": "P.47",
                    "f": 5.7805304826052186
                },
                {
                    "name": "P.48",
                    "f": 5.9061941887488114
                },
                {
                    "name": "P.49",
                    "f": 6.0318578948924024
                },
                {
                    "name": "P.50",
                    "f": 6.1575216010359943
                }
            ]
        },
        {
            "launchName": "L.3",
            "orbit": {
                "a": 7430,
                "e": 0.001,
                "i": 1.0463248865706005,
                "Om": 2.5132741228718345,
                "om": 2.5132741228718345
            },
            "payload": [
                {
                    "name": "P.1",
                    "f": 0
                },
                {
                    "name": "P.2",
                    "f": 0.12566370614359174
                },
                {
                    "name": "P.3",
                    "f": 0.25132741228718347
                },
                {
                    "name": "P.4",
                    "f": 0.37699111843077515
                },
                {
                    "name": "P.5",
                    "f": 0.50265482457436694
                },
                {
                    "name": "P.6",
                    "f": 0.62831853071795862
                },
                {
                    "name": "P.7",
                    "f": 0.7539822368615503
                },
                {
                    "name": "P.8",
                    "f": 0.87964594300514209
                },
                {
                    "name": "P.9",
                    "f": 1.0053096491487339
                },
                {
                    "name": "P.10",
                    "f": 1.1309733552923256
                },
                {
                    "name": "P.11",
                    "f": 1.2566370614359172
                },
                {
                    "name": "P.12",
                    "f": 1.3823007675795089
                },
                {
                    "name": "P.13",
                    "f": 1.5079644737231006
                },
                {
                    "name": "P.14",
                    "f": 1.6336281798666925
                },
                {
                    "name": "P.15",
                    "f": 1.7592918860102842
                },
                {
                    "name": "P.16",
                    "f": 1.8849555921538756
                },
                {
                    "name": "P.17",
                    "f": 2.0106192982974678
                },
                {
                    "name": "P.18",
                    "f": 2.1362830044410597
                },
                {
                    "name": "P.19",
                    "f": 2.2619467105846511
                },
                {
                    "name": "P.20",
                    "f": 2.3876104167282426
                },
                {
                    "name": "P.21",
                    "f": 2.5132741228718345
                },
                {
                    "name": "P.22",
                    "f": 2.6389378290154264
                },
                {
                    "name": "P.23",
                    "f": 2.7646015351590179
                },
                {
                    "name": "P.24",
                    "f": 2.8902652413026093
                },
                {
                    "name": "P.25",
                    "f": 3.0159289474462012
                },
                {
                    "name": "P.26",
                    "f": 3.1415926535897931
                },
                {
                    "name": "P.27",
                    "f": 3.267256359733385
                },
                {
                    "name": "P.28",
                    "f": 3.3929200658769765
                },
                {
                    "name": "P.29",
                    "f": 3.5185837720205684
                },
                {
                    "name": "P.30",
                    "f": 3.6442474781641603
                },
                {
                    "name": "P.31",
                    "f": 3.7699111843077513
                },
                {
                    "name": "P.32",
                    "f": 3.8955748904513432
                },
                {
                    "name": "P.33",
                    "f": 4.0212385965949355
                },
                {
                    "name": "P.34",
                    "f": 4.1469023027385274
                },
                {
                    "name": "P.35",
                    "f": 4.2725660088821193
                },
                {
                    "name": "P.36",
                    "f": 4.39822971502571
                },
                {
                    "name": "P.37",
                    "f": 4.5238934211693023
                },
                {
                    "name": "P.38",
                    "f": 4.6495571273128942
                },
                {
                    "name": "P.39",
                    "f": 4.7752208334564852
                },
                {
                    "name": "P.40",
                    "f": 4.9008845396000771
                },
                {
                    "name": "P.41",
                    "f": 5.026548245743669
                },
                {
                    "name": "P.42",
                    "f": 5.15221195188726
                },
                {
                    "name": "P.43",
                    "f": 5.2778756580308528
                },
                {
                    "name": "P.44",
                    "f": 5.4035393641744438
                },
                {
                    "name": "P.45",
                    "f": 5.5292030703180357
                },
                {
                    "name": "P.46",
                    "f": 5.6548667764616276
                },
                {
                    "name": "P.47",
                    "f": 5.7805304826052186
                },
                {
                    "name": "P.48",
                    "f": 5.9061941887488114
                },
                {
                    "name": "P.49",
                    "f": 6.0318578948924024
                },
                {
                    "name": "P.50",
                    "f": 6.1575216010359943
                }
            ]
        },
        {
            "launchName": "L.4",
            "orbit": {
                "a": 7410,
                "e": 0.001,
                "i": 1.0463248865706005,
                "Om": 3.7699111843077517,
                "om": 3.7699111843077517
            },
            "payload": [
                {
                    "name": "P.1",
                    "f": 0
                },
                {
                    "name": "P.2",
                    "f": 0.12566370614359174
                },
                {
                    "name": "P.3",
                    "f": 0.25132741228718347
                },
                {
                    "name": "P.4",
                    "f": 0.37699111843077515
                },
                {
                    "name": "P.5",
                    "f": 0.50265482457436694
                },
                {
                    "name": "P.6",
                    "f": 0.62831853071795862
                },
                {
                    "name": "P.7",
                    "f": 0.7539822368615503
                },
                {
                    "name": "P.8",
                    "f": 0.87964594300514209
                },
                {
                    "name": "P.9",
                    "f": 1.0053096491487339
                },
                {
                    "name": "P.10",
                    "f": 1.1309733552923256
                },
                {
                    "name": "P.11",
                    "f": 1.2566370614359172
                },
                {
                    "name": "P.12",
                    "f": 1.3823007675795089
                },
                {
                    "name": "P.13",
                    "f": 1.5079644737231006
                },
                {
                    "name": "P.14",
                    "f": 1.6336281798666925
                },
                {
                    "name": "P.15",
                    "f": 1.7592918860102842
                },
                {
                    "name": "P.16",
                    "f": 1.8849555921538756
                },
                {
                    "name": "P.17",
                    "f": 2.0106192982974678
                },
                {
                    "name": "P.18",
                    "f": 2.1362830044410597
                },
                {
                    "name": "P.19",
                    "f": 2.2619467105846511
                },
                {
                    "name": "P.20",
                    "f": 2.3876104167282426
                },
                {
                    "name": "P.21",
                    "f": 2.5132741228718345
                },
                {
                    "name": "P.22",
                    "f": 2.6389378290154264
                },
                {
                    "name": "P.23",
                    "f": 2.7646015351590179
                },
                {
                    "name": "P.24",
                    "f": 2.8902652413026093
                },
                {
                    "name": "P.25",
                    "f": 3.0159289474462012
                },
                {
                    "name": "P.26",
                    "f": 3.1415926535897931
                },
                {
                    "name": "P.27",
                    "f": 3.267256359733385
                },
                {
                    "name": "P.28",
                    "f": 3.3929200658769765
                },
                {
                    "name": "P.29",
                    "f": 3.5185837720205684
                },
                {
                    "name": "P.30",
                    "f": 3.6442474781641603
                },
                {
                    "name": "P.31",
                    "f": 3.7699111843077513
                },
                {
                    "name": "P.32",
                    "f": 3.8955748904513432
                },
                {
                    "name": "P.33",
                    "f": 4.0212385965949355
                },
                {
                    "name": "P.34",
                    "f": 4.1469023027385274
                },
                {
                    "name": "P.35",
                    "f": 4.2725660088821193
                },
                {
                    "name": "P.36",
                    "f": 4.39822971502571
                },
                {
                    "name": "P.37",
                    "f": 4.5238934211693023
                },
                {
                    "name": "P.38",
                    "f": 4.6495571273128942
                },
                {
                    "name": "P.39",
                    "f": 4.7752208334564852
                },
                {
                    "name": "P.40",
                    "f": 4.9008845396000771
                },
                {
                    "name": "P.41",
                    "f": 5.026548245743669
                },
                {
                    "name": "P.42",
                    "f": 5.15221195188726
                },
                {
                    "name": "P.43",
                    "f": 5.2778756580308528
                },
                {
                    "name": "P.44",
                    "f": 5.4035393641744438
                },
                {
                    "name": "P.45",
                    "f": 5.5292030703180357
                },
                {
                    "name": "P.46",
                    "f": 5.6548667764616276
                },
                {
                    "name": "P.47",
                    "f": 5.7805304826052186
                },
                {
                    "name": "P.48",
                    "f": 5.9061941887488114
                },
                {
                    "name": "P.49",
                    "f": 6.0318578948924024
                },
                {
                    "name": "P.50",
                    "f": 6.1575216010359943
                }
            ]
        },
        {
            "launchName": "L.5",
            "orbit": {
                "a": 7390,
                "e": 0.001,
                "i": 1.0463248865706005,
                "Om": 5.026548245743669,
                "om": 5.026548245743669
            },
            "payload": [
                {
                    "name": "P.1",
                    "f": 0
                },
                {
                    "name": "P.2",
                    "f": 0.12566370614359174
                },
                {
                    "name": "P.3",
                    "f": 0.25132741228718347
                },
                {
                    "name": "P.4",
                    "f": 0.37699111843077515
                },
                {
                    "name": "P.5",
                    "f": 0.50265482457436694
                },
                {
                    "name": "P.6",
                    "f": 0.62831853071795862
                },
                {
                    "name": "P.7",
                    "f": 0.7539822368615503
                },
                {
                    "name": "P.8",
                    "f": 0.87964594300514209
                },
                {
                    "name": "P.9",
                    "f": 1.0053096491487339
                },
                {
                    "name": "P.10",
                    "f": 1.1309733552923256
                },
                {
                    "name": "P.11",
                    "f": 1.2566370614359172
                },
                {
                    "name": "P.12",
                    "f": 1.3823007675795089
                },
                {
                    "name": "P.13",
                    "f": 1.5079644737231006
                },
                {
                    "name": "P.14",
                    "f": 1.6336281798666925
                },
                {
                    "name": "P.15",
                    "f": 1.7592918860102842
                },
                {
                    "name": "P.16",
                    "f": 1.8849555921538756
                },
                {
                    "name": "P.17",
                    "f": 2.0106192982974678
                },
                {
                    "name": "P.18",
                    "f": 2.1362830044410597
                },
                {
                    "name": "P.19",
                    "f": 2.2619467105846511
                },
                {
                    "name": "P.20",
                    "f": 2.3876104167282426
                },
                {
                    "name": "P.21",
                    "f": 2.5132741228718345
                },
                {
                    "name": "P.22",
                    "f": 2.6389378290154264
                },
                {
                    "name": "P.23",
                    "f": 2.7646015351590179
                },
                {
                    "name": "P.24",
                    "f": 2.8902652413026093
                },
                {
                    "name": "P.25",
                    "f": 3.0159289474462012
                },
                {
                    "name": "P.26",
                    "f": 3.1415926535897931
                },
                {
                    "name": "P.27",
                    "f": 3.267256359733385
                },
                {
                    "name": "P.28",
                    "f": 3.3929200658769765
                },
                {
                    "name": "P.29",
                    "f": 3.5185837720205684
                },
                {
                    "name": "P.30",
                    "f": 3.6442474781641603
                },
                {
                    "name": "P.31",
                    "f": 3.7699111843077513
                },
                {
                    "name": "P.32",
                    "f": 3.8955748904513432
                },
                {
                    "name": "P.33",
                    "f": 4.0212385965949355
                },
                {
                    "name": "P.34",
                    "f": 4.1469023027385274
                },
                {
                    "name": "P.35",
                    "f": 4.2725660088821193
                },
                {
                    "name": "P.36",
                    "f": 4.39822971502571
                },
                {
                    "name": "P.37",
                    "f": 4.5238934211693023
                },
                {
                    "name": "P.38",
                    "f": 4.6495571273128942
                },
                {
                    "name": "P.39",
                    "f": 4.7752208334564852
                },
                {
                    "name": "P.40",
                    "f": 4.9008845396000771
                },
                {
                    "name": "P.41",
                    "f": 5.026548245743669
                },
                {
                    "name": "P.42",
                    "f": 5.15221195188726
                },
                {
                    "name": "P.43",
                    "f": 5.2778756580308528
                },
                {
                    "name": "P.44",
                    "f": 5.4035393641744438
                },
                {
                    "name": "P.45",
                    "f": 5.5292030703180357
                },
                {
                    "name": "P.46",
                    "f": 5.6548667764616276
                },
                {
                    "name": "P.47",
                    "f": 5.7805304826052186
                },
                {
                    "name": "P.48",
                    "f": 5.9061941887488114
                },
                {
                    "name": "P.49",
                    "f": 6.0318578948924024
                },
                {
                    "name": "P.50",
                    "f": 6.1575216010359943
                }
            ]
        }
    ]
}