Image center coordinates: 
1622894859.326151;290.9000244140625;0.20001220703125
1622894859.3335135;281.04998779296875;0.45001220703125
1622894859.3454993;276.0999755859375;0.4666748046875
1622894859.357354;270.52496337890625;0.5500068664550781
1622894859.3647027;271.1599609375;0.5400054931640625
1622894859.3771415;264.63994140625;0.4200042724609375
1622894859.3874772;258.9599365234375;0.2000030517578125
1622894859.3985786;248.5199462890625;0.560003662109375
1622894859.4076548;234.8599609375;0.8800048828125
1622894859.4164736;218.2799560546875;1.200006103515625
1622894859.4253066;201.9399658203125;1.600006103515625
1622894859.4341466;-129.0;1.5999908447265625
1622894859.441793;-127.60003662109375;1.4999923706054688
1622894859.4536858;-134.3333740234375;1.6666615804036458
1622894859.4656215;-44.0;-0.8000030517578125
1622894859.4736059;-44.0;-0.8000030517578125
1622894859.4822872;-44.0;-0.8000030517578125
1622894859.4904613;-44.0;-0.8000030517578125
1622894859.5010295;-44.0;-0.8000030517578125
1622894859.5122333;-72.2999267578125;0.600006103515625
1622894859.5242827;-83.59991455078125;0.75
1622894859.5335324;-91.833251953125;0.866668701171875
1622894859.5425434;-104.32492065429688;0.9250030517578125
1622894859.5506785;-115.5999267578125;1.04000244140625
1622894859.5623498;-141.0999267578125;1.4
1622894859.5731237;-164.879931640625;1.4
1622894859.5813468;-145.4599365234375;4.619998168945313
1622894859.5936213;-145.4599365234375;4.619998168945313
1622894859.603578;-145.4599365234375;4.619998168945313
1622894859.6126018;-145.4599365234375;4.619998168945313
1622894859.6232617;-145.4599365234375;4.619998168945313
1622894859.63301;-19.2000732421875;-1.6999969482421875
1622894859.6416771;-23.7000732421875;-2.5999984741210938
1622894859.65113;-30.900065104166668;-2.766667683919271
1622894859.6594203;-42.650054931640625;-2.6500015258789062
1622894859.6676476;-52.300048828125;-2.84000244140625
1622894859.6791515;-71.380029296875;-3.3200042724609373
1622894859.6913419;-98.0000244140625;-3.3000030517578125
1622894859.7003937;-128.6400146484375;-3.3000030517578125
1622894859.7093847;-158.02001953125;-3.6000030517578123
1622894859.7166321;-190.0400146484375;-3.820001220703125
1622894859.7285125;-228.1000244140625;-3.779998779296875
1622894859.7404177;-263.380029296875;-4.120001220703125
1622894859.7491467;-293.780029296875;-4.5
1622894859.7576926;-322.9400146484375;-4.660000610351562
1622894859.7664742;-352.5400146484375;-4.8
1622894859.775201;-373.7000244140625;-5.0
1622894859.783234;-397.6400146484375;-4.9
1622894859.7916684;-397.6400146484375;-4.9
1622894859.8008118;-397.6400146484375;-4.9
1622894859.8115604;-397.6400146484375;-4.9
1622894859.8226874;-397.6400146484375;-4.9
1622894859.8317037;-397.6400146484375;-4.9
1622894859.8403313;-397.6400146484375;-4.9
1622894859.848644;-397.6400146484375;-4.9
1622894859.8606052;-397.6400146484375;-4.9
1622894859.8706934;-397.6400146484375;-4.9
1622894859.8802347;-397.6400146484375;-4.9
1622894859.8891463;-397.6400146484375;-4.9
1622894859.8996086;53.60003662109375;-0.5999908447265625
1622894859.9086926;58.500030517578125;-0.399993896484375
1622894859.9176402;53.16668701171875;-0.5999959309895834
1622894859.925694;44.2750244140625;-0.6249961853027344
1622894859.9346933;44.2750244140625;-0.6249961853027344
1622894859.9456031;44.2750244140625;-0.6249961853027344
1622894859.9551342;44.2750244140625;-0.6249961853027344
1622894859.965228;44.2750244140625;-0.6249961853027344
1622894859.973617;44.2750244140625;-0.6249961853027344
1622894859.9856796;44.2750244140625;-0.6249961853027344
1622894859.9957016;44.2750244140625;-0.6249961853027344
1622894860.005322;44.2750244140625;-0.6249961853027344
1622894860.018067;44.2750244140625;-0.6249961853027344
1622894860.0286899;44.2750244140625;-0.6249961853027344
1622894860.0387056;44.2750244140625;-0.6249961853027344
1622894860.049379;44.2750244140625;-0.6249961853027344
1622894860.0573323;44.2750244140625;-0.6249961853027344
1622894860.068108;44.2750244140625;-0.6249961853027344
1622894860.0783362;44.2750244140625;-0.6249961853027344
1622894860.089797;44.2750244140625;-0.6249961853027344
1622894860.10178;44.2750244140625;-0.6249961853027344
1622894860.1115236;44.2750244140625;-0.6249961853027344
1622894860.1226392;44.2750244140625;-0.6249961853027344
1622894860.1319766;44.2750244140625;-0.6249961853027344
1622894860.1406238;44.2750244140625;-0.6249961853027344
1622894860.1487467;44.2750244140625;-0.6249961853027344
1622894860.1605575;44.2750244140625;-0.6249961853027344
1622894860.170557;44.2750244140625;-0.6249961853027344
1622894860.1795442;44.2750244140625;-0.6249961853027344
1622894860.1904778;44.2750244140625;-0.6249961853027344
1622894860.1996942;2.599853515625;-5.4000244140625
1622894860.2083561;-8.300048828125;-5.050018310546875
1622894860.2175498;-16.7333984375;-5.066691080729167
1622894860.2256973;-28.65008544921875;-5.750030517578125
1622894860.2333686;-28.65008544921875;-5.750030517578125
1622894860.2457132;-28.65008544921875;-5.750030517578125
1622894860.2557988;-28.65008544921875;-5.750030517578125
1622894860.264705;-28.65008544921875;-5.750030517578125
1622894860.2736926;-28.65008544921875;-5.750030517578125
1622894860.2819817;-28.65008544921875;-5.750030517578125
1622894860.2937038;-28.65008544921875;-5.750030517578125
1622894860.3031373;-28.65008544921875;-5.750030517578125
1622894860.3139088;-28.65008544921875;-5.750030517578125
1622894860.325151;121.199951171875;0.5999755859375
1622894860.3344014;123.14990234375;-0.60003662109375
1622894860.3415792;125.2666015625;0.2999674479166667
1622894860.3540485;126.84991455078125;0.6749725341796875
1622894860.364643;128.33994140625;1.37996826171875
1622894860.3746724;130.699951171875;2.27996826171875
1622894860.3836136;130.3599609375;3.67996826171875
1622894860.3925316;127.4599609375;4.5399658203125
1622894860.3997028;119.7;5.2399658203125
1622894860.4125595;108.4599609375;5.55997314453125
1622894860.4247108;91.9599609375;5.23997802734375
1622894860.4337149;74.9599609375;5.1599853515625
1622894860.441594;58.599951171875;4.31998291015625
1622894860.4507062;41.979931640625;3.61998291015625
1622894860.4586966;25.379931640625;2.91998291015625
1622894860.4677045;10.059912109375;2.8999755859375
1622894860.4757137;-4.540087890625;2.17996826171875
1622894860.4876475;-25.040087890625;2.17996826171875
1622894860.499713;-49.880078125;1.9399658203125
1622894860.507698;-49.880078125;1.9399658203125
1622894860.5161414;-49.880078125;1.9399658203125
1622894860.5274315;-49.880078125;1.9399658203125
1622894860.5375993;-49.880078125;1.9399658203125
1622894860.5471628;-49.880078125;1.9399658203125
1622894860.5605364;-49.880078125;1.9399658203125
1622894860.5706787;299.5;21.0999755859375
1622894860.5815225;298.449951171875;19.199981689453125
1622894860.591267;298.4999186197917;18.83331298828125
1622894860.5997248;298.24993896484375;18.449981689453125
1622894860.6116447;297.9599609375;18.33997802734375
1622894860.6210747;297.23994140625;17.4999755859375
1622894860.6309776;296.679931640625;17.85997314453125
1622894860.6407197;295.23994140625;18.519970703125
1622894860.6497056;293.179931640625;19.319970703125
1622894860.6586719;291.119921875;20.37996826171875
1622894860.667519;288.359912109375;21.4399658203125
1622894860.6757133;285.179931640625;22.07996826171875
1622894860.6856053;281.979931640625;22.519970703125
1622894860.6962607;277.819921875;22.77996826171875
1622894860.70827;272.419921875;22.93997802734375
1622894860.7175217;266.33994140625;23.3599853515625
1622894860.7257946;259.5599609375;23.99998779296875
1622894860.7339282;252.519970703125;23.839990234375
1622894860.7440007;246.739990234375;24.2199951171875
1622894860.7544699;241.17998046875;23.97999267578125
1622894860.7663531;235.47998046875;23.8599853515625
1622894860.7737238;235.47998046875;23.8599853515625
1622894860.7856956;235.47998046875;23.8599853515625
1622894860.7951102;235.47998046875;23.8599853515625
1622894860.8055484;235.47998046875;23.8599853515625
1622894860.8192728;235.47998046875;23.8599853515625
1622894860.8307033;-82.199951171875;0.0999755859375
1622894860.8416882;-93.7498779296875;-1.20001220703125
1622894860.8507771;-110.49991861979167;-1.9666748046875
1622894860.8593652;-124.4249267578125;-3.225006103515625
1622894860.8686135;-143.579931640625;-4.54000244140625
1622894860.876072;-143.579931640625;-4.54000244140625
1622894860.8876;-143.579931640625;-4.54000244140625
1622894860.8982577;-143.579931640625;-4.54000244140625
1622894860.9096668;-143.579931640625;-4.54000244140625
1622894860.9207213;-143.579931640625;-4.54000244140625
1622894860.930695;-143.579931640625;-4.54000244140625
1622894860.9405377;-143.579931640625;-4.54000244140625
1622894860.9487143;-143.579931640625;-4.54000244140625
1622894860.9606714;-143.579931640625;-4.54000244140625
1622894860.9706986;-143.579931640625;-4.54000244140625
1622894860.9806912;-143.579931640625;-4.54000244140625
1622894860.9907634;-143.579931640625;-4.54000244140625
1622894860.99871;-143.579931640625;-4.54000244140625
1622894861.009547;-143.579931640625;-4.54000244140625
1622894861.020702;-143.579931640625;-4.54000244140625
1622894861.0311315;-143.579931640625;-4.54000244140625
1622894861.0402958;-143.579931640625;-4.54000244140625
1622894861.048716;-143.579931640625;-4.54000244140625
1622894861.056721;-143.579931640625;-4.54000244140625
1622894861.0682812;-143.579931640625;-4.54000244140625
1622894861.078602;-143.579931640625;-4.54000244140625
1622894861.089726;-143.579931640625;-4.54000244140625
1622894861.1015239;-143.579931640625;-4.54000244140625
1622894861.112602;-143.579931640625;-4.54000244140625
1622894861.122143;-143.579931640625;-4.54000244140625
1622894861.135207;-143.579931640625;-4.54000244140625
1622894861.14556;-143.579931640625;-4.54000244140625
1622894861.1567414;-143.579931640625;-4.54000244140625
1622894861.1683095;-143.579931640625;-4.54000244140625
1622894861.1786573;-143.579931640625;-4.54000244140625
1622894861.189729;-143.579931640625;-4.54000244140625
1622894861.1990817;-143.579931640625;-4.54000244140625
1622894861.2074025;-143.579931640625;-4.54000244140625
1622894861.2159414;-143.579931640625;-4.54000244140625
1622894861.2244413;-143.579931640625;-4.54000244140625
1622894861.2327127;-143.579931640625;-4.54000244140625
1622894861.2438867;-143.579931640625;-4.54000244140625
1622894861.253723;-143.579931640625;-4.54000244140625
1622894861.263674;-143.579931640625;-4.54000244140625
1622894861.2739394;-143.579931640625;-4.54000244140625
1622894861.282276;-143.579931640625;-4.54000244140625
1622894861.2905421;-143.579931640625;-4.54000244140625
1622894861.3011048;-143.579931640625;-4.54000244140625
1622894861.311641;-143.579931640625;-4.54000244140625
1622894861.3225918;-143.579931640625;-4.54000244140625
1622894861.331335;62.2000732421875;0.4000091552734375
1622894861.341526;65.050048828125;-0.149993896484375
1622894861.3503504;62.500040690104164;-0.13332621256510416
1622894861.3591788;60.85003662109375;-0.3499946594238281
1622894861.3667092;56.7200439453125;-0.5399932861328125
1622894861.3790958;47.200048828125;-0.97999267578125
1622894861.3910642;47.200048828125;-0.97999267578125
1622894861.3992176;47.200048828125;-0.97999267578125
1622894861.4096513;47.200048828125;-0.97999267578125
1622894861.4185305;47.200048828125;-0.97999267578125
1622894861.427688;47.200048828125;-0.97999267578125
1622894861.4369075;47.200048828125;-0.97999267578125
1622894861.4459004;47.200048828125;-0.97999267578125
1622894861.4555433;47.200048828125;-0.97999267578125
1622894861.4649975;-70.199951171875;-2.0
1622894861.4736483;-78.39996337890625;-2.3499984741210938
1622894861.4819863;-86.26664225260417;-2.5333353678385415
1622894861.493019;-107.07498168945312;-2.8750038146972656
1622894861.5028985;-107.07498168945312;-2.8750038146972656
1622894861.512372;-107.07498168945312;-2.8750038146972656
1622894861.5213811;-107.07498168945312;-2.8750038146972656
1622894861.5304363;-107.07498168945312;-2.8750038146972656
1622894861.5390363;-107.07498168945312;-2.8750038146972656
1622894861.5476022;-107.07498168945312;-2.8750038146972656
1622894861.555954;-107.07498168945312;-2.8750038146972656
1622894861.5691319;46.0999755859375;-4.100006103515625
1622894861.5794036;41.29998779296875;-3.4500045776367188
1622894861.5905142;40.299967447916664;-3.600006103515625
1622894861.5987573;39.39996337890625;-3.7000045776367188
1622894861.6073642;39.5999755859375;-3.8200042724609373
1622894861.6157541;35.4599853515625;-3.6000030517578123
1622894861.6273293;32.9599853515625;-3.64000244140625
1622894861.6377065;23.8599853515625;-3.2600006103515624
1622894861.6485336;13.6;-2.8600006103515625
1622894861.657641;2.57998046875;-2.5
1622894861.6665893;-8.7400390625;-2.7
1622894861.6741436;-23.7800537109375;-2.74000244140625
1622894861.6845708;-35.6400390625;-2.9000030517578126
1622894861.693591;-48.900048828125;-2.960003662109375
1622894861.7030075;-63.1400390625;-3.1800048828125
1622894861.7117956;-83.2600341796875;-2.92000732421875
1622894861.7206504;-83.2600341796875;-2.92000732421875
1622894861.729797;-83.2600341796875;-2.92000732421875
1622894861.7391486;-83.2600341796875;-2.92000732421875
1622894861.751089;-83.2600341796875;-2.92000732421875
1622894861.7606523;-83.2600341796875;-2.92000732421875
1622894861.7706912;-54.7000732421875;0.8000030517578125
1622894861.780577;-67.2000732421875;0.9000015258789062
1622894861.7901669;-70.00004069010417;0.5
1622894861.798624;-74.550048828125;0.2999992370605469
1622894861.8067727;-77.9400390625;0.1600006103515625
1622894861.8191333;-77.9400390625;0.1600006103515625
1622894861.8282511;-77.9400390625;0.1600006103515625
1622894861.8376002;-77.9400390625;0.1600006103515625
1622894861.8474264;-77.9400390625;0.1600006103515625
1622894861.8598802;-77.9400390625;0.1600006103515625
1622894861.8695242;-77.9400390625;0.1600006103515625
1622894861.8789198;-77.9400390625;0.1600006103515625
1622894861.8895104;-77.9400390625;0.1600006103515625
1622894861.9014144;-77.9400390625;0.1600006103515625
1622894861.9113357;-77.9400390625;0.1600006103515625
1622894861.920106;-77.9400390625;0.1600006103515625
1622894861.9297602;-77.9400390625;0.1600006103515625
1622894861.9394808;-77.9400390625;0.1600006103515625
1622894861.9476414;-77.9400390625;0.1600006103515625
1622894861.959729;-77.9400390625;0.1600006103515625
1622894861.9697673;-77.9400390625;0.1600006103515625
1622894861.9791675;-77.9400390625;0.1600006103515625
1622894861.988878;-77.9400390625;0.1600006103515625
1622894861.997659;-77.9400390625;0.1600006103515625
1622894862.0057619;-77.9400390625;0.1600006103515625
1622894862.018281;-77.9400390625;0.1600006103515625
1622894862.027759;-77.9400390625;0.1600006103515625
1622894862.0374155;-77.9400390625;0.1600006103515625
1622894862.0471158;-77.9400390625;0.1600006103515625
1622894862.055653;-77.9400390625;0.1600006103515625
1622894862.0638952;-77.9400390625;0.1600006103515625
1622894862.0736668;89.699951171875;-4.399993896484375
1622894862.0817444;77.74993896484375;-4.549995422363281
1622894862.093988;70.03328450520833;-4.2333323160807295
1622894862.104081;65.324951171875;-4.174999237060547
1622894862.1139524;61.0199462890625;-4.179998779296875
1622894862.124149;49.5599609375;-4.179998779296875
1622894862.132675;37.8399658203125;-4.160000610351562
1622894862.1407664;37.8399658203125;-4.160000610351562
1622894862.1515684;37.8399658203125;-4.160000610351562
1622894862.161604;-62.5999755859375;0.399993896484375
1622894862.17171;-80.20001220703125;-0.0500030517578125
1622894862.1809363;-80.20001220703125;-0.0500030517578125
1622894862.1931705;-80.20001220703125;-0.0500030517578125
1622894862.2030706;-80.20001220703125;-0.0500030517578125
1622894862.2127512;-80.20001220703125;-0.0500030517578125
1622894862.2232006;-95.300048828125;-0.79998779296875
1622894862.2353973;-96.35003662109375;-1.8499908447265625
1622894862.2457252;-104.86669921875;-2.433324178059896
1622894862.2565355;-117.60002136230469;-2.3499908447265625
1622894862.26796;-117.60002136230469;-2.3499908447265625
1622894862.2777677;-117.60002136230469;-2.3499908447265625
1622894862.286885;-117.60002136230469;-2.3499908447265625
1622894862.2966697;-117.60002136230469;-2.3499908447265625
1622894862.3075788;-117.60002136230469;-2.3499908447265625
1622894862.3146846;-117.60002136230469;-2.3499908447265625
1622894862.3259747;-117.60002136230469;-2.3499908447265625
1622894862.3358877;-117.60002136230469;-2.3499908447265625
1622894862.3458095;-117.60002136230469;-2.3499908447265625
1622894862.355729;-117.60002136230469;-2.3499908447265625
1622894862.3683774;-117.60002136230469;-2.3499908447265625
1622894862.3783467;-117.60002136230469;-2.3499908447265625
1622894862.3871155;-117.60002136230469;-2.3499908447265625
1622894862.396895;-117.60002136230469;-2.3499908447265625
1622894862.4057722;-117.60002136230469;-2.3499908447265625
1622894862.4144652;-117.60002136230469;-2.3499908447265625
1622894862.422691;-117.60002136230469;-2.3499908447265625
1622894862.4348693;-117.60002136230469;-2.3499908447265625
1622894862.444897;-117.60002136230469;-2.3499908447265625
1622894862.4538896;-117.60002136230469;-2.3499908447265625
1622894862.4638996;-117.60002136230469;-2.3499908447265625
1622894862.4727283;-117.60002136230469;-2.3499908447265625
1622894862.4809058;-117.60002136230469;-2.3499908447265625
1622894862.4931805;-117.60002136230469;-2.3499908447265625
1622894862.5031037;-117.60002136230469;-2.3499908447265625
1622894862.512824;-117.60002136230469;-2.3499908447265625
1622894862.522656;-117.60002136230469;-2.3499908447265625
1622894862.5357487;-117.60002136230469;-2.3499908447265625
