Image center coordinates: 
1622282440.3059046;3.0;-0.399993896484375
1622282440.3167634;6.149993896484375;0.100006103515625
1622282440.3268852;7.0;-0.0333251953125
1622282440.3393435;6.475006103515625;0.20000457763671875
1622282440.349856;4.44000244140625;0.360003662109375
1622282440.3631368;0.9800048828125;1.060003662109375
1622282440.3721042;-5.739990234375;1.760003662109375
1622282440.3827882;-15.239990234375;2.74000244140625
1622282440.395803;-26.639990234375;4.060003662109375
1622282440.404779;-38.09998779296875;5.660003662109375
1622282440.413901;-47.71998291015625;7.1
1622282440.4230986;-55.5599853515625;8.3
1622282440.4348476;-59.839990234375;9.539996337890624
1622282440.4460943;-60.839990234375;10.439996337890625
1622282440.4559186;-58.3599853515625;11.139996337890626
1622282440.4672554;-53.6599853515625;11.620001220703125
1622282440.478778;-46.19998779296875;12.020001220703126
1622282440.4889112;-36.31998291015625;12.300006103515624
1622282440.4971886;-24.41998291015625;12.42000732421875
1622282440.5093977;-11.1599853515625;12.460009765625
1622282440.521852;4.10001220703125;12.760009765625
1622282440.5307906;19.6400146484375;13.280010986328126
1622282440.5413737;34.560009765625;13.82000732421875
1622282440.5534139;47.860009765625;14.740008544921874
1622282440.562906;58.2800048828125;15.760003662109375
1622282440.5713685;64.2;16.9
1622282440.5817113;66.8;18.339996337890625
1622282440.593425;65.0;19.65999755859375
1622282440.6034703;60.2199951171875;20.37999267578125
1622282440.6127312;53.0;23.939996337890626
1622282440.6228292;53.0;23.939996337890626
1622282440.6326976;53.0;23.939996337890626
1622282440.6427448;53.0;23.939996337890626
1622282440.6529317;-12.70001220703125;1.399993896484375
1622282440.6629221;-10.600006103515625;1.8499908447265625
1622282440.6729035;-7.366678873697917;1.7666524251302083
1622282440.6839168;-4.1000213623046875;2.4749832153320312
1622282440.6958466;-1.42001953125;2.71998291015625
1622282440.704903;3.87998046875;3.27998046875
1622282440.7149177;8.83997802734375;3.499981689453125
1622282440.726201;11.97998046875;4.539984130859375
1622282440.7379272;12.839990234375;4.739984130859375
1622282440.7467098;11.939990234375;4.59998779296875
1622282440.7587981;8.49998779296875;4.579986572265625
1622282440.7699566;1.71998291015625;4.2599853515625
1622282440.7795062;-6.78001708984375;2.639984130859375
1622282440.7889223;-15.9000244140625;1.09998779296875
1622282440.800464;-25.480029296875;-0.20001220703125
1622282440.8128788;-34.780029296875;-2.60001220703125
1622282440.82261;-41.5000244140625;-4.420013427734375
1622282440.8306234;-45.9000244140625;-5.860009765625
1622282440.8429155;-47.8000244140625;-7.50001220703125
1622282440.8537452;-46.96002197265625;-8.920013427734375
1622282440.8629446;-43.74002685546875;-9.380010986328125
1622282440.872424;-38.980029296875;-10.280010986328126
1622282440.8837347;-31.62003173828125;-10.980010986328125
1622282440.8959239;-22.9600341796875;-11.62000732421875
1622282440.9048204;-14.8400390625;-12.260009765625
1622282440.9139385;-7.9400390625;-13.00001220703125
1622282440.9259145;-3.7600341796875;-13.620013427734374
1622282440.9377267;-4.5600341796875;-14.48001708984375
1622282440.9469223;-10.02003173828125;-15.48001708984375
1622282440.9557602;-18.34002685546875;-16.9400146484375
1622282440.96411;-29.32001953125;-18.90001220703125
1622282440.976592;-42.3000244140625;-21.260009765625
1622282440.9868762;-54.96002197265625;-24.040008544921875
1622282440.995875;-65.88001708984375;-26.660009765625
1622282441.0048544;-74.80001220703124;-28.840008544921876
1622282441.0139487;-80.3400146484375;-30.62000732421875
1622282441.0262556;-81.260009765625;-31.82000732421875
1622282441.0371566;-78.78001708984375;-32.30000610351563
1622282441.046903;-74.66002197265625;-32.80000610351563
1622282441.0558028;-68.2000244140625;-32.940008544921874
1622282441.0649388;-60.72001953125;-33.00001220703125
1622282441.0762753;-52.16002197265625;-33.30001220703125
1622282441.087685;-44.16002197265625;-33.68001098632813
1622282441.0964816;-37.6400146484375;-33.9400146484375
1622282441.1064873;-34.36002197265625;-34.520013427734376
1622282441.1184664;-35.26002197265625;-35.660009765625
1622282441.1279523;-40.34002685546875;-36.84000854492187
1622282441.1379452;-49.48001708984375;-38.980010986328125
1622282441.1464145;-61.26002197265625;-41.62000732421875
1622282441.156847;-74.30001220703124;-44.90000610351562
1622282441.1679778;-86.42001953125;-47.660009765625
1622282441.1793675;-96.6400146484375;-50.080010986328126
1622282441.1889822;-103.28001708984375;-51.50001220703125
1622282441.1975942;-106.26002197265625;-52.320013427734374
1622282441.209631;-105.8000244140625;-52.28001708984375
1622282441.2217634;-101.92001953125;-52.12001342773438
1622282441.2307932;-97.26002197265625;-51.920013427734375
1622282441.239962;-93.06002197265624;-51.320013427734374
1622282441.2512076;-90.9400146484375;-50.860015869140625
1622282441.2634032;-91.96002197265625;-50.3400146484375
1622282441.272473;-97.26002197265625;-50.2400146484375
1622282441.283941;-107.18001708984374;-50.56001586914063
1622282441.2965055;-120.76002197265625;-51.72001342773437
1622282441.3055794;-136.2000244140625;-52.980010986328125
1622282441.3139398;-152.48001708984376;-54.880010986328124
1622282441.3225634;-168.02001953125;-56.560009765625
1622282441.3339083;-181.06002197265624;-57.540008544921875
1622282441.344953;-191.62001953125;-58.22000732421875
1622282441.3542619;-198.32001953125;-58.040008544921875
1622282441.3639462;-201.92001953125;-57.600006103515625
1622282441.3729434;-203.26002197265626;-57.200006103515626
1622282441.381883;-202.680029296875;-57.80000610351563
1622282441.3935134;-198.82003173828124;-58.40000610351562
1622282441.4029555;-193.02003173828126;-85.82000732421875
1622282441.4128087;-193.02003173828126;-85.82000732421875
1622282441.4209201;-193.02003173828126;-85.82000732421875
1622282441.4298866;-193.02003173828126;-85.82000732421875
1622282441.4389224;-193.02003173828126;-85.82000732421875
1622282441.449783;-193.02003173828126;-85.82000732421875
1622282441.4608164;-193.02003173828126;-85.82000732421875
1622282441.4697645;-193.02003173828126;-85.82000732421875
1622282441.4785845;-193.02003173828126;-85.82000732421875
1622282441.4869618;-193.02003173828126;-85.82000732421875
1622282441.4955993;-193.02003173828126;-85.82000732421875
1622282441.504606;-193.02003173828126;-85.82000732421875
1622282441.5119505;-193.02003173828126;-85.82000732421875
1622282441.5246475;-193.02003173828126;-85.82000732421875
1622282441.5356286;-193.02003173828126;-85.82000732421875
1622282441.5476706;-193.02003173828126;-85.82000732421875
1622282441.558843;-193.02003173828126;-85.82000732421875
1622282441.5691562;-193.02003173828126;-85.82000732421875
1622282441.5776806;-193.02003173828126;-85.82000732421875
1622282441.5874252;-170.0;-61.5
1622282441.5957422;-173.6500244140625;-61.80000305175781
1622282441.6048677;-176.20003255208334;-62.23333740234375
1622282441.613948;-178.1500244140625;-62.50000762939453
1622282441.6229382;-178.96002197265625;-62.72000732421875
1622282441.6319025;-180.84002685546875;-62.940008544921874
1622282441.6424193;-181.02001953125;-62.960009765625
1622282441.6532574;-179.92001953125;-62.960009765625
1622282441.6619427;-177.84002685546875;-62.84000854492187
1622282441.670683;-176.180029296875;-62.60001220703125
1622282441.6787648;-175.9000244140625;-62.62001342773438
1622282441.6869884;-176.7000244140625;-62.960015869140626
1622282441.6978893;-179.6000244140625;-63.00001831054688
1622282441.708024;-184.74002685546876;-64.16001586914062
1622282441.7185726;-191.3000244140625;-65.1400146484375
1622282441.7273636;-198.76002807617186;-66.3400146484375
1622282441.7356195;-206.580029296875;-68.2400146484375
1622282441.74788;-213.8000244140625;-70.28001098632812
1622282441.7581139;-219.90001831054687;-71.50001220703125
1622282441.7687266;-225.04002075195314;-73.72001342773437
1622282441.7769897;-228.0000244140625;-75.26001586914063
1622282441.7897642;-229.04002685546874;-76.22001342773437
1622282441.7998793;-229.2000244140625;-76.48001708984376
1622282441.8098338;-228.88002319335936;-77.34002075195312
1622282441.8188534;-228.4400207519531;-77.20001831054688
1622282441.8286061;-229.70001831054688;-77.38001708984375
1622282441.8359866;-232.50001831054686;-77.78001708984375
1622282441.8452606;-236.1000183105469;-79.52001342773437
1622282441.85595;-241.46002197265625;-80.68001098632813
1622282441.8666892;-247.72002563476562;-82.78001098632812
1622282441.876881;-254.3200256347656;-85.28001098632812
1622282441.8867202;-260.08002319335935;-87.160009765625
1622282441.8949752;-258.72002563476565;-90.4400146484375
1622282441.900977;-258.72002563476565;-90.4400146484375
1622282441.9137692;-258.72002563476565;-90.4400146484375
1622282441.9237049;-258.72002563476565;-90.4400146484375
1622282441.933981;25.20001220703125;8.29998779296875
1622282441.9458702;31.100006103515625;8.599990844726562
1622282441.9537554;37.066670735677086;9.999989827473959
1622282441.9619668;42.225006103515625;10.674995422363281
1622282441.9747438;46.0800048828125;11.179998779296875
1622282441.9854288;52.82000732421875;12.279998779296875
1622282441.993973;56.360009765625;13.2
1622282442.0035782;56.5800048828125;13.24000244140625
1622282442.0121596;53.64000244140625;12.84000244140625
1622282442.0211449;47.72000732421875;11.920001220703124
1622282442.0289404;40.0800048828125;9.960003662109376
1622282442.0409894;30.4;7.4800048828125
1622282442.0521467;20.1800048828125;4.9800048828125
1622282442.0647814;11.600006103515625;3.0800048828125
1622282442.0749507;6.020001220703125;1.4800048828125
1622282442.0868964;3.9;0.400006103515625
1622282442.0949788;6.260003662109375;0.0800048828125
1622282442.103933;11.04000244140625;-0.5199951171875
1622282442.1119769;16.800006103515624;-0.45999755859375
1622282442.1247683;22.280010986328126;-0.2
1622282442.1354914;26.7800048828125;0.7
1622282442.1456075;29.579998779296876;0.45999755859375
1622282442.1545923;30.14000244140625;0.6
1622282442.1619804;28.479998779296874;-0.720001220703125
1622282442.175125;24.27999267578125;-2.9
1622282442.1867821;17.639996337890626;-5.460003662109375
1622282442.1958964;9.220001220703125;-7.760003662109375
1622282442.2037382;1.820001220703125;-10.7800048828125
1622282442.2119782;-4.379998779296875;-12.900006103515626
1622282442.22473;-8.15999755859375;-14.540008544921875
1622282442.2357426;-8.15999755859375;-14.540008544921875
1622282442.243974;-8.15999755859375;-14.540008544921875
1622282442.2550664;-8.15999755859375;-14.540008544921875
1622282442.2659492;-8.15999755859375;-14.540008544921875
1622282442.276987;157.0999755859375;36.79998779296875
1622282442.2897904;169.94998168945312;38.54998779296875
1622282442.2999675;181.86665852864584;38.933329264322914
1622282442.3117652;193.375;39.04999542236328
1622282442.3208036;203.24000244140626;39.179998779296874
1622282442.3288288;222.8800048828125;39.379998779296876
1622282442.3370006;237.74000244140626;38.97999877929688
1622282442.3478684;246.94000244140625;38.739996337890624
1622282442.3579612;250.75999755859374;38.25999755859375
1622282442.3686993;249.9;37.75999755859375
1622282442.3812363;243.82000732421875;37.820001220703126
1622282442.3919058;234.58001708984375;38.02000122070312
1622282442.4022336;223.960009765625;38.260003662109376
1622282442.411989;214.10001220703126;38.94000244140625
1622282442.4208689;205.94000244140625;39.64000244140625
1622282442.428714;201.05999755859375;40.6
1622282442.4377906;199.839990234375;41.660003662109375
1622282442.4458656;202.27999267578124;42.560003662109374
1622282442.4579635;206.99998779296874;43.02000732421875
1622282442.4686797;213.49998779296874;43.260003662109376
1622282442.4769874;221.09998779296876;43.24000244140625
1622282442.4898295;228.99998779296874;42.86000366210938
1622282442.4999325;235.67999267578125;42.57999877929687
1622282442.5109835;239.439990234375;42.739996337890624
1622282442.518978;240.17999267578125;42.97999877929688
1622282442.5288458;237.65999755859374;43.1
1622282442.5374532;232.1199951171875;43.13999633789062
1622282442.5459828;224.45999755859376;42.97999877929688
1622282442.5538676;215.6;43.1
1622282442.5628421;206.5;43.239996337890624
1622282442.5713167;197.97999267578126;43.5
1622282442.5789087;189.95999755859376;43.96000366210937
1622282442.5897818;183.539990234375;44.600006103515625
1622282442.5999684;178.39998779296874;45.0800048828125
1622282442.6117709;174.939990234375;45.42000732421875
1622282442.6208336;172.05999755859375;45.92000732421875
1622282442.628938;170.64000244140624;46.060003662109374
1622282442.6375167;169.660009765625;46.320001220703126
1622282442.645899;169.18001708984374;46.179998779296874
1622282442.6579726;167.96002197265625;46.120001220703124
1622282442.6688366;166.6400146484375;45.779998779296875
1622282442.6777072;164.060009765625;46.04000244140625
1622282442.687757;160.860009765625;46.34000244140625
1622282442.695497;156.060009765625;46.72000732421875
1622282442.7038736;149.8800048828125;47.34000244140625
1622282442.7128057;142.80001220703124;47.74000244140625
1622282442.7225862;134.30001220703124;47.5
1622282442.7334633;124.62000732421875;47.3
1622282442.7439814;114.42000732421874;47.25999755859375
1622282442.7539804;104.50001220703125;46.75999755859375
1622282442.7619417;94.84000244140626;46.5
1622282442.7716331;86.7800048828125;46.47999877929688
1622282442.778928;79.4;46.1
1622282442.7917721;73.2;45.8
1622282442.8028135;67.5;45.5
1622282442.8109515;62.160009765625;45.13999633789062
1622282442.8229184;56.2800048828125;44.439996337890626
1622282442.8329277;50.22000732421875;43.799993896484374
1622282442.8429303;43.9800048828125;42.65999145507813
1622282442.856411;37.05999755859375;41.27999267578125
1622282442.8668368;29.87999267578125;39.4199951171875
1622282442.8787706;22.95999755859375;37.679998779296874
1622282442.8877897;16.520001220703126;35.55999755859375
1622282442.8955567;10.5;33.6
1622282442.9039578;5.2800048828125;31.920001220703124
1622282442.9129586;0.64000244140625;30.64000244140625
1622282442.9227707;-2.679998779296875;29.579998779296876
1622282442.9329524;-4.779998779296875;29.0
1622282442.9438033;-5.4;28.279998779296875
1622282442.9536457;-4.7800048828125;28.039996337890624
1622282442.9625509;-2.3800048828125;27.139996337890626
1622282442.971713;2.359991455078125;25.85999755859375
1622282442.979948;7.39998779296875;24.179998779296874
1622282442.9883578;13.039990234375;22.35999755859375
1622282443.0003548;23.4199951171875;23.3
1622282443.0113037;23.4199951171875;23.3
1622282443.0197296;23.4199951171875;23.3
1622282443.0279143;23.4199951171875;23.3
1622282443.0388083;23.4199951171875;23.3
1622282443.0489721;23.4199951171875;23.3
1622282443.0580964;23.4199951171875;23.3
1622282443.0679777;23.4199951171875;23.3
1622282443.0806582;23.4199951171875;23.3
1622282443.0907817;23.4199951171875;23.3
1622282443.1018653;23.4199951171875;23.3
1622282443.1119866;23.4199951171875;23.3
1622282443.119979;23.4199951171875;23.3
1622282443.1306844;23.4199951171875;23.3
1622282443.1408646;23.4199951171875;23.3
1622282443.1519005;23.4199951171875;23.3
1622282443.161103;23.4199951171875;23.3
1622282443.1692786;23.4199951171875;23.3
1622282443.1816747;37.89996337890625;98.60003662109375
1622282443.1918592;44.64996337890625;107.05001831054688
1622282443.202717;51.666646321614586;112.36667887369792
1622282443.212593;57.52497863769531;115.92501831054688
1622282443.220892;61.57998046875;118.5400146484375
1622282443.2289307;69.739990234375;125.28001708984375
1622282443.2372396;74.6199951171875;128.16002197265624
1622282443.247928;74.87999267578125;128.8000244140625
1622282443.2584105;71.25999755859375;126.62001953125
1622282443.2679894;64.27999267578124;121.42001953125
1622282443.2815523;52.639990234375;112.32001953125
1622282443.2919512;36.77999267578125;101.7400146484375
1622282443.3037448;19.3199951171875;91.10001220703126
1622282443.3109987;3.45999755859375;81.40001220703125
1622282443.3208914;-9.9;74.08001708984375
1622282443.3299704;-18.32000732421875;69.80001220703124
1622282443.3374755;-21.60001220703125;67.4400146484375
1622282443.3490005;-20.16002197265625;65.86002197265626
1622282443.3608086;-16.580029296875;65.66002197265625
1622282443.372978;-9.280029296875;65.14002685546875
1622282443.3829787;0.25997314453125;64.94002685546874
1622282443.3938606;11.37998046875;65.42003173828125
1622282443.403737;23.41998291015625;65.92003173828125
1622282443.4125621;34.39998779296875;66.50003662109376
1622282443.4218023;41.8599853515625;67.42003173828125
1622282443.4299817;45.2599853515625;68.00003662109376
1622282443.4379747;45.63997802734375;68.80003662109375
1622282443.449858;41.3999755859375;69.180029296875
1622282443.4607453;33.53997802734375;69.34002685546875
1622282443.4690058;22.67998046875;69.42003173828125
1622282443.4789438;10.99998779296875;69.74002685546876
1622282443.487935;-1.7800048828125;69.2000244140625
1622282443.495937;-13.55999755859375;68.72003173828125
1622282443.504008;-23.6800048828125;68.2600341796875
1622282443.516301;-32.02000732421875;67.480029296875
1622282443.5268795;-37.4400146484375;56.980029296875
1622282443.5398846;-37.4400146484375;56.980029296875
1622282443.5499442;-37.4400146484375;56.980029296875
1622282443.5597546;-37.4400146484375;56.980029296875
1622282443.569352;-37.4400146484375;56.980029296875
1622282443.5779357;-37.4400146484375;56.980029296875
1622282443.5874238;-37.79998779296875;-2.5999755859375
1622282443.595781;-38.25;-2.199951171875
1622282443.6040077;-37.666666666666664;-2.8332926432291665
1622282443.6163218;-36.55000305175781;-3.64996337890625
1622282443.626969;-35.960009765625;-4.019970703125
1622282443.6369798;-35.32001953125;-4.6999755859375
1622282443.6459463;-35.72001953125;-5.739990234375
1622282443.6540267;-38.26002197265625;-6.3199951171875
1622282443.666009;-44.84002685546875;-7.2
1622282443.6768787;-54.5000244140625;-8.2599853515625
1622282443.6857858;-66.56002197265624;-9.8999755859375
1622282443.6958427;-80.16002197265625;-12.4399658203125
1622282443.7039597;-93.46002197265625;-15.2399658203125
1622282443.7149146;-104.62001953125;-17.099951171875
1622282443.7250073;-112.36002197265626;-19.3199462890625
1622282443.7356565;-117.3400146484375;-20.0599365234375
1622282443.7460167;-118.42001953125;-19.2999267578125
1622282443.753892;-117.08001708984375;-18.259912109375
1622282443.7634;-112.80001220703124;-16.8399169921875
1622282443.770876;-106.74000244140625;-14.819921875
1622282443.782827;-97.7800048828125;-12.779931640625
1622282443.7939155;-86.75999755859375;-11.099951171875
1622282443.8037472;-74.45999755859376;-8.8799560546875
1622282443.8128588;-61.8199951171875;-7.1399658203125
1622282443.8208857;-49.2;-5.8599609375
1622282443.8327582;-38.24000244140625;-5.0799560546875
1622282443.8448803;-30.24000244140625;-4.899951171875
1622282443.8543437;-24.8;-4.9199462890625
1622282443.862424;-22.2;-5.3599365234375
1622282443.8718872;-22.14000244140625;-5.9199462890625
1622282443.8799868;-23.82000732421875;-6.799951171875
1622282443.8886085;-25.7800048828125;-7.2799560546875
1622282443.9009206;-27.1800048828125;-8.019970703125
1622282443.9120185;-27.1800048828125;-8.27998046875
1622282443.9209933;-25.7800048828125;-7.7599853515625
1622282443.9300046;-23.35999755859375;-7.4199951171875
1622282443.9386628;-20.35999755859375;-6.7999755859375
1622282443.9469664;-17.0800048828125;-5.8999755859375
1622282443.956216;-14.72000732421875;-5.3999755859375
1622282443.967437;-14.82000732421875;-5.5399658203125
1622282443.9792113;-17.00001220703125;-5.5799560546875
1622282443.9873111;-22.0400146484375;-5.919970703125
1622282443.9959319;-30.060009765625;-7.3399658203125
1622282444.0040145;-39.72000732421875;-8.5399658203125
1622282444.0160685;-51.32000732421875;-9.8399658203125
1622282444.0269685;-64.44000244140625;-11.519970703125
1622282444.0369916;-76.3800048828125;-13.6799560546875
1622282444.0449207;-86.660009765625;-14.9599609375
1622282444.0537534;-95.32001953125;-16.2599609375
1622282444.062906;-100.38001708984375;-17.3799560546875
1622282444.0719483;-102.46002197265625;-17.8199462890625
1622282444.080009;-103.2000244140625;-17.4799560546875
1622282444.0886;-102.8000244140625;-17.1199462890625
1622282444.0969505;-101.22001953125;-16.2199462890625
1622282444.1049986;-99.26002197265625;-15.0599609375
1622282444.116853;-97.12001953125;-13.5599609375
1622282444.1276348;-95.10001220703126;-12.5399658203125
1622282444.136606;-94.2800048828125;-11.5599609375
1622282444.145397;-95.5800048828125;-10.9599609375
1622282444.154021;-98.72000732421876;-10.7199462890625
1622282444.1622782;-103.64000244140625;-10.999951171875
1622282444.1749084;-111.30001220703124;-11.3199462890625
1622282444.1856933;-120.78001708984375;-12.33994140625
1622282444.1956615;-130.62001953125;-13.479931640625
1622282444.2043982;-140.760009765625;-14.399951171875
1622282444.2130883;-151.08001708984375;-15.699951171875
1622282444.221888;-159.78001708984374;-16.6599609375
1622282444.2298653;-166.60001220703126;-17.0999755859375
1622282444.2386417;-172.50001220703126;-17.87998046875
1622282444.250465;-177.62001953125;-18.5399658203125
1622282444.2622917;-182.10001220703126;-18.919970703125
1622282444.2714102;-186.74000244140626;-19.7599609375
1622282444.2789836;-192.14000854492187;-20.4799560546875
1622282444.2873943;-198.04000854492188;-21.399951171875
1622282444.2959967;-204.4800048828125;-22.4399658203125
1622282444.3040254;-211.50001220703126;-23.2399658203125
1622282444.3150034;-219.7400146484375;-23.6399658203125
1622282444.3292713;-228.2200134277344;-24.719970703125
1622282444.3399875;-236.82001342773438;-24.67998046875
1622282444.3502066;-244.98001708984376;-24.6999755859375
1622282444.3601716;-251.20001220703125;-24.819970703125
1622282444.4309785;-254.70001220703125;-24.6399658203125
1622282444.4389238;-257.8400146484375;-23.699951171875
1622282444.4483361;-260.3000122070313;-23.799951171875
1622282444.4571846;-262.6000122070312;-23.83994140625
1622282444.466216;-265.0600158691406;-24.3599365234375
1622282444.4752035;-268.3000183105469;-25.1199462890625
1622282444.4839678;-270.0600158691406;-25.7599609375
1622282444.493074;-270.96001586914065;-26.0199462890625
1622282444.5012112;-270.40001220703124;-26.0199462890625
1622282444.5129113;-268.9800109863281;-25.799951171875
1622282444.5228062;-265.90001220703124;-24.83994140625
1622282444.5322556;-262.3000122070313;-24.4599365234375
1622282444.5420663;-259.0400146484375;-23.8199462890625
1622282444.5501046;-256.4000183105469;-23.4799560546875
1622282444.5596628;-255.18001708984374;-22.7399658203125
1622282444.5671995;-256.3400146484375;-22.1999755859375
1622282444.575731;-255.00001220703126;-9.7999755859375
1622282444.5838075;-255.00001220703126;-9.7999755859375
1622282444.5930634;-255.00001220703126;-9.7999755859375
1622282444.6012812;-255.00001220703126;-9.7999755859375
1622282444.6118546;-255.00001220703126;-9.7999755859375
1622282444.6176662;-255.00001220703126;-9.7999755859375
1622282444.628043;-255.00001220703126;-9.7999755859375
1622282444.636114;33.4000244140625;13.70001220703125
1622282444.647175;42.800018310546875;17.600006103515625
1622282444.6560252;51.000020345052086;18.866658528645832
1622282444.6646967;57.675018310546875;20.349990844726562
1622282444.674082;63.12001953125;21.5599853515625
1622282444.6832094;73.38001708984375;23.81998291015625
1622282444.6919148;79.22001953125;24.5999755859375
1622282444.701463;81.260009765625;25.53997802734375
1622282444.7110069;80.04000244140624;26.01998291015625
1622282444.7190738;75.7;26.139990234375
1622282444.7300694;68.9199951171875;26.49998779296875
1622282444.7401118;60.37999267578125;25.99998779296875
1622282444.7493906;51.67999267578125;25.539990234375
1622282444.7590153;43.4199951171875;25.11998291015625
1622282444.7696614;37.739990234375;24.77998046875
1622282444.7780683;45.7199951171875;25.01998291015625
1622282444.7885313;45.7199951171875;25.01998291015625
1622282444.7984514;45.7199951171875;25.01998291015625
1622282444.8079221;45.7199951171875;25.01998291015625
1622282444.8174036;45.7199951171875;25.01998291015625
1622282444.8278413;88.9000244140625;14.20001220703125
1622282444.8360746;100.5;16.050018310546875
1622282444.8468697;113.26666259765625;17.23333740234375
1622282444.8568249;125.89999389648438;18.574996948242188
1622282444.8660567;137.2;19.94000244140625
1622282444.875068;158.439990234375;22.3
1622282444.8856702;176.7;23.97999267578125
1622282444.896882;187.7800048828125;25.67999267578125
1622282444.9068418;192.60001220703126;26.8
1622282444.916113;192.72000732421876;26.939990234375
1622282444.9256284;188.0400146484375;26.79998779296875
1622282444.9359245;179.160009765625;26.6599853515625
1622282444.9440584;170.12000732421876;25.3599853515625
1622282444.955105;158.1;23.83997802734375
1622282444.9650826;143.94000244140625;22.51998291015625
1622282444.9744732;129.05999755859375;21.339990234375
1622282444.9838748;115.5;19.7199951171875
1622282444.993969;102.94000244140625;18.8199951171875
1622282445.0051043;93.6800048828125;18.0199951171875
1622282445.0150971;87.8800048828125;17.55999755859375
1622282445.0247161;86.02000732421875;17.27999267578125
1622282445.0341055;86.6;17.3199951171875
1622282445.0446098;89.5;17.45999755859375
1622282445.0525742;94.2199951171875;18.15999755859375
1622282445.0637538;100.439990234375;18.9
1622282445.073682;106.69998779296876;19.3
1622282445.0838642;112.439990234375;20.0199951171875
1622282445.0938165;116.37999267578125;20.1199951171875
1622282445.106124;117.8199951171875;19.5800048828125
1622282445.115319;114.97999267578125;19.0199951171875
1622282445.1261144;108.539990234375;18.2
1622282445.1359882;98.79998779296875;16.3800048828125
1622282445.1442523;86.6599853515625;14.64000244140625
1622282445.1560962;71.9599853515625;12.7199951171875
1622282445.1660562;56.87999267578125;10.6800048828125
1622282445.174855;42.75999755859375;9.04000244140625
1622282445.1860788;30.2800048828125;8.3199951171875
1622282445.194609;21.05999755859375;7.7199951171875
1622282445.203939;15.85999755859375;7.7199951171875
1622282445.2117481;14.15999755859375;7.5599853515625
1622282445.2209308;14.84000244140625;7.43997802734375
1622282445.2288113;16.8800048828125;6.67998046875
1622282445.2370124;19.32000732421875;6.439990234375
1622282445.2480187;23.2800048828125;5.95999755859375
1622282445.2570796;27.44000244140625;5.64000244140625
1622282445.2681012;30.35999755859375;5.52000732421875
1622282445.2780273;32.439990234375;5.62000732421875
1622282445.286769;32.6199951171875;5.0800048828125
1622282445.2953057;29.5199951171875;4.0199951171875
1622282445.3035812;24.0;2.27999267578125
1622282445.3137152;16.5199951171875;-0.44000244140625
1622282445.3249676;7.05999755859375;-3.2
1622282445.3350503;-4.34000244140625;-5.54000244140625
1622282445.3440318;-16.27999267578125;-8.2
1622282445.3527708;-28.0199951171875;-10.87999267578125
1622282445.3615196;-38.5599853515625;-12.9199951171875
1622282445.3709977;-47.0599853515625;-15.039990234375
1622282445.3789465;-52.7599853515625;-16.97999267578125
1622282445.389789;-56.39998779296875;-18.0199951171875
1622282445.399915;-58.6599853515625;-18.6199951171875
1622282445.4099607;-59.239990234375;-19.2
1622282445.4194224;-59.7199951171875;-19.52000732421875
1622282445.4289937;-60.57999267578125;-20.160009765625
1622282445.4367495;-61.87999267578125;-21.12000732421875
1622282445.4479904;-64.5199951171875;-22.5400146484375
1622282445.4580626;-69.2199951171875;-24.80001220703125
1622282445.4679506;-75.3199951171875;-27.3800048828125
1622282445.478976;-82.8800048828125;-30.34000244140625
1622282445.4868374;-91.84000244140626;-34.25999755859375
1622282445.495056;-101.560009765625;-38.05999755859375
1622282445.5039794;-111.0400146484375;-41.24000244140625
1622282445.5138414;-120.660009765625;-44.94000244140625
1622282445.5239472;-129.5800048828125;-48.44000244140625
1622282445.5348647;-136.9400146484375;-51.44000244140625
1622282445.5446155;-142.9800048828125;-54.4
1622282445.5537658;-147.94000244140625;-57.07999267578125
1622282445.5645976;-151.54000244140624;-59.2
1622282445.573838;-154.55999755859375;-61.1
1622282445.5840626;-157.3199951171875;-62.9
1622282445.593898;-159.8199951171875;-64.64000244140625
1622282445.6064093;-163.4199951171875;-66.4800048828125
1622282445.6164248;-168.2;-68.0800048828125
1622282445.6260362;-172.1;-61.24000244140625
1622282445.6347396;-172.1;-61.24000244140625
1622282445.6449006;-172.1;-61.24000244140625
1622282445.6529438;-172.1;-61.24000244140625
1622282445.6638095;-172.1;-61.24000244140625
1622282445.6730957;-172.1;-61.24000244140625
1622282445.68264;-172.1;-61.24000244140625
1622282445.6920383;-172.1;-61.24000244140625
1622282445.701033;-172.1;-61.24000244140625
1622282445.7115443;-172.1;-61.24000244140625
1622282445.719883;-172.1;-61.24000244140625
1622282445.7305174;-172.1;-61.24000244140625
1622282445.7400649;-172.1;-61.24000244140625
1622282445.7495725;-172.1;-61.24000244140625
1622282445.7590826;-172.1;-61.24000244140625
1622282445.7698312;-172.1;-61.24000244140625
1622282445.778081;-172.1;-61.24000244140625
1622282445.7888064;-172.1;-61.24000244140625
1622282445.7988665;-172.1;-61.24000244140625
1622282445.8080697;-172.1;-61.24000244140625
1622282445.818843;25.4000244140625;67.199951171875
1622282445.8313937;28.95001220703125;62.2999267578125
1622282445.8414304;29.333353678385418;58.699951171875
1622282445.8514736;28.2750244140625;54.474945068359375
1622282445.8624582;25.580029296875;50.9799560546875
1622282445.8710053;22.080029296875;43.5599609375
1622282445.879051;15.2400390625;37.47998046875
1622282445.8898866;6.28004150390625;30.67998046875
1622282445.9000437;-4.3399658203125;25.239990234375
1622282445.9100735;-14.9399658203125;20.519970703125
1622282445.9205422;-24.79996337890625;16.4599609375
1622282445.9280088;-32.89996337890625;12.999951171875
1622282445.9398098;-38.09996337890625;11.23994140625
1622282445.9500573;-40.19996337890625;10.2999267578125
1622282445.9600716;-39.57996826171875;10.1199462890625
1622282445.9705384;-37.7999755859375;11.1199462890625
1622282445.9790645;-35.81998291015625;11.73994140625
1622282445.9877772;-34.37999267578125;13.03994140625
1622282445.9957516;-33.79998779296875;13.3799560546875
1622282446.004066;-35.47999267578125;12.9199462890625
1622282446.0149307;-39.039990234375;11.83994140625
1622282446.0249774;-44.61998291015625;10.4799560546875
1622282446.0350468;-51.17998046875;8.3399658203125
1622282446.04489;-58.73997802734375;7.0399658203125
1622282446.0536058;-65.45997314453125;6.3599609375
1622282446.0620778;-70.73997192382812;5.9999755859375
1622282446.0705695;-73.55997924804687;6.3799560546875
1622282446.078966;-74.29998168945312;7.4799560546875
1622282446.0899427;-72.43998413085937;8.53994140625
1622282446.1000478;-68.57998657226562;9.3599365234375
1622282446.1099513;-62.87998046875;10.6599365234375
1622282446.1210167;-57.17998046875;12.13994140625
1622282446.1287272;-52.619970703125;13.219921875
1622282446.1398647;-49.87996826171875;13.0599365234375
1622282446.1500127;-50.49996337890625;12.83994140625
1622282446.1591356;-54.87996826171875;12.0199462890625
1622282446.1690676;-62.219964599609376;10.0799560546875
1622282446.1815214;-68.83997192382813;16.2599609375
1622282446.1906176;-68.83997192382813;16.2599609375
1622282446.200064;-68.83997192382813;16.2599609375
1622282446.2089627;-68.83997192382813;16.2599609375
1622282446.2195477;-68.83997192382813;16.2599609375
1622282446.2305198;-68.83997192382813;16.2599609375
1622282446.240485;-68.83997192382813;16.2599609375
1622282446.2498355;-68.83997192382813;16.2599609375
1622282446.2595687;-68.83997192382813;16.2599609375
1622282446.2705057;-68.83997192382813;16.2599609375
1622282446.278053;-68.83997192382813;16.2599609375
1622282446.2889137;-68.83997192382813;16.2599609375
1622282446.298124;-68.83997192382813;16.2599609375
1622282446.307673;-68.83997192382813;16.2599609375
1622282446.316996;-68.83997192382813;16.2599609375
1622282446.3261213;-68.83997192382813;16.2599609375
1622282446.3367586;-68.83997192382813;16.2599609375
1622282446.3449235;-68.83997192382813;16.2599609375
1622282446.3556259;-68.83997192382813;16.2599609375
1622282446.3659456;-68.83997192382813;16.2599609375
1622282446.374666;-68.83997192382813;16.2599609375
1622282446.3844526;-68.83997192382813;16.2599609375
1622282446.394994;-68.83997192382813;16.2599609375
1622282446.4030433;-31.79998779296875;-35.0
1622282446.411441;-34.350006103515625;-35.05000305175781
1622282446.4210036;-37.600016276041664;-35.400004069010414
1622282446.4286492;-41.52500915527344;-35.25000762939453
1622282446.4370499;-45.760009765625;-35.140008544921876
1622282446.4454715;-54.28001708984375;-35.040008544921875
1622282446.4540653;-64.560009765625;-35.60001220703125
1622282446.4621377;-75.2800048828125;-35.68001098632813
1622282446.4729052;-87.6400146484375;-36.22000732421875
1622282446.482953;-100.68001708984374;-37.200006103515626
1622282446.491013;-113.48001708984376;-37.960009765625
1622282446.5018666;-125.42001953125;-38.040008544921875
1622282446.5110428;-137.42001953125;-38.760009765625
1622282446.5191145;-146.7400146484375;-38.980010986328125
1622282446.5315878;-155.0400146484375;-39.10001220703125
1622282446.5417268;-161.6400146484375;-39.40001220703125
1622282446.5515845;-167.56002197265624;-39.640008544921876
1622282446.5604866;-172.8000244140625;-39.960009765625
1622282446.5727663;-178.24002685546876;-40.60001220703125
1622282446.5830476;-183.14002685546876;-41.260009765625
1622282446.5920625;-189.1000244140625;-42.040008544921875
1622282446.6020753;-195.1400146484375;-43.12001342773438
1622282446.6149533;-201.90001220703124;-44.10001220703125
1622282446.624904;-209.060009765625;-45.70001220703125
1622282446.634044;-217.32000732421875;-47.58001708984375
1622282446.6419718;-224.94000244140625;-49.08001708984375
1622282446.6526482;-232.34000244140626;-50.3400146484375
1622282446.659983;-232.34000244140626;-50.3400146484375
1622282446.6706254;-232.34000244140626;-50.3400146484375
1622282446.6766996;-232.34000244140626;-50.3400146484375
1622282446.688196;-232.34000244140626;-50.3400146484375
1622282446.698855;-232.34000244140626;-50.3400146484375
1622282446.7080917;-232.34000244140626;-50.3400146484375
1622282446.7187502;13.5;2.399993896484375
1622282446.7316086;16.600006103515625;1.149993896484375
1622282446.7417672;15.9666748046875;0.76666259765625
1622282446.7518647;12.925003051757812;-0.07500457763671875
1622282446.762726;8.7800048828125;-1.360003662109375
1622282446.7706118;2.1;-3.600006103515625
1622282446.7791164;-8.75999755859375;-6.12000732421875
1622282446.7900198;-22.5;-9.260009765625
1622282446.799909;-36.9199951171875;-12.70001220703125
1622282446.810004;-50.5199951171875;-15.620013427734374
1622282446.8209825;-62.4599853515625;-18.320013427734374
1622282446.828083;-71.19998779296876;-20.120013427734374
1622282446.8399117;-75.7599853515625;-21.4400146484375
1622282446.8499837;-76.439990234375;-21.360015869140625
1622282446.8599417;-74.89998779296874;-20.8400146484375
1622282446.8710291;-71.939990234375;-20.360015869140625
1622282446.878142;-69.37999267578125;-19.78001708984375
1622282446.8900042;-68.2;-19.48001708984375
1622282446.899987;-70.2199951171875;-20.10001220703125
1622282446.909726;-75.34000244140626;-21.40001220703125
1622282446.9207716;-83.5;-23.12000732421875
1622282446.9280593;-94.3;-26.240008544921874
1622282446.939828;-106.67999267578125;-29.860009765625
1622282446.949991;-108.95999755859376;-30.560009765625
1622282446.9590619;-108.95999755859376;-30.560009765625
1622282446.9696584;-108.95999755859376;-30.560009765625
1622282446.9807396;-108.95999755859376;-30.560009765625
1622282446.992053;16.5999755859375;-2.70001220703125
1622282447.000843;25.149993896484375;-0.45001220703125
1622282447.0118234;32.633321126302086;0.9666544596354166
1622282447.0206037;40.49998474121094;2.1249847412109375
1622282447.0280988;47.57999267578125;3.1599853515625
1622282447.0400448;62.35999755859375;5.21998291015625
1622282447.0500693;75.35999755859375;6.539984130859375
1622282447.0600905;84.25999755859375;6.91998291015625
1622282447.0709667;88.2;7.3599853515625
1622282447.0786974;88.7;7.51998291015625
1622282447.0870912;84.0800048828125;7.2599853515625
1622282447.0958982;75.74000244140625;6.799981689453125
1622282447.1067863;65.2800048828125;6.239984130859375
1622282447.1158102;53.72000732421875;4.839984130859375
1622282447.1268165;40.2800048828125;3.139984130859375
1622282447.1368818;27.94000244140625;1.579986572265625
1622282447.1455774;17.2800048828125;0.419989013671875
1622282447.153734;9.72000732421875;-0.360009765625
1622282447.1650531;5.14000244140625;-0.760009765625
1622282447.1750467;4.2199951171875;-0.4800048828125
1622282447.1833827;4.839990234375;-6.103515625e-06
1622282447.1940498;6.6599853515625;0.839996337890625
1622282447.20409;9.41998291015625;2.039996337890625
1622282447.2123315;11.939990234375;3.5199951171875
1622282447.220352;13.85999755859375;4.499993896484375
1622282447.2308247;14.4;5.359991455078125
1622282447.2418997;12.12000732421875;5.379986572265625
1622282447.2519894;7.160009765625;5.239984130859375
1622282447.2650576;-0.939990234375;4.1599853515625
1622282447.275093;-5.139990234375;5.11998291015625
1622282447.283913;-5.139990234375;5.11998291015625
1622282447.293593;-5.139990234375;5.11998291015625
1622282447.3057363;-5.139990234375;5.11998291015625
1622282447.315583;24.800048828125;9.29998779296875
1622282447.3300066;30.60003662109375;11.25
1622282447.3399725;37.86669921875;12.900004069010416
1622282447.354944;45.7750244140625;14.275001525878906
1622282447.3669007;54.56002197265625;15.520001220703126
1622282447.380498;68.62001953125;18.14000244140625
1622282447.3880327;79.76002197265625;19.85999755859375
1622282447.3990283;86.28001708984375;21.399993896484375
1622282447.4082031;87.52001953125;22.599993896484374
1622282447.4177907;82.4000244140625;23.3199951171875
1622282447.4281104;82.4000244140625;23.3199951171875
1622282447.436491;82.4000244140625;23.3199951171875
1622282447.44716;82.4000244140625;23.3199951171875
1622282447.4572897;82.4000244140625;23.3199951171875
1622282447.4661767;82.4000244140625;23.3199951171875
1622282447.4751747;82.4000244140625;23.3199951171875
1622282447.4845738;82.4000244140625;23.3199951171875
1622282447.494835;82.4000244140625;23.3199951171875
1622282447.5013282;82.4000244140625;23.3199951171875
1622282447.5116396;82.4000244140625;23.3199951171875
1622282447.5185878;82.4000244140625;23.3199951171875
1622282447.530522;82.4000244140625;23.3199951171875
1622282447.5405145;82.4000244140625;23.3199951171875
1622282447.549487;82.4000244140625;23.3199951171875
1622282447.5580902;82.4000244140625;23.3199951171875
1622282447.5668428;82.4000244140625;23.3199951171875
1622282447.5761776;82.4000244140625;23.3199951171875
1622282447.5854206;82.4000244140625;23.3199951171875
1622282447.5971787;82.4000244140625;23.3199951171875
1622282447.6073034;82.4000244140625;23.3199951171875
1622282447.6161711;82.4000244140625;23.3199951171875
1622282447.6254086;82.4000244140625;23.3199951171875
1622282447.6347501;82.4000244140625;23.3199951171875
1622282447.645075;82.4000244140625;23.3199951171875
1622282447.6520467;82.4000244140625;23.3199951171875
1622282447.6638625;82.4000244140625;23.3199951171875
1622282447.673873;82.4000244140625;23.3199951171875
1622282447.6821291;82.4000244140625;23.3199951171875
1622282447.6911714;82.4000244140625;23.3199951171875
1622282447.700086;82.4000244140625;23.3199951171875
1622282447.7091281;82.4000244140625;23.3199951171875
1622282447.7187696;82.4000244140625;23.3199951171875
1622282447.7307518;82.4000244140625;23.3199951171875
1622282447.740593;82.4000244140625;23.3199951171875
1622282447.7495933;82.4000244140625;23.3199951171875
1622282447.7578545;82.4000244140625;23.3199951171875
1622282447.7669508;82.4000244140625;23.3199951171875
1622282447.7761352;82.4000244140625;23.3199951171875
1622282447.7854407;82.4000244140625;23.3199951171875
1622282447.7967243;82.4000244140625;23.3199951171875
1622282447.8071215;82.4000244140625;23.3199951171875
1622282447.8161662;82.4000244140625;23.3199951171875
1622282447.8251815;82.4000244140625;23.3199951171875
1622282447.8344662;82.4000244140625;23.3199951171875
1622282447.843707;82.4000244140625;23.3199951171875
1622282447.8556855;82.4000244140625;23.3199951171875
1622282447.8647456;82.4000244140625;23.3199951171875
1622282447.8739922;82.4000244140625;23.3199951171875
1622282447.882859;82.4000244140625;23.3199951171875
1622282447.8917031;82.4000244140625;23.3199951171875
1622282447.90105;82.4000244140625;23.3199951171875
1622282447.9101646;82.4000244140625;23.3199951171875
1622282447.922056;82.4000244140625;23.3199951171875
1622282447.9320922;82.4000244140625;23.3199951171875
1622282447.9411676;82.4000244140625;23.3199951171875
1622282447.9501252;82.4000244140625;23.3199951171875
1622282447.9595182;82.4000244140625;23.3199951171875
1622282447.9698865;82.4000244140625;23.3199951171875
1622282447.9769738;82.4000244140625;23.3199951171875
1622282447.9889853;82.4000244140625;23.3199951171875
1622282447.9989097;82.4000244140625;23.3199951171875
1622282448.0079677;82.4000244140625;23.3199951171875
1622282448.01712;82.4000244140625;23.3199951171875
1622282448.026643;82.4000244140625;23.3199951171875
1622282448.0370808;82.4000244140625;23.3199951171875
1622282448.0448701;82.4000244140625;23.3199951171875
1622282448.0558474;82.4000244140625;23.3199951171875
1622282448.0657165;82.4000244140625;23.3199951171875
1622282448.0748458;82.4000244140625;23.3199951171875
1622282448.0840151;82.4000244140625;23.3199951171875
1622282448.0931249;82.4000244140625;23.3199951171875
1622282448.103491;82.4000244140625;23.3199951171875
1622282448.111597;82.4000244140625;23.3199951171875
1622282448.1220498;82.4000244140625;23.3199951171875
1622282448.132287;82.4000244140625;23.3199951171875
1622282448.1416025;82.4000244140625;23.3199951171875
1622282448.1508303;82.4000244140625;23.3199951171875
1622282448.1599245;82.4000244140625;23.3199951171875
1622282448.1686516;82.4000244140625;23.3199951171875
1622282448.1770475;82.4000244140625;23.3199951171875
1622282448.1851401;82.4000244140625;23.3199951171875
1622282448.193768;82.4000244140625;23.3199951171875
1622282448.2019875;82.4000244140625;23.3199951171875
1622282448.2140446;82.4000244140625;23.3199951171875
1622282448.223178;82.4000244140625;23.3199951171875
1622282448.233405;82.4000244140625;23.3199951171875
1622282448.2418745;82.4000244140625;23.3199951171875
