Image center coordinates: 
1622189949.0993252;61.9000244140625;-4.899997711181641
1622189949.108496;67.30001831054688;-7.049999237060547
1622189949.1198597;68.56669108072917;-7.833332061767578
1622189949.1307974;68.10002136230469;-9.19999885559082
1622189949.1429112;68.58001708984375;-10.199999237060547
1622189949.153881;70.98001708984376;-11.759999847412109
1622189949.1658611;71.82001953125;-12.839999389648437
1622189949.174816;73.52001953125;-14.039999389648438
1622189949.182901;77.12001953125;-14.819999694824219
1622189949.1948695;81.64002685546875;-15.359999084472657
1622189949.2058506;88.04002685546875;-16.879998779296876
1622189949.2148263;96.32001953125;-18.199999237060545
1622189949.2228053;107.560009765625;-19.979999542236328
1622189949.2338793;97.0999755859375;-23.700000762939453
1622189949.2438161;107.69998168945312;-25.55000114440918
1622189949.25304;106.83331298828125;-23.33333460489909
1622189949.2629173;106.83331298828125;-23.33333460489909
1622189949.2718964;106.83331298828125;-23.33333460489909
1622189949.2793906;106.83331298828125;-23.33333460489909
1622189949.2885196;106.83331298828125;-23.33333460489909
1622189949.296109;5.70001220703125;-2.299999237060547
1622189949.3052552;4.95001220703125;-3.200000762939453
1622189949.3135514;5.533345540364583;-3.066666920979818
1622189949.3255434;5.5250091552734375;-2.6750001907348633
1622189949.3355565;5.360009765625;-2.4400001525878907
1622189949.3445435;5.960009765625;-2.0600006103515627
1622189949.3545141;5.9800048828125;-1.0400001525878906
1622189949.3634248;4.94000244140625;-0.1400005340576172
1622189949.371494;3.6800048828125;0.8399993896484375
1622189949.383412;2.1800048828125;2.5599990844726563
1622189949.3937814;-1.6;4.3999992370605465
1622189949.4032757;-6.37999267578125;6.539999008178711
1622189949.4142497;-13.29998779296875;9.019998931884766
1622189949.4262767;-21.39998779296875;11.19999885559082
1622189949.4353309;-22.5599853515625;12.819998931884765
1622189949.4452567;-22.5599853515625;12.819998931884765
1622189949.454436;-22.5599853515625;12.819998931884765
1622189949.4633083;-22.5599853515625;12.819998931884765
1622189949.4732144;-22.89996337890625;2.799999237060547
1622189949.4811933;-22.54998779296875;3.049999237060547
1622189949.4924686;-23.999979654947918;3.9999993642171225
1622189949.5025127;-25.0999755859375;4.399999380111694
1622189949.5114958;-25.9999755859375;4.939999389648437
1622189949.5223877;-28.11998291015625;6.0799994468688965
1622189949.5343559;-31.63997802734375;6.9399994850158695
1622189949.5443492;-35.19998779296875;7.9399994850158695
1622189949.5533295;-39.7199951171875;9.379999542236328
1622189949.5632982;-45.939996337890626;10.999999570846558
1622189949.5733185;-54.5199951171875;13.459999608993531
1622189949.581284;-64.2199951171875;16.15999960899353
1622189949.5925128;-70.65999145507813;17.75999960899353
1622189949.601565;-70.65999145507813;17.75999960899353
1622189949.6105356;-70.65999145507813;17.75999960899353
1622189949.620029;-70.65999145507813;17.75999960899353
1622189949.6290553;-70.65999145507813;17.75999960899353
1622189949.638884;-11.20001220703125;5.199999988079071
1622189949.6479435;-11.0;4.449999988079071
1622189949.6549947;-11.0;3.566666622956594
1622189949.6668673;-11.0;2.899999976158142
1622189949.6778626;-9.47999267578125;2.4399999737739564
1622189949.6869135;-7.1599853515625;1.5399999737739563
1622189949.6977873;-3.139990234375;0.37999998331069945
1622189949.7088854;4.2400146484375;-1.0399999976158143
1622189949.7191708;13.20001220703125;-1.8399999976158141
1622189949.7274437;13.20001220703125;-1.8399999976158141
1622189949.7365265;13.20001220703125;-1.8399999976158141
1622189949.7455192;13.20001220703125;-1.8399999976158141
1622189949.7545204;13.20001220703125;-1.8399999976158141
1622189949.7648637;15.10003662109375;-5.300000190734863
1622189949.772977;15.050018310546875;-6.300000190734863
1622189949.7851956;18.066691080729168;-6.933333555857341
1622189949.7951958;20.450027465820312;-7.225000262260437
1622189949.805333;22.76002197265625;-7.700000286102295
1622189949.8143225;28.60001220703125;-9.060000324249268
1622189949.8233385;36.18001708984375;-10.72000036239624
1622189949.8313143;43.960009765625;-12.700000381469726
1622189949.842548;56.1;-15.800000381469726
1622189949.8515244;71.35999755859375;-19.800000381469726
1622189949.861302;86.9;-23.000000381469725
1622189949.871326;86.9;-23.000000381469725
1622189949.8802485;86.9;-23.000000381469725
1622189949.887925;86.9;-23.000000381469725
1622189949.8967474;86.9;-23.000000381469725
1622189949.9085171;-5.29998779296875;-0.5999994277954102
1622189949.9185286;-6.29998779296875;-1.8499994277954102
1622189949.9283805;-5.899983723958333;-1.633332888285319
1622189949.9383554;-5.8499908447265625;-1.9499995708465576
1622189949.9485273;-6.4199951171875;-2.6799996376037596
1622189949.9565058;-6.6199951171875;-2.959999752044678
1622189949.9674764;-7.5;-3.1599997520446776
1622189949.977476;-9.02000732421875;-3.4999997138977053
1622189949.9874487;-11.22000732421875;-3.5399996757507326
1622189949.9983697;-12.6;-2.5799997329711912
1622189950.0063474;-15.55999755859375;-2.3799997329711915
1622189950.018604;-18.59998779296875;-1.6799997329711913
1622189950.028312;-21.63997802734375;-0.939999771118164
1622189950.0382562;-24.95997314453125;0.40000019073486326
1622189950.0482578;-30.1999755859375;1.3600004196166993
1622189950.056237;-35.77998046875;2.6600006103515623
1622189950.0674982;-42.9599853515625;4.020000457763672
1622189950.0782654;-52.639990234375;5.540000534057617
1622189950.0884454;-64.739990234375;7.380000495910645
1622189950.0985286;-78.31998901367187;8.760000419616699
1622189950.1064668;-88.6599853515625;10.120000267028809
1622189950.1175451;-88.6599853515625;10.120000267028809
1622189950.1265988;-88.6599853515625;10.120000267028809
1622189950.135578;-88.6599853515625;10.120000267028809
1622189950.1445508;-13.60003662109375;4.0
1622189950.1535156;-15.350021362304688;4.050000190734863
1622189950.1635158;-17.333353678385418;3.400000254313151
1622189950.1754243;-18.90001678466797;3.15000057220459
1622189950.1854277;-19.900018310546876;3.020000457763672
1622189950.19537;-21.560015869140624;2.7600006103515624
1622189950.206347;-22.52001953125;1.6800006866455077
1622189950.2134588;-22.48001708984375;1.5600006103515625
1622189950.2254186;-20.840020751953126;1.120000457763672
1622189950.2352643;-17.900018310546876;0.5200004577636719
1622189950.2440515;-13.680010986328124;-0.7799995422363282
1622189950.253199;-7.220013427734375;-2.0999996185302736
1622189950.263091;1.87998046875;-4.859999465942383
1622189950.271944;15.71998291015625;-9.03999948501587
1622189950.2802436;25.33997802734375;-17.99999933242798
1622189950.2922356;25.33997802734375;-17.99999933242798
1622189950.3022091;25.33997802734375;-17.99999933242798
1622189950.3113751;25.33997802734375;-17.99999933242798
1622189950.3205976;25.33997802734375;-17.99999933242798
1622189950.3296072;25.33997802734375;-17.99999933242798
1622189950.3383389;25.33997802734375;-17.99999933242798
1622189950.3462353;25.33997802734375;-17.99999933242798
1622189950.3551564;25.33997802734375;-17.99999933242798
1622189950.3633318;25.33997802734375;-17.99999933242798
1622189950.3715422;8.29998779296875;-31.0999755859375
1622189950.3803153;9.949981689453125;-31.449981689453125
1622189950.388509;10.733317057291666;-33.0999755859375
1622189950.4007523;10.649978637695312;-33.77497863769531
1622189950.4101517;10.51998291015625;-35.43997802734375
1622189950.4193974;12.73997802734375;-47.73997802734375
1622189950.428545;12.73997802734375;-47.73997802734375
1622189950.4375145;12.73997802734375;-47.73997802734375
1622189950.4463925;12.73997802734375;-47.73997802734375
1622189950.4553685;12.73997802734375;-47.73997802734375
1622189950.4635513;0.29998779296875;11.5999755859375
1622189950.4715333;-0.25;9.8499755859375
1622189950.4842265;-0.6999918619791666;8.633321126302084
1622189950.4940755;-0.875;7.7249908447265625
1622189950.5021617;-1.6800048828125;7.39998779296875
1622189950.5121346;-2.5800048828125;5.79998779296875
1622189950.5213778;-3.72000732421875;5.05999755859375
1622189950.5309725;-5.28001708984375;4.6199951171875
1622189950.5399828;-7.98001708984375;4.47999267578125
1622189950.547955;-10.660009765625;3.54000244140625
1622189950.559038;-14.6800048828125;3.02000732421875
1622189950.5684357;-19.82000732421875;2.85999755859375
1622189950.578319;-27.44000244140625;2.4
1622189950.5885463;-36.4;2.32000732421875
1622189950.6004465;-49.92000122070313;1.42000732421875
1622189950.610457;-63.620001220703124;-0.07999267578125
1622189950.6203313;-63.620001220703124;-0.07999267578125
1622189950.6295176;-63.620001220703124;-0.07999267578125
1622189950.638537;-63.620001220703124;-0.07999267578125
1622189950.6463797;-63.620001220703124;-0.07999267578125
1622189950.6563742;-10.399993896484375;-1.89996337890625
1622189950.6643515;-11.25;-2.449981689453125
1622189950.676382;-11.933329264322916;-3.1333211263020835
1622189950.686355;-11.849998474121094;-3.574981689453125
1622189950.6943476;-12.179998779296875;-4.17998046875
1622189950.7042964;-12.3;-5.139990234375
1622189950.714238;-11.55999755859375;-5.47999267578125
1622189950.7253127;-9.979998779296874;-5.9599853515625
1622189950.7363381;-8.35999755859375;-7.039990234375
1622189950.7443461;-6.439996337890625;-7.89998779296875
1622189950.7533312;-5.139996337890625;-9.13997802734375
1622189950.7632086;-3.979998779296875;-3.8999755859375
1622189950.7754192;-3.979998779296875;-3.8999755859375
1622189950.784942;-3.979998779296875;-3.8999755859375
1622189950.7945588;-3.979998779296875;-3.8999755859375
1622189950.803533;-3.979998779296875;-3.8999755859375
1622189950.8125398;-3.979998779296875;-3.8999755859375
1622189950.8213384;-3.979998779296875;-3.8999755859375
1622189950.8303535;-3.979998779296875;-3.8999755859375
1622189950.8384972;-3.979998779296875;-3.8999755859375
1622189950.8472972;-18.4000244140625;-13.900000095367432
1622189950.8553302;-19.4000244140625;-14.600000143051147
1622189950.8642695;-20.866689046223957;-14.96666669845581
1622189950.8763568;-22.050018310546875;-15.850000023841858
1622189950.8855212;-22.48001708984375;-12.200000095367432
1622189950.8945138;-22.48001708984375;-12.200000095367432
1622189950.9034905;-22.48001708984375;-12.200000095367432
1622189950.9124637;-22.48001708984375;-12.200000095367432
1622189950.9215267;-22.48001708984375;-12.200000095367432
1622189950.9304;-22.48001708984375;-12.200000095367432
1622189950.9387982;-22.48001708984375;-12.200000095367432
1622189950.9463665;-22.48001708984375;-12.200000095367432
1622189950.9569185;-22.48001708984375;-12.200000095367432
1622189950.9641593;-22.48001708984375;-12.200000095367432
1622189950.9762;-22.48001708984375;-12.200000095367432
1622189950.9858768;-22.48001708984375;-12.200000095367432
1622189950.9954076;-22.48001708984375;-12.200000095367432
1622189951.004273;-22.48001708984375;-12.200000095367432
1622189951.013759;-22.48001708984375;-12.200000095367432
1622189951.0261211;-22.48001708984375;-12.200000095367432
1622189951.0352535;-22.48001708984375;-12.200000095367432
1622189951.0451097;-22.48001708984375;-12.200000095367432
1622189951.0560477;-20.0999755859375;-19.89999771118164
1622189951.0690086;-24.249984741210938;-20.499998092651367
1622189951.0789785;-27.833323160807293;-21.09999720255534
1622189951.0911248;-32.92498779296875;-20.774996757507324
1622189951.1000843;-38.579986572265625;-20.33999710083008
1622189951.1081944;-50.639990234375;-19.499996948242188
1622189951.1171644;-63.359991455078124;-18.379996490478515
1622189951.1261444;-79.839990234375;-16.9599967956543
1622189951.134129;-97.47999267578125;-16.37999725341797
1622189951.145086;-103.25999145507812;-16.519996643066406
1622189951.1552918;-103.25999145507812;-16.519996643066406
1622189951.1681828;-103.25999145507812;-16.519996643066406
1622189951.1792283;-103.25999145507812;-16.519996643066406
1622189951.190208;-2.4000244140625;-9.400001525878906
1622189951.2023182;-2.6000213623046875;-10.600000381469727
1622189951.2122905;-2.300018310546875;-11.033334096272787
1622189951.2232244;-2.4000167846679688;-11.40000057220459
1622189951.2332375;-2.18001708984375;-11.840000915527344
1622189951.2412221;-0.9400146484375;-12.580001068115234
1622189951.2501843;0.999981689453125;-13.420001220703124
1622189951.25916;3.979986572265625;-14.080001068115234
1622189951.267143;8.559991455078125;-15.160001373291015
1622189951.2761183;15.0199951171875;-16.60000114440918
1622189951.2850955;24.0;-18.640000915527345
1622189951.2960615;36.22000732421875;-21.040000915527344
1622189951.3080013;52.85999755859375;-24.56000099182129
1622189951.316017;52.85999755859375;-24.56000099182129
1622189951.3261275;52.85999755859375;-24.56000099182129
1622189951.3361049;52.85999755859375;-24.56000099182129
1622189951.346075;52.85999755859375;-24.56000099182129
1622189951.3580031;11.0;-10.0
1622189951.3669527;11.20001220703125;-9.800000190734863
1622189951.3739603;12.333333333333334;-10.266666730244955
1622189951.3849308;13.625;-10.600000143051147
1622189951.3940024;14.84000244140625;-10.960000038146973
1622189951.403219;16.9;-11.460000038146973
1622189951.412559;19.87999267578125;-12.139999961853027
1622189951.4215372;23.75999755859375;-12.760000038146973
1622189951.430392;28.57999267578125;-13.75999994277954
1622189951.438431;34.39998779296875;-15.119999980926513
1622189951.4508212;43.77999267578125;-16.580000019073488
1622189951.4603858;56.4199951171875;-19.080000019073488
1622189951.4695761;72.67999267578125;-21.95999994277954
1622189951.4785998;91.1199951171875;-25.239999961853027
1622189951.4876056;91.1199951171875;-25.239999961853027
1622189951.4966;91.1199951171875;-25.239999961853027
1622189951.5055542;91.1199951171875;-25.239999961853027
1622189951.513606;91.1199951171875;-25.239999961853027
1622189951.5215957;91.1199951171875;-25.239999961853027
1622189951.5304978;-10.60003662109375;-0.9000000953674316
1622189951.5385935;-12.500030517578125;-1.5000001192092896
1622189951.550469;-13.466695149739584;-2.0333334604899087
1622189951.5605116;-13.7750244140625;-2.2750000953674316
1622189951.5694509;-13.56002197265625;-2.3000000953674316
1622189951.5803883;-13.78001708984375;-2.6600000858306885
1622189951.5903747;-12.58001708984375;-2.7800000667572022
1622189951.598404;-10.4400146484375;-3.2800000578165056
1622189951.6103823;-6.5400146484375;-4.020000067353249
1622189951.6203682;-0.3400146484375;-5.640000048279762
1622189951.6304383;8.0599853515625;-7.880000057816505
1622189951.6404161;20.37999267578125;-10.560000029206275
1622189951.6483963;26.6199951171875;-10.72000002861023
1622189951.6595373;26.6199951171875;-10.72000002861023
1622189951.6695414;26.6199951171875;-10.72000002861023
1622189951.6785264;26.6199951171875;-10.72000002861023
1622189951.6883748;-40.60003662109375;14.600000381469727
1622189951.6998482;-44.250030517578125;12.90000057220459
1622189951.7084017;-46.566691080729164;12.066666920979818
1622189951.7163246;-48.10002136230469;11.875000476837158
1622189951.7243109;-49.3000244140625;11.420000457763672
1622189951.7352734;-51.5400146484375;10.240000534057618
1622189951.7452486;-52.360009765625;9.480000305175782
1622189951.7553654;-52.2800048828125;9.000000381469727
1622189951.7658908;-52.22000732421875;8.180000305175781
1622189951.7738295;-51.04000244140625;7.520000457763672
1622189951.7853236;-49.8800048828125;6.780000305175781
1622189951.795309;-46.10001220703125;6.300000381469727
1622189951.805261;-38.96002197265625;4.300000381469727
1622189951.815386;-27.78001708984375;1.6200002670288085
1622189951.8234763;-24.38001708984375;2.7600000381469725
1622189951.83454;-24.38001708984375;2.7600000381469725
1622189951.8445568;-24.38001708984375;2.7600000381469725
1622189951.8535547;-24.38001708984375;2.7600000381469725
1622189951.8634017;-21.79998779296875;7.799999237060547
1622189951.8733737;-23.649993896484375;5.299999237060547
1622189951.8813174;-25.599995930989582;4.8999989827473955
1622189951.8933196;-26.75;4.924999237060547
1622189951.9032924;-28.2;5.159999084472656
1622189951.9132683;-31.1800048828125;4.6399993896484375
1622189951.9233005;-32.1800048828125;4.8799995422363285
1622189951.931274;-35.04000244140625;4.6399993896484375
1622189951.9432435;-36.220001220703125;2.9399993896484373
1622189951.9524078;-36.220001220703125;2.9399993896484373
1622189951.962392;-36.220001220703125;2.9399993896484373
1622189951.9724355;-36.220001220703125;2.9399993896484373
1622189951.9845495;-36.220001220703125;2.9399993896484373
1622189951.9945283;-36.220001220703125;2.9399993896484373
1622189952.0034933;-36.220001220703125;2.9399993896484373
1622189952.0133367;-36.220001220703125;2.9399993896484373
1622189952.022271;-36.220001220703125;2.9399993896484373
1622189952.034524;-36.220001220703125;2.9399993896484373
1622189952.0453467;-12.5;-1.0
1622189952.054472;-12.5;-1.0
1622189952.0642967;-12.5;-1.0
1622189952.0773714;-12.5;-1.0
1622189952.0864158;-12.5;-1.0
1622189952.0955527;-12.5;-1.0
1622189952.1054645;-12.5;-1.0
1622189952.1143386;-12.5;-1.0
1622189952.1224174;-12.5;-1.0
1622189952.1345484;-12.5;-1.0
1622189952.1445432;-12.5;-1.0
1622189952.1541297;-12.5;-1.0
1622189952.1642213;-12.5;-1.0
1622189952.176328;-12.5;-1.0
1622189952.1864886;-12.5;-1.0
1622189952.1958523;-12.5;-1.0
1622189952.2059472;-12.5;-1.0
1622189952.2175262;-12.5;-1.0
1622189952.2275543;-12.5;-1.0
1622189952.2364779;-12.5;-1.0
1622189952.2460787;-12.5;-1.0
1622189952.2560248;-12.5;-1.0
1622189952.264375;-12.5;-1.0
1622189952.2723458;-12.5;-1.0
1622189952.2845438;-12.5;-1.0
1622189952.2945132;-12.5;-1.0
1622189952.30348;-12.5;-1.0
1622189952.3124557;-12.5;-1.0
1622189952.3223236;-12.5;-1.0
1622189952.3354692;-12.5;-1.0
