Image center coordinates: 
1622894845.4961154;293.5999755859375;11.399993896484375
1622894845.5070715;286.0;10.399993896484375
1622894845.516972;280.3333333333333;10.499994913736979
1622894845.526331;271.6750183105469;10.324996948242188
1622894845.535975;267.2000244140625;10.139996337890626
1622894845.5458484;252.5600341796875;10.019998168945312
1622894845.5542755;241.0200439453125;10.039999389648438
1622894845.5626318;231.36005859375;9.760000610351563
1622894845.5711498;222.3400390625;9.839999389648437
1622894845.579271;209.180029296875;9.920001220703124
1622894845.5902567;200.6600341796875;9.520001220703126
1622894845.6004148;-191.300048828125;-0.1999969482421875
1622894845.609393;-190.25006103515625;-0.3000030517578125
1622894845.6185865;-204.3333740234375;-0.20000203450520834
1622894845.6281772;-204.3333740234375;-0.20000203450520834
1622894845.6406672;-204.3333740234375;-0.20000203450520834
1622894845.6502168;-204.3333740234375;-0.20000203450520834
1622894845.659363;-204.3333740234375;-0.20000203450520834
1622894845.6693015;-93.0999755859375;-1.6999969482421875
1622894845.6784022;-93.0999755859375;-1.6999969482421875
1622894845.6866062;-93.0999755859375;-1.6999969482421875
1622894845.6952467;-93.0999755859375;-1.6999969482421875
1622894845.7033193;-93.0999755859375;-1.6999969482421875
1622894845.7156303;-93.0999755859375;-1.6999969482421875
1622894845.7255354;-93.0999755859375;-1.6999969482421875
1622894845.7345645;-93.0999755859375;-1.6999969482421875
1622894845.7449095;-49.699951171875;-0.20001220703125
1622894845.7549453;-51.0999755859375;-0.1500091552734375
1622894845.7632554;-52.966634114583336;-0.20000712076822916
1622894845.7715547;-56.824951171875;-0.350006103515625
1622894845.7824583;-56.824951171875;-0.350006103515625
1622894845.7923584;-56.824951171875;-0.350006103515625
1622894845.8015792;-56.824951171875;-0.350006103515625
1622894845.8112755;-56.824951171875;-0.350006103515625
1622894845.8195589;-56.824951171875;-0.350006103515625
1622894845.8294294;-78.5999755859375;-1.0
1622894845.8365018;-78.5999755859375;-1.0
1622894845.84527;-78.5999755859375;-1.0
1622894845.853305;-78.5999755859375;-1.0
1622894845.8655672;-78.5999755859375;-1.0
1622894845.8764093;-104.800048828125;-1.29998779296875
1622894845.8867722;-143.70001220703125;-0.44998931884765625
1622894845.895429;-143.70001220703125;-0.44998931884765625
1622894845.9038117;-143.70001220703125;-0.44998931884765625
1622894845.9157825;-143.70001220703125;-0.44998931884765625
1622894845.9255583;-143.70001220703125;-0.44998931884765625
1622894845.9352129;-143.70001220703125;-0.44998931884765625
1622894845.945152;-143.70001220703125;-0.44998931884765625
1622894845.9573994;-143.70001220703125;-0.44998931884765625
1622894845.9674208;-143.70001220703125;-0.44998931884765625
1622894845.9765425;-143.70001220703125;-0.44998931884765625
1622894845.9866862;-143.70001220703125;-0.44998931884765625
1622894845.9991436;-143.70001220703125;-0.44998931884765625
1622894846.0093567;-143.70001220703125;-0.44998931884765625
1622894846.018844;-143.70001220703125;-0.44998931884765625
1622894846.0298314;-143.70001220703125;-0.44998931884765625
1622894846.0384083;-143.70001220703125;-0.44998931884765625
1622894846.0464203;-143.70001220703125;-0.44998931884765625
1622894846.0573976;-143.70001220703125;-0.44998931884765625
1622894846.067422;-143.70001220703125;-0.44998931884765625
1622894846.078168;-143.70001220703125;-0.44998931884765625
1622894846.088375;-143.70001220703125;-0.44998931884765625
1622894846.096872;-143.70001220703125;-0.44998931884765625
1622894846.105333;-143.70001220703125;-0.44998931884765625
1622894846.1134136;-143.70001220703125;-0.44998931884765625
1622894846.1242266;-143.70001220703125;-0.44998931884765625
1622894846.1344757;-143.70001220703125;-0.44998931884765625
1622894846.1452782;-143.70001220703125;-0.44998931884765625
1622894846.1554;-143.70001220703125;-0.44998931884765625
1622894846.1639028;-143.70001220703125;-0.44998931884765625
1622894846.1742713;-143.70001220703125;-0.44998931884765625
1622894846.1844828;-143.70001220703125;-0.44998931884765625
1622894846.1952944;-143.70001220703125;-0.44998931884765625
1622894846.203426;-143.70001220703125;-0.44998931884765625
1622894846.2132542;-143.70001220703125;-0.44998931884765625
1622894846.2213964;-143.70001220703125;-0.44998931884765625
1622894846.2333472;-143.70001220703125;-0.44998931884765625
1622894846.2425432;-143.70001220703125;-0.44998931884765625
1622894846.2532508;-143.70001220703125;-0.44998931884765625
1622894846.2633479;-143.70001220703125;-0.44998931884765625
1622894846.271404;-143.70001220703125;-0.44998931884765625
1622894846.282538;-143.70001220703125;-0.44998931884765625
1622894846.2926502;-143.70001220703125;-0.44998931884765625
1622894846.303398;-143.70001220703125;-0.44998931884765625
1622894846.3137906;-143.70001220703125;-0.44998931884765625
1622894846.3221927;-143.70001220703125;-0.44998931884765625
1622894846.33334;-143.70001220703125;-0.44998931884765625
1622894846.3425546;-143.70001220703125;-0.44998931884765625
1622894846.3521092;-143.70001220703125;-0.44998931884765625
1622894846.3632019;-143.70001220703125;-0.44998931884765625
1622894846.3714013;-143.70001220703125;-0.44998931884765625
1622894846.3834047;-143.70001220703125;-0.44998931884765625
1622894846.3925514;-143.70001220703125;-0.44998931884765625
1622894846.4015422;-143.70001220703125;-0.44998931884765625
1622894846.4117296;-143.70001220703125;-0.44998931884765625
1622894846.4253626;-8.0999755859375;-0.1999969482421875
1622894846.435767;22.600006103515625;-1.149993896484375
1622894846.4464173;22.600006103515625;-1.149993896484375
1622894846.4538453;22.600006103515625;-1.149993896484375
1622894846.4633183;22.600006103515625;-1.149993896484375
1622894846.4713986;22.600006103515625;-1.149993896484375
1622894846.4825583;22.600006103515625;-1.149993896484375
1622894846.4925623;22.600006103515625;-1.149993896484375
1622894846.5032926;22.600006103515625;-1.149993896484375
1622894846.5134315;22.600006103515625;-1.149993896484375
1622894846.52143;22.600006103515625;-1.149993896484375
1622894846.5325584;22.600006103515625;-1.149993896484375
1622894846.5425565;22.600006103515625;-1.149993896484375
1622894846.5532427;22.600006103515625;-1.149993896484375
1622894846.5644164;135.199951171875;-11.60003662109375
1622894846.5730705;151.7999267578125;-12.35003662109375
1622894846.581346;161.86661783854166;-14.36669921875
1622894846.5904393;172.74993896484375;-15.550033569335938
1622894846.5980859;184.019970703125;-16.880029296875
1622894846.6063561;206.17998046875;-20.42003173828125
1622894846.6184216;221.4;-23.34002685546875
1622894846.6283615;221.4;-23.34002685546875
1622894846.6411867;221.4;-23.34002685546875
1622894846.651372;221.4;-23.34002685546875
1622894846.6613233;221.4;-23.34002685546875
1622894846.6716342;-37.10009765625;3.699951171875
1622894846.681628;-41.85009765625;3.199951171875
1622894846.6894386;-50.966715494791664;3.0999552408854165
1622894846.6981788;-59.9000244140625;2.4749603271484375
1622894846.706332;-67.32001953125;1.9599609375
1622894846.7187521;-88.5;1.619970703125
1622894846.728609;-115.560009765625;0.9999755859375
1622894846.7420776;-124.580029296875;-0.36002197265625
1622894846.751502;-124.580029296875;-0.36002197265625
1622894846.7615614;-124.580029296875;-0.36002197265625
1622894846.7714279;-124.580029296875;-0.36002197265625
1622894846.7786496;-124.580029296875;-0.36002197265625
1622894846.7922113;17.39990234375;-33.10003662109375
1622894846.8023455;15.0999755859375;-33.800018310546875
1622894846.813274;13.5;-34.433349609375
1622894846.8212285;11.7249755859375;-35.47502136230469
1622894846.8334146;11.299951171875;-35.32001953125
1622894846.8440182;9.399951171875;-36.20001220703125
1622894846.8547518;8.879931640625;-36.48001708984375
1622894846.8643851;9.119921875;-36.62001953125
1622894846.8733537;10.659912109375;-35.96002197265625
1622894846.8812537;11.779931640625;-36.1000244140625
1622894846.8894367;14.03994140625;-35.6000244140625
1622894846.8981555;15.73994140625;-35.7000244140625
1622894846.9063861;17.319921875;-35.62001953125
1622894846.9182963;18.519921875;-35.38001708984375
1622894846.9302974;19.119921875;-35.0400146484375
1622894846.9393008;18.079931640625;-34.66002197265625
1622894846.9475653;16.059912109375;-33.3000244140625
1622894846.9563909;11.83994140625;-32.280029296875
1622894846.9644477;7.2599609375;-31.56002197265625
1622894846.9734414;1.999951171875;-30.96002197265625
1622894846.9823287;-12.26005859375;-29.56002197265625
1622894846.9904606;-40.200048828125;-31.1000244140625
1622894846.9984815;-40.200048828125;-31.1000244140625
1622894847.01042;-40.200048828125;-31.1000244140625
1622894847.0203676;-40.200048828125;-31.1000244140625
1622894847.0313506;-14.0;0.10003662109375
1622894847.0404274;-14.1500244140625;1.4000244140625
1622894847.048492;-18.133382161458332;2.2666829427083335
1622894847.0603833;-21.12506103515625;2.425018310546875
1622894847.0713997;-25.600048828125;2.60001220703125
1622894847.0812988;-34.940087890625;3.50001220703125
1622894847.0901058;-46.160107421875;3.960009765625
1622894847.0984328;-58.9201171875;3.90001220703125
1622894847.1063893;-72.580126953125;4.1800048828125
1622894847.1183941;-94.880126953125;4.0400146484375
1622894847.1291628;-94.880126953125;4.0400146484375
1622894847.1383815;-94.880126953125;4.0400146484375
1622894847.1453543;-94.880126953125;4.0400146484375
1622894847.1578236;-94.880126953125;4.0400146484375
1622894847.1678326;-94.880126953125;4.0400146484375
1622894847.177475;-94.880126953125;4.0400146484375
1622894847.1884363;-94.880126953125;4.0400146484375
1622894847.1964395;-94.880126953125;4.0400146484375
1622894847.207973;-94.880126953125;4.0400146484375
1622894847.2179334;-94.880126953125;4.0400146484375
1622894847.2274413;-94.880126953125;4.0400146484375
1622894847.2386715;-94.880126953125;4.0400146484375
1622894847.246909;-94.880126953125;4.0400146484375
1622894847.2577434;-94.880126953125;4.0400146484375
1622894847.2686517;32.89990234375;-0.5999755859375
1622894847.2795577;33.2999267578125;-0.5999755859375
1622894847.2894385;35.599934895833336;-1.2333170572916667
1622894847.298408;39.699951171875;-0.67498779296875
1622894847.306255;43.319970703125;-0.339990234375
1622894847.3144433;47.1599609375;0.1800048828125
1622894847.3253279;51.419970703125;0.85999755859375
1622894847.335634;53.3599609375;2.3199951171875
1622894847.3461747;49.799951171875;3.17999267578125
1622894847.3553824;43.299951171875;3.9199951171875
1622894847.3641639;37.7599609375;4.7199951171875
1622894847.37295;28.099951171875;4.94000244140625
1622894847.381348;14.919970703125;4.5800048828125
1622894847.393439;2.339990234375;4.160009765625
1622894847.4044073;-15.380029296875;3.660009765625
1622894847.416219;-15.380029296875;3.660009765625
1622894847.4263983;-15.380029296875;3.660009765625
1622894847.4374135;-15.380029296875;3.660009765625
1622894847.4502895;-15.380029296875;3.660009765625
1622894847.4603195;-15.380029296875;3.660009765625
1622894847.4691575;-15.380029296875;3.660009765625
1622894847.4801066;-15.380029296875;3.660009765625
1622894847.4883602;-15.380029296875;3.660009765625
1622894847.4994648;-15.380029296875;3.660009765625
1622894847.5103614;11.5;-6.100006103515625
1622894847.5213668;3.5;-6.450004577636719
1622894847.5299602;-2.5666910807291665;-7.100006103515625
1622894847.5400326;-11.60003662109375;-7.150005340576172
1622894847.5481043;-21.580029296875;-7.320004272460937
1622894847.5564086;-42.4200439453125;-7.600003051757812
1622894847.567781;-42.4200439453125;-7.600003051757812
1622894847.5774405;-42.4200439453125;-7.600003051757812
1622894847.588447;-42.4200439453125;-7.600003051757812
1622894847.5966902;-42.4200439453125;-7.600003051757812
1622894847.605663;-42.4200439453125;-7.600003051757812
1622894847.6164014;-42.4200439453125;-7.600003051757812
1622894847.6257346;-42.4200439453125;-7.600003051757812
1622894847.6346784;-42.4200439453125;-7.600003051757812
1622894847.6436522;-42.4200439453125;-7.600003051757812
1622894847.652377;-42.4200439453125;-7.600003051757812
1622894847.6611357;-42.4200439453125;-7.600003051757812
1622894847.6705313;-42.4200439453125;-7.600003051757812
1622894847.678497;-42.4200439453125;-7.600003051757812
1622894847.6862233;-42.4200439453125;-7.600003051757812
1622894847.6954918;-42.4200439453125;-7.600003051757812
1622894847.7034802;-42.4200439453125;-7.600003051757812
1622894847.7113426;-42.4200439453125;-7.600003051757812
1622894847.720481;-42.4200439453125;-7.600003051757812
1622894847.7284696;-42.4200439453125;-7.600003051757812
1622894847.7370741;-42.4200439453125;-7.600003051757812
1622894847.744367;-42.4200439453125;-7.600003051757812
1622894847.7530806;-42.4200439453125;-7.600003051757812
1622894847.7621;-42.4200439453125;-7.600003051757812
1622894847.7714217;-42.4200439453125;-7.600003051757812
