Image center coordinates: 
1622189978.9349551;20.89996337890625;-3.200000762939453
1622189978.9479513;7.8499755859375;2.1999988555908203
1622189978.958464;-1.4000244140625;8.09999910990397
1622189978.9704342;-4.300018310546875;10.299999237060547
1622189978.9793975;-6.70001220703125;11.659999465942382
1622189978.9873822;-14.14000244140625;15.439999771118163
1622189978.9963803;-16.6;16.360000228881837
1622189979.0053568;-15.64000244140625;15.200000381469726
1622189979.016327;-16.02000732421875;14.200000381469726
1622189979.028305;-15.82000732421875;13.680000305175781
1622189979.0372427;-15.3400146484375;13.1
1622189979.046296;-14.18001708984375;13.0
1622189979.055332;4.79998779296875;-2.6000003814697266
1622189979.0634317;4.249969482421875;-2.8000001907348633
1622189979.07141;3.83331298828125;-3.3000005086263022
1622189979.0828843;4.4249725341796875;-3.0500006675720215
1622189979.0954807;4.8999755859375;-2.800000762939453
1622189979.1044235;6.4999755859375;-2.5600006103515627
1622189979.1124249;8.4599853515625;-2.2600006103515624
1622189979.1214044;7.73997802734375;5.8799995422363285
1622189979.1293833;7.73997802734375;5.8799995422363285
1622189979.1403255;7.73997802734375;5.8799995422363285
1622189979.1502988;7.73997802734375;5.8799995422363285
1622189979.1622672;-16.600006103515625;6.100002288818359
1622189979.1712425;-17.70001220703125;4.750001907348633
1622189979.1792505;-18.933349609375;4.333334604899089
1622189979.1881979;-20.500015258789062;4.325000762939453
1622189979.1961758;-21.660015869140626;4.780001068115235
1622189979.20518;-23.600018310546876;5.280001068115235
1622189979.214157;-25.800018310546875;6.140000915527343
1622189979.2251048;-29.760015869140624;7.220001220703125
1622189979.237098;-33.8400146484375;9.060001373291016
1622189979.2459636;-38.920013427734375;10.480001068115234
1622189979.253947;-43.72001342773437;12.740000152587891
1622189979.265916;-43.72001342773437;12.740000152587891
1622189979.2751021;-43.72001342773437;12.740000152587891
1622189979.2859154;-43.72001342773437;12.740000152587891
1622189979.297129;-43.72001342773437;12.740000152587891
1622189979.3079617;-43.72001342773437;12.740000152587891
1622189979.3179326;-43.72001342773437;12.740000152587891
1622189979.3279893;-43.72001342773437;12.740000152587891
1622189979.3359811;-43.72001342773437;12.740000152587891
1622189979.34713;-43.72001342773437;12.740000152587891
1622189979.357109;-43.72001342773437;12.740000152587891
1622189979.3679168;-43.72001342773437;12.740000152587891
1622189979.3789587;46.399993896484375;-12.600006103515625
1622189979.3870342;46.399993896484375;-12.600006103515625
1622189979.395027;46.399993896484375;-12.600006103515625
1622189979.4051094;46.399993896484375;-12.600006103515625
1622189979.4150457;46.399993896484375;-12.600006103515625
1622189979.4260583;46.399993896484375;-12.600006103515625
1622189979.4360209;46.399993896484375;-12.600006103515625
1622189979.4429705;46.399993896484375;-12.600006103515625
1622189979.4550166;46.399993896484375;-12.600006103515625
1622189979.4659886;46.399993896484375;-12.600006103515625
1622189979.4750977;46.399993896484375;-12.600006103515625
1622189979.4859655;46.399993896484375;-12.600006103515625
1622189979.497935;4.29998779296875;5.400001525878906
1622189979.5079088;6.79998779296875;3.6500015258789062
1622189979.5179865;10.633321126302084;1.9666684468587239
1622189979.5288243;8.92498779296875;2.0250015258789062
1622189979.5378807;8.6599853515625;2.220001220703125
1622189979.5459476;9.9599853515625;1.6000015258789062
1622189979.554893;10.039984130859375;1.8800018310546875
1622189979.563898;9.1599853515625;2.5600013732910156
1622189979.5747771;12.31998291015625;1.920001220703125
1622189979.5868976;15.839984130859374;1.0800018310546875
1622189979.5959585;19.779986572265624;0.14000167846679687
1622189979.6049392;25.3599853515625;-1.9399986267089844
1622189979.6129193;33.539984130859374;-4.079998016357422
1622189979.6208935;43.699981689453125;-6.079998016357422
1622189979.6328619;58.77998046875;-9.379998016357423
1622189979.6438365;79.6999755859375;-13.339998245239258
1622189979.6537766;103.83997802734375;-17.239998245239256
1622189979.6617937;103.83997802734375;-17.239998245239256
1622189979.6698534;103.83997802734375;-17.239998245239256
1622189979.6800804;103.83997802734375;-17.239998245239256
1622189979.690685;103.83997802734375;-17.239998245239256
1622189979.7019484;1.300048828125;-1.7999992370605469
1622189979.714915;1.050048828125;-4.649999618530273
1622189979.7260098;1.6667073567708333;-5.566666920979817
1622189979.7379546;2.1750335693359375;-5.700000286102295
1622189979.7459662;3.0600341796875;-6.040000534057617
1622189979.7549393;4.4000244140625;-7.3800006866455075
1622189979.762993;6.38001708984375;-8.120000839233398
1622189979.771968;8.7400146484375;-8.880000686645507
1622189979.7809453;11.86002197265625;-9.880000686645507
1622189979.791966;16.68001708984375;-11.500000381469727
1622189979.803902;24.28001708984375;-13.340000534057618
1622189979.8129878;34.18001708984375;-15.520000457763672
1622189979.8209376;40.8000244140625;-15.660000610351563
1622189979.8281474;40.8000244140625;-15.660000610351563
1622189979.8401618;40.8000244140625;-15.660000610351563
1622189979.850143;40.8000244140625;-15.660000610351563
1622189979.8609865;-26.20001220703125;3.500001907348633
1622189979.870959;-26.600006103515625;2.950000762939453
1622189979.8798988;-27.633341471354168;2.966667811075846
1622189979.8879066;-28.875015258789062;3.1250009536743164
1622189979.8970103;-30.66002197265625;3.1000011444091795
1622189979.9069412;-33.080029296875;3.5800006866455076
1622189979.9189363;-36.8400390625;4.30000114440918
1622189979.9289348;-41.36004638671875;5.30000114440918
1622189979.9388897;-46.46004638671875;6.540001296997071
1622189979.947972;-52.6200439453125;8.020000839233399
1622189979.9579456;-60.8600341796875;9.34000129699707
1622189979.969991;-71.70003051757813;11.520000839233399
1622189979.9789734;-84.68002319335938;14.180000686645508
1622189979.9870167;-99.32001953125;15.820000839233398
1622189980.0000162;-109.4400146484375;9.820001029968262
1622189980.009951;-109.4400146484375;9.820001029968262
1622189980.0201774;-109.4400146484375;9.820001029968262
1622189980.0279377;-109.4400146484375;9.820001029968262
1622189980.040027;-0.5;-10.200000762939453
1622189980.0499997;-1.850006103515625;-11.399999618530273
1622189980.0609317;-2.866668701171875;-13.233332316080729
1622189980.070989;-3.75;-14.049999237060547
1622189980.0799701;-4.14000244140625;-14.679999542236327
1622189980.0879495;-4.860003662109375;-17.07999954223633
1622189980.0969195;-4.620001220703125;-19.1
1622189980.1058955;-3.800006103515625;-20.960000610351564
1622189980.1178637;-1.800006103515625;-23.08000030517578
1622189980.1288311;1.539990234375;-25.25999984741211
1622189980.137807;6.17999267578125;-27.099999237060548
1622189980.1467857;12.099993896484374;-29.679998779296874
1622189980.154741;19.979998779296874;-31.939998626708984
1622189980.163746;30.659991455078124;-35.15999908447266
1622189980.1718752;45.779998779296875;-39.05999984741211
1622189980.18281;45.779998779296875;-39.05999984741211
1622189980.1928291;45.779998779296875;-39.05999984741211
1622189980.2039628;81.29998779296875;-22.199996948242188
1622189980.2129886;67.79998779296875;-24.099998474121094
1622189980.2209418;67.79998779296875;-24.099998474121094
1622189980.2299821;67.79998779296875;-24.099998474121094
1622189980.2409225;67.79998779296875;-24.099998474121094
1622189980.2510011;0.0;-11.400001525878906
1622189980.262968;0.54998779296875;-11.549999237060547
1622189980.270948;1.2333170572916667;-12.399998982747396
1622189980.2799225;0.9999847412109375;-12.299999237060547
1622189980.287905;1.1599853515625;-13.259999084472657
1622189980.2970405;1.13997802734375;-13.93999786376953
1622189980.3059847;1.55997314453125;-15.539997863769532
1622189980.3179488;1.23997802734375;-16.519998168945314
1622189980.3299441;1.93997802734375;-18.13999786376953
1622189980.3380144;2.65997314453125;-20.419996643066405
1622189980.3469896;5.13997802734375;-23.459996032714844
1622189980.355965;7.93997802734375;-25.499996948242188
1622189980.3639448;12.87996826171875;-27.97999725341797
1622189980.3719072;18.619970703125;-30.999998474121092
1622189980.382962;26.25997314453125;-32.91999969482422
1622189980.3940094;35.7999755859375;-35.26000213623047
1622189980.4040186;47.3999755859375;-38.84000091552734
1622189980.4130218;62.27998046875;-42.24000091552735
1622189980.4210055;78.6999755859375;-45.380000305175784
1622189980.4291162;78.6999755859375;-45.380000305175784
1622189980.441082;78.6999755859375;-45.380000305175784
1622189980.4510462;78.6999755859375;-45.380000305175784
1622189980.460023;78.6999755859375;-45.380000305175784
1622189980.473151;-24.20001220703125;1.9000091552734375
1622189980.483125;-26.300018310546875;1.5000076293945312
1622189980.4940922;-27.633341471354168;1.5666758219401042
1622189980.5040653;-29.925003051757812;1.4000091552734375
1622189980.5130413;-31.9800048828125;1.2800079345703126
1622189980.5220206;-35.54000244140625;0.840008544921875
1622189980.529896;-39.4;0.62000732421875
1622189980.5388713;-43.2;-0.1199951171875
1622189980.54699;-47.4800048828125;-0.139996337890625
1622189980.5559654;-52.55999755859375;-0.6999969482421875
1622189980.566607;-58.3;-2.179998779296875
1622189980.5787294;-66.0;-4.25999755859375
1622189980.5878153;-75.04000244140624;-5.639996337890625
1622189980.59679;-84.9800048828125;-8.5199951171875
1622189980.6057663;-95.160009765625;-11.599993896484374
1622189980.613744;-105.560009765625;-12.919992065429687
1622189980.6220155;-114.560009765625;-14.199990844726562
1622189980.6329868;-123.72000732421876;-16.359991455078124
1622189980.6439683;-132.7800048828125;-16.019992065429687
1622189980.6562092;-141.860009765625;-14.699990844726562
1622189980.6671734;-147.92000732421874;-13.139993286132812
1622189980.6791427;-151.760009765625;-9.339993286132813
1622189980.6878698;-154.4400146484375;-4.419992065429687
1622189980.6968458;-155.360009765625;-1.87999267578125
1622189980.7058206;-155.24000244140626;0.3600067138671875
1622189980.713809;-157.54000244140624;1.8600067138671874
1622189980.7217724;-160.57999267578126;1.2400054931640625
1622189980.7337468;-162.839990234375;6.103515625e-06
1622189980.7457254;-164.25999755859374;0.0600067138671875
1622189980.754686;-164.2;-0.87999267578125
1622189980.7626703;-162.9800048828125;-1.67999267578125
1622189980.7716455;-160.30001220703124;-1.97999267578125
1622189980.780144;-156.60001220703126;-2.4399932861328124
1622189980.7881238;-150.660009765625;-3.6199920654296873
1622189980.8000257;-142.0400146484375;-3.8399932861328123
1622189980.8106058;-130.2800048828125;-4.739993286132813
1622189980.8195498;-123.24000244140625;-5.099993896484375
1622189980.8281176;-123.24000244140625;-5.099993896484375
1622189980.839574;-123.24000244140625;-5.099993896484375
1622189980.8505404;-15.60003662109375;-1.3000030517578125
1622189980.862512;-18.500030517578125;-1.5
1622189980.8716033;-19.16668701171875;-2.399998982747396
1622189980.8796704;-20.300018310546875;-3.049999237060547
1622189980.888646;-21.26002197265625;-3.2
1622189980.8977554;-23.06002197265625;-4.179998779296875
1622189980.905731;-23.66002197265625;-4.439999389648437
1622189980.9167051;-24.54002685546875;-4.279998779296875
1622189980.9276383;-24.96002197265625;-4.019998168945312
1622189980.937659;-25.90001220703125;-4.319998168945313
1622189980.9466157;-27.02000732421875;-3.85999755859375
1622189980.9545689;-28.8;-4.119998168945313
1622189980.9635704;-31.2199951171875;-3.6600006103515623
1622189980.971548;-34.25999755859375;-3.2800018310546877
1622189980.983582;-37.8800048828125;-2.54000244140625
1622189980.9955573;-42.760009765625;-2.3200042724609373
1622189981.004506;-48.88001708984375;-1.8000030517578125
1622189981.0125148;-56.1400146484375;-1.3600006103515625
1622189981.0255823;-64.4400146484375;-0.3600006103515625
1622189981.0356636;-73.560009765625;1.8
1622189981.0486248;-84.82000732421875;4.439999389648437
1622189981.0585773;-94.9800048828125;11.139999389648438
1622189981.0685773;-94.9800048828125;11.139999389648438
1622189981.0766826;-94.9800048828125;11.139999389648438
1622189981.0897877;-94.9800048828125;11.139999389648438
1622189981.099881;-94.9800048828125;11.139999389648438
1622189981.1100388;-11.100006103515625;27.40000057220459
1622189981.1209884;-12.150009155273438;26.15000057220459
1622189981.1299965;-13.000010172526041;25.50000063578288
1622189981.1379752;-13.550010681152344;24.825000524520874
1622189981.1470373;-13.780010986328126;24.680000495910644
1622189981.1560998;-13.62000732421875;24.140000534057616
1622189981.1670482;-13.100006103515625;23.240000534057618
1622189981.1790357;-12.260003662109375;22.600000381469727
1622189981.188025;-9.9;22.300000381469726
1622189981.1960046;-6.179998779296875;21.500000381469725
1622189981.208027;-2.660003662109375;20.58000030517578
1622189981.2190409;3.7;20.640000343322754
1622189981.229031;13.6800048828125;19.70000042915344
1622189981.2380047;26.640008544921876;17.980000467598437
1622189981.2470272;41.960009765625;16.240000458061694
1622189981.256013;53.70001220703125;19.360000534355642
1622189981.2630017;53.70001220703125;19.360000534355642
1622189981.273976;53.70001220703125;19.360000534355642
1622189981.284032;53.70001220703125;19.360000534355642
1622189981.2938726;-23.20001220703125;19.600000381469727
1622189981.306885;-24.54998779296875;16.899999618530273
1622189981.3169658;-24.79998779296875;17.233332951863606
1622189981.328936;-25.499984741210938;17.59999942779541
1622189981.337911;-25.6599853515625;17.3799991607666
1622189981.3468874;-26.71998291015625;16.819999313354494
1622189981.355862;-28.19998779296875;17.199999618530274
1622189981.3638453;-30.179986572265626;17.039999771118165
1622189981.3719447;-32.21998901367188;16.560000228881837
1622189981.3839076;-34.959991455078125;16.860000228881837
1622189981.3958728;-39.439990234375;17.760000228881836
1622189981.4050062;-44.29998779296875;18.900000381469727
1622189981.4129791;-50.59998779296875;20.620000076293945
1622189981.4219558;-59.31998901367187;21.799999618530272
1622189981.4299357;-72.63998413085938;22.939999771118163
1622189981.4415102;-87.41998291015625;25.439999771118163
1622189981.4525657;-102.41998291015625;28.7799991607666
1622189981.461642;-102.41998291015625;28.7799991607666
1622189981.4700198;-102.41998291015625;28.7799991607666
1622189981.4779632;-102.41998291015625;28.7799991607666
1622189981.488716;-102.41998291015625;28.7799991607666
1622189981.4996884;-102.41998291015625;28.7799991607666
1622189981.511615;-102.41998291015625;28.7799991607666
1622189981.5185714;-102.41998291015625;28.7799991607666
1622189981.531849;-102.41998291015625;28.7799991607666
1622189981.5419085;-102.41998291015625;28.7799991607666
1622189981.5518768;-102.41998291015625;28.7799991607666
1622189981.5618544;-102.41998291015625;28.7799991607666
1622189981.5698333;-102.41998291015625;28.7799991607666
1622189981.581802;-102.41998291015625;28.7799991607666
1622189981.591776;-102.41998291015625;28.7799991607666
1622189981.6017425;-102.41998291015625;28.7799991607666
1622189981.6117194;-102.41998291015625;28.7799991607666
1622189981.618666;-102.41998291015625;28.7799991607666
1622189981.6306996;-102.41998291015625;28.7799991607666
1622189981.641631;-3.5;-16.5
1622189981.6516454;-1.79998779296875;-17.450000762939453
1622189981.6647599;-0.23331705729166666;-18.400001525878906
1622189981.676045;1.050018310546875;-19.17500114440918
1622189981.6880379;3.32001953125;-20.140000915527345
1622189981.6970212;8.12001953125;-22.220001220703125
1622189981.7059977;14.1400146484375;-24.920001220703124
1622189981.7139757;21.2400146484375;-27.520000457763672
1622189981.722038;30.9400146484375;-30.200000762939453
1622189981.7330368;42.98001708984375;-33.00000076293945
1622189981.7440088;58.38001708984375;-36.04000015258789
1622189981.752953;70.32001953125;-39.34000015258789
1622189981.7619681;70.32001953125;-39.34000015258789
1622189981.7699401;70.32001953125;-39.34000015258789
1622189981.7820072;70.32001953125;-39.34000015258789
1622189981.7919812;70.32001953125;-39.34000015258789
1622189981.8020396;2.29998779296875;-2.5
1622189981.8150072;5.350006103515625;-2.1999998092651367
1622189981.8259735;5.166666666666667;-2.8999996185302734
1622189981.8380384;5.524993896484375;-3.22499942779541
1622189981.847052;5.95999755859375;-3.579999542236328
1622189981.855041;7.1800048828125;-4.359999465942383
1622189981.86301;7.2800048828125;-4.939999389648437
1622189981.875055;8.42000732421875;-5.239999389648437
1622189981.887046;9.22000732421875;-5.559999465942383
1622189981.8960338;10.1800048828125;-5.879999160766602
1622189981.9050405;11.4199951171875;-5.659999084472656
1622189981.9140358;13.139990234375;-5.719998931884765
1622189981.9250693;15.99998779296875;-6.139999008178711
1622189981.9380364;20.8199951171875;-7.059999084472656
1622189981.9471238;28.2199951171875;-8.479999160766601
1622189981.9551365;38.54000244140625;-10.779999160766602
1622189981.9641075;51.64000244140625;-14.199999332427979
1622189981.9730856;65.74000244140625;-17.39999923706055
1622189981.9840548;65.74000244140625;-17.39999923706055
1622189981.99403;65.74000244140625;-17.39999923706055
1622189982.0040145;65.74000244140625;-17.39999923706055
