Image center coordinates: 
749.1000366210938;-130.89999389648438
762.5;-133.75
775.3333536783854;-136.43333435058594
789.1250305175781;-139.375
804.5600219726563;-143.47999877929686
835.3600219726562;-151.23999938964843
832.2200317382812;-143.43999938964845
797.3000122070313;-123.87999877929687
729.6599975585938;-95.81999969482422
633.2200073242187;-61.74000091552735
502.75999755859374;-19.720001220703125
382.8400024414062;12.95999984741211
286.6000122070312;37.77999985218048
286.6000122070312;37.77999985218048
286.6000122070312;37.77999985218048
286.6000122070312;37.77999985218048
286.6000122070312;37.77999985218048
-76.5999755859375;2.1000003814697266
-73.64996337890625;0.7000002861022949
-67.36663818359375;-0.7999995549519857
-59.94996643066406;-2.4249995946884155
-59.94996643066406;-2.4249995946884155
-59.94996643066406;-2.4249995946884155
-59.94996643066406;-2.4249995946884155
-59.94996643066406;-2.4249995946884155
-59.94996643066406;-2.4249995946884155
-59.94996643066406;-2.4249995946884155
-59.94996643066406;-2.4249995946884155
-59.94996643066406;-2.4249995946884155
-59.94996643066406;-2.4249995946884155
-59.94996643066406;-2.4249995946884155
-59.94996643066406;-2.4249995946884155
-59.94996643066406;-2.4249995946884155
-59.94996643066406;-2.4249995946884155
-59.94996643066406;-2.4249995946884155
-84.4000244140625;14.700000762939453
-91.85003662109375;15.05000114440918
-94.93336995442708;15.100001017252604
-94.90003967285156;15.475000381469727
-92.4400390625;15.180000305175781
-87.6400390625;14.55999984741211
-87.6400390625;14.55999984741211
-87.6400390625;14.55999984741211
-87.6400390625;14.55999984741211
-87.6400390625;14.55999984741211
-87.6400390625;14.55999984741211
-87.6400390625;14.55999984741211
-87.6400390625;14.55999984741211
-87.6400390625;14.55999984741211
-87.6400390625;14.55999984741211
-87.6400390625;14.55999984741211
-87.6400390625;14.55999984741211
-87.6400390625;14.55999984741211
-87.6400390625;14.55999984741211
-87.6400390625;14.55999984741211
-87.6400390625;14.55999984741211
-53.70001220703125;5.400001525878906
-61.20001220703125;6.05000114440918
-67.30000813802083;6.233333587646484
-71.95001220703125;6.300000190734863
-75.1400146484375;6.4
-79.68001708984374;6.519999694824219
-77.88001708984375;5.919999694824218
-67.68001708984374;4.419999694824218
-67.68001708984374;4.419999694824218
-67.68001708984374;4.419999694824218
-67.68001708984374;4.419999694824218
-67.68001708984374;4.419999694824218
-67.68001708984374;4.419999694824218
-67.68001708984374;4.419999694824218
-67.68001708984374;4.419999694824218
-67.68001708984374;4.419999694824218
-67.68001708984374;4.419999694824218
-67.68001708984374;4.419999694824218
-67.68001708984374;4.419999694824218
-67.68001708984374;4.419999694824218
-67.68001708984374;4.419999694824218
-13.4000244140625;-14.800003051757812
-23.1500244140625;-14.35000228881836
-29.13336181640625;-14.200002034505209
-33.1500244140625;-14.20000171661377
-33.880029296875;-14.700000762939453
-35.2600341796875;-15.679999542236327
-29.90003662109375;-16.879999542236327
-29.90003662109375;-16.879999542236327
-29.90003662109375;-16.879999542236327
-29.90003662109375;-16.879999542236327
-29.90003662109375;-16.879999542236327
-29.90003662109375;-16.879999542236327
-29.90003662109375;-16.879999542236327
-29.90003662109375;-16.879999542236327
-29.90003662109375;-16.879999542236327
-29.90003662109375;-16.879999542236327
-29.90003662109375;-16.879999542236327
-29.90003662109375;-16.879999542236327
-29.90003662109375;-16.879999542236327
-29.90003662109375;-16.879999542236327
-29.90003662109375;-16.879999542236327
-29.90003662109375;-16.879999542236327
-29.90003662109375;-16.879999542236327
-29.90003662109375;-16.879999542236327
-29.90003662109375;-16.879999542236327
-29.90003662109375;-16.879999542236327
-64.4000244140625;0.40000009536743164
-70.25003051757812;0.05000007152557373
-72.9000244140625;-0.3999999364217122
-71.75001525878906;-0.6249999403953552
-67.62001953125;-1.4599999904632568
-67.62001953125;-1.4599999904632568
-67.62001953125;-1.4599999904632568
-67.62001953125;-1.4599999904632568
-67.62001953125;-1.4599999904632568
-67.62001953125;-1.4599999904632568
-67.62001953125;-1.4599999904632568
-67.62001953125;-1.4599999904632568
-67.62001953125;-1.4599999904632568
-67.62001953125;-1.4599999904632568
-67.62001953125;-1.4599999904632568
-67.62001953125;-1.4599999904632568
-67.62001953125;-1.4599999904632568
-67.62001953125;-1.4599999904632568
-67.62001953125;-1.4599999904632568
-67.62001953125;-1.4599999904632568
-67.62001953125;-1.4599999904632568
-67.62001953125;-1.4599999904632568
-67.62001953125;-1.4599999904632568
-67.62001953125;-1.4599999904632568
-67.62001953125;-1.4599999904632568
-67.62001953125;-1.4599999904632568
-67.62001953125;-1.4599999904632568
-67.62001953125;-1.4599999904632568
-67.62001953125;-1.4599999904632568
-67.62001953125;-1.4599999904632568
-67.62001953125;-1.4599999904632568
-67.62001953125;-1.4599999904632568
-67.62001953125;-1.4599999904632568
-67.62001953125;-1.4599999904632568
-67.62001953125;-1.4599999904632568
-67.62001953125;-1.4599999904632568
-67.62001953125;-1.4599999904632568
-67.62001953125;-1.4599999904632568
-67.62001953125;-1.4599999904632568
-67.62001953125;-1.4599999904632568
-67.62001953125;-1.4599999904632568
-67.62001953125;-1.4599999904632568
-67.62001953125;-1.4599999904632568
-67.62001953125;-1.4599999904632568
-67.62001953125;-1.4599999904632568
-67.62001953125;-1.4599999904632568
-67.62001953125;-1.4599999904632568
-67.62001953125;-1.4599999904632568
-67.62001953125;-1.4599999904632568
-67.62001953125;-1.4599999904632568
-67.62001953125;-1.4599999904632568
-67.62001953125;-1.4599999904632568
-67.62001953125;-1.4599999904632568
-67.62001953125;-1.4599999904632568
-67.62001953125;-1.4599999904632568
-67.62001953125;-1.4599999904632568
-67.62001953125;-1.4599999904632568
-67.62001953125;-1.4599999904632568
-67.62001953125;-1.4599999904632568
-67.62001953125;-1.4599999904632568
-67.62001953125;-1.4599999904632568
-67.62001953125;-1.4599999904632568
-67.62001953125;-1.4599999904632568
-67.62001953125;-1.4599999904632568
-67.62001953125;-1.4599999904632568
-67.62001953125;-1.4599999904632568
-67.62001953125;-1.4599999904632568
-67.62001953125;-1.4599999904632568
-67.62001953125;-1.4599999904632568
-67.62001953125;-1.4599999904632568
-67.62001953125;-1.4599999904632568
-67.62001953125;-1.4599999904632568
-67.62001953125;-1.4599999904632568
-67.62001953125;-1.4599999904632568
-67.62001953125;-1.4599999904632568
-67.62001953125;-1.4599999904632568
-67.62001953125;-1.4599999904632568
-67.62001953125;-1.4599999904632568
-67.62001953125;-1.4599999904632568
-67.62001953125;-1.4599999904632568
-67.62001953125;-1.4599999904632568
-67.62001953125;-1.4599999904632568
-67.62001953125;-1.4599999904632568
-67.62001953125;-1.4599999904632568
-67.62001953125;-1.4599999904632568
-67.62001953125;-1.4599999904632568
-67.62001953125;-1.4599999904632568
-67.62001953125;-1.4599999904632568
-67.62001953125;-1.4599999904632568
-67.62001953125;-1.4599999904632568
-67.62001953125;-1.4599999904632568
-67.62001953125;-1.4599999904632568
-67.62001953125;-1.4599999904632568
-67.62001953125;-1.4599999904632568
-67.62001953125;-1.4599999904632568
-67.62001953125;-1.4599999904632568
-67.62001953125;-1.4599999904632568
-67.62001953125;-1.4599999904632568
-67.62001953125;-1.4599999904632568
-67.62001953125;-1.4599999904632568
-67.62001953125;-1.4599999904632568
-67.62001953125;-1.4599999904632568
-67.62001953125;-1.4599999904632568
-67.62001953125;-1.4599999904632568
-67.62001953125;-1.4599999904632568
-67.62001953125;-1.4599999904632568
-67.62001953125;-1.4599999904632568
-67.62001953125;-1.4599999904632568
-67.62001953125;-1.4599999904632568
-67.62001953125;-1.4599999904632568
-67.62001953125;-1.4599999904632568
-67.62001953125;-1.4599999904632568
-67.62001953125;-1.4599999904632568
-67.62001953125;-1.4599999904632568
-67.62001953125;-1.4599999904632568
-67.62001953125;-1.4599999904632568
-67.62001953125;-1.4599999904632568
-67.62001953125;-1.4599999904632568
-67.62001953125;-1.4599999904632568
-67.62001953125;-1.4599999904632568
-67.62001953125;-1.4599999904632568
-67.62001953125;-1.4599999904632568
-67.62001953125;-1.4599999904632568
-67.62001953125;-1.4599999904632568
-67.62001953125;-1.4599999904632568
-67.62001953125;-1.4599999904632568
-67.62001953125;-1.4599999904632568
-67.62001953125;-1.4599999904632568
-67.62001953125;-1.4599999904632568
-67.62001953125;-1.4599999904632568
-67.62001953125;-1.4599999904632568
-67.62001953125;-1.4599999904632568
-67.62001953125;-1.4599999904632568
-67.62001953125;-1.4599999904632568
-67.62001953125;-1.4599999904632568
-67.62001953125;-1.4599999904632568
-67.62001953125;-1.4599999904632568
-67.62001953125;-1.4599999904632568
-67.62001953125;-1.4599999904632568
-67.62001953125;-1.4599999904632568
-67.62001953125;-1.4599999904632568
-67.62001953125;-1.4599999904632568
-67.62001953125;-1.4599999904632568
-67.62001953125;-1.4599999904632568
-67.62001953125;-1.4599999904632568
-67.62001953125;-1.4599999904632568
-67.62001953125;-1.4599999904632568
-67.62001953125;-1.4599999904632568
-67.62001953125;-1.4599999904632568
-67.62001953125;-1.4599999904632568
-67.62001953125;-1.4599999904632568
-67.62001953125;-1.4599999904632568
-67.62001953125;-1.4599999904632568
-67.62001953125;-1.4599999904632568
-67.62001953125;-1.4599999904632568
-67.62001953125;-1.4599999904632568
-67.62001953125;-1.4599999904632568
-67.62001953125;-1.4599999904632568
-67.62001953125;-1.4599999904632568
-67.62001953125;-1.4599999904632568
-67.62001953125;-1.4599999904632568
-67.62001953125;-1.4599999904632568
-67.62001953125;-1.4599999904632568
-67.62001953125;-1.4599999904632568
-67.62001953125;-1.4599999904632568
-67.62001953125;-1.4599999904632568
-67.62001953125;-1.4599999904632568
-67.62001953125;-1.4599999904632568
-67.62001953125;-1.4599999904632568
-67.62001953125;-1.4599999904632568
-67.62001953125;-1.4599999904632568
-67.62001953125;-1.4599999904632568
-67.62001953125;-1.4599999904632568
-67.62001953125;-1.4599999904632568
-67.62001953125;-1.4599999904632568
-67.62001953125;-1.4599999904632568
-67.62001953125;-1.4599999904632568
-67.62001953125;-1.4599999904632568
-67.62001953125;-1.4599999904632568
-67.62001953125;-1.4599999904632568
-67.62001953125;-1.4599999904632568
-67.62001953125;-1.4599999904632568
-67.62001953125;-1.4599999904632568
-67.62001953125;-1.4599999904632568
-67.62001953125;-1.4599999904632568
-67.62001953125;-1.4599999904632568
-67.62001953125;-1.4599999904632568
-67.62001953125;-1.4599999904632568
-67.62001953125;-1.4599999904632568
-67.62001953125;-1.4599999904632568
-67.62001953125;-1.4599999904632568
-67.62001953125;-1.4599999904632568
-67.62001953125;-1.4599999904632568
-67.62001953125;-1.4599999904632568
-67.62001953125;-1.4599999904632568
-67.62001953125;-1.4599999904632568
-67.62001953125;-1.4599999904632568
-67.62001953125;-1.4599999904632568
-67.62001953125;-1.4599999904632568
-67.62001953125;-1.4599999904632568
-67.62001953125;-1.4599999904632568
-67.62001953125;-1.4599999904632568
-67.62001953125;-1.4599999904632568
-67.62001953125;-1.4599999904632568
-67.62001953125;-1.4599999904632568
-67.62001953125;-1.4599999904632568
-67.62001953125;-1.4599999904632568
-67.62001953125;-1.4599999904632568
-67.62001953125;-1.4599999904632568
-67.62001953125;-1.4599999904632568
-67.62001953125;-1.4599999904632568
-67.62001953125;-1.4599999904632568
-67.62001953125;-1.4599999904632568
-67.62001953125;-1.4599999904632568
-67.62001953125;-1.4599999904632568
-67.62001953125;-1.4599999904632568
-67.62001953125;-1.4599999904632568
-67.62001953125;-1.4599999904632568
-67.62001953125;-1.4599999904632568
-67.62001953125;-1.4599999904632568
-67.62001953125;-1.4599999904632568
-67.62001953125;-1.4599999904632568
-67.62001953125;-1.4599999904632568
-67.62001953125;-1.4599999904632568
-67.62001953125;-1.4599999904632568
-67.62001953125;-1.4599999904632568
-67.62001953125;-1.4599999904632568
-67.62001953125;-1.4599999904632568
-67.62001953125;-1.4599999904632568
-67.62001953125;-1.4599999904632568
-67.62001953125;-1.4599999904632568
-67.62001953125;-1.4599999904632568
-67.62001953125;-1.4599999904632568
-67.62001953125;-1.4599999904632568
-67.62001953125;-1.4599999904632568
-67.62001953125;-1.4599999904632568
-67.62001953125;-1.4599999904632568
-67.62001953125;-1.4599999904632568
-67.62001953125;-1.4599999904632568
-67.62001953125;-1.4599999904632568
-67.62001953125;-1.4599999904632568
-67.62001953125;-1.4599999904632568
-67.62001953125;-1.4599999904632568
-67.62001953125;-1.4599999904632568
-67.62001953125;-1.4599999904632568
-67.62001953125;-1.4599999904632568
-67.62001953125;-1.4599999904632568
-67.62001953125;-1.4599999904632568
-67.62001953125;-1.4599999904632568
-67.62001953125;-1.4599999904632568
-67.62001953125;-1.4599999904632568
-67.62001953125;-1.4599999904632568
960.0;540.0
395.0;213.70000457763672
197.699951171875;7.1999969482421875
245.800048828125;-43.599998474121094
-399.2999267578125;66.19999694824219
-399.2999267578125;66.19999694824219
-399.2999267578125;66.19999694824219
-399.2999267578125;66.19999694824219
-399.2999267578125;66.19999694824219
-399.2999267578125;66.19999694824219
-90.4000244140625;-1.1000022888183594
-90.30001831054688;-1.1000022888183594
-88.20001220703125;-2.300001780192057
-82.85000610351562;-3.4000015258789062
-82.85000610351562;-3.4000015258789062
-82.85000610351562;-3.4000015258789062
-82.85000610351562;-3.4000015258789062
-82.85000610351562;-3.4000015258789062
-82.85000610351562;-3.4000015258789062
-82.85000610351562;-3.4000015258789062
-82.85000610351562;-3.4000015258789062
-82.85000610351562;-3.4000015258789062
-82.85000610351562;-3.4000015258789062
-82.85000610351562;-3.4000015258789062
-82.85000610351562;-3.4000015258789062
-82.85000610351562;-3.4000015258789062
-82.85000610351562;-3.4000015258789062
-82.85000610351562;-3.4000015258789062
-82.85000610351562;-3.4000015258789062
-82.85000610351562;-3.4000015258789062
-82.85000610351562;-3.4000015258789062
-82.85000610351562;-3.4000015258789062
-82.85000610351562;-3.4000015258789062
-82.85000610351562;-3.4000015258789062
-82.85000610351562;-3.4000015258789062
-55.79998779296875;0.7000045776367188
-64.64999389648438;3.4500045776367188
-70.0333251953125;4.566670735677083
-71.69999694824219;6.325004577636719
-70.74000244140625;8.120004272460937
-70.22000732421876;11.060003662109375
-61.82000732421875;12.720003509521485
-61.82000732421875;12.720003509521485
-61.82000732421875;12.720003509521485
-61.82000732421875;12.720003509521485
137.60003662109375;-11.0
162.75;-15.450000762939453
162.75;-15.450000762939453
162.75;-15.450000762939453
162.75;-15.450000762939453
162.75;-15.450000762939453
162.75;-15.450000762939453
162.75;-15.450000762939453
162.75;-15.450000762939453
162.75;-15.450000762939453
162.75;-15.450000762939453
162.75;-15.450000762939453
162.75;-15.450000762939453
162.75;-15.450000762939453
162.75;-15.450000762939453
162.75;-15.450000762939453
162.75;-15.450000762939453
-87.4000244140625;0.2999992370605469
-87.20001220703125;0.75
-85.4000244140625;1.3666661580403645
-80.9000244140625;2.5249996185302734
-74.22001953125;3.7
-74.22001953125;3.7
-74.22001953125;3.7
-74.22001953125;3.7
-74.22001953125;3.7
141.300048828125;-12.800003051757812
141.300048828125;-12.800003051757812
141.300048828125;-12.800003051757812
141.300048828125;-12.800003051757812
141.300048828125;-12.800003051757812
141.300048828125;-12.800003051757812
141.300048828125;-12.800003051757812
-40.20001220703125;18.000003814697266
-45.20001220703125;19.050003051757812
-47.033345540364586;19.600003560384113
-46.55000305175781;19.77500343322754
-43.9800048828125;19.260003662109376
-38.7;18.900003814697264
-38.7;18.900003814697264
-38.7;18.900003814697264
-38.7;18.900003814697264
-38.7;18.900003814697264
-38.7;18.900003814697264
-38.7;18.900003814697264
-38.7;18.900003814697264
-38.7;18.900003814697264
-38.7;18.900003814697264
-38.7;18.900003814697264
-38.7;18.900003814697264
-38.7;18.900003814697264
-38.7;18.900003814697264
-38.7;18.900003814697264
-38.7;18.900003814697264
-38.7;18.900003814697264
-38.7;18.900003814697264
-38.7;18.900003814697264
-38.7;18.900003814697264
100.0999755859375;-16.699996948242188
93.25;-18.04999542236328
88.16666666666667;-17.76666259765625
87.17500305175781;-17.67499542236328
89.0;-17.839996337890625
92.260009765625;-18.159996032714844
92.260009765625;-18.159996032714844
92.260009765625;-18.159996032714844
92.260009765625;-18.159996032714844
92.260009765625;-18.159996032714844
92.260009765625;-18.159996032714844
92.260009765625;-18.159996032714844
92.260009765625;-18.159996032714844
92.260009765625;-18.159996032714844
92.260009765625;-18.159996032714844
92.260009765625;-18.159996032714844
92.260009765625;-18.159996032714844
92.260009765625;-18.159996032714844
92.260009765625;-18.159996032714844
92.260009765625;-18.159996032714844
92.260009765625;-18.159996032714844
92.260009765625;-18.159996032714844
92.260009765625;-18.159996032714844
92.260009765625;-18.159996032714844
92.260009765625;-18.159996032714844
92.260009765625;-18.159996032714844
92.260009765625;-18.159996032714844
92.260009765625;-18.159996032714844
-100.20001220703125;10.0
-104.25;10.349998474121094
-103.80000813802083;10.333330790201822
