Image center coordinates: 
1622190012.4586818;-8.800018310546875;2.200000762939453
1622190012.4677174;-13.400009155273438;1.3000001907348633
1622190012.4777148;-10.500010172526041;2.5
1622190012.4866898;-15.350006103515625;2.950000286102295
1622190012.4957125;-15.440008544921875;2.620000457763672
1622190012.5047004;-8.62000732421875;2.5400005340576173
1622190012.5141888;-1.860009765625;2.9600006103515626
1622190012.5262864;2.319989013671875;2.380000686645508
1622190012.5356822;12.039984130859375;1.380000686645508
1622190012.5444243;18.839984130859374;1.2400005340576172
1622190012.5538344;16.91998291015625;0.2800006866455078
1622190012.5628142;17.679986572265626;-0.1399993896484375
1622190012.5717924;-5.5999755859375;-1.5
1622190012.581626;-2.54998779296875;-2.1000003814697266
1622190012.5927198;-1.9999898274739583;-2.3333333333333335
1622190012.602717;-0.5999908447265625;-3.0749998092651367
1622190012.611895;0.960009765625;-3.0599998474121093
1622190012.620582;4.2800048828125;-3.519999694824219
1622190012.6295693;7.940008544921875;-4.039999389648438
1622190012.63949;13.760009765625;-4.319999694824219
1622190012.6479988;20.540008544921875;-4.340000152587891
1622190012.6570506;29.640008544921876;-5.8599998474121096
1622190012.6680534;43.16001586914062;-7.44000015258789
1622190012.6782424;43.16001586914062;-7.44000015258789
1622190012.6874728;43.16001586914062;-7.44000015258789
1622190012.6966617;43.16001586914062;-7.44000015258789
1622190012.7059977;43.16001586914062;-7.44000015258789
1622190012.7143326;43.16001586914062;-7.44000015258789
1622190012.72241;43.16001586914062;-7.44000015258789
1622190012.7324579;-0.70001220703125;9.299999952316284
1622190012.739432;0.199981689453125;8.499999761581421
1622190012.7517679;2.1666463216145835;8.699999888737997
1622190012.7606552;4.2999725341796875;8.474999904632568
1622190012.7699122;6.43997802734375;7.359999895095825
1622190012.7788846;10.87998046875;6.4199999332427975
1622190012.7887042;16.87998046875;5.259999990463257
1622190012.7976797;24.4599853515625;3.6799999713897704
1622190012.8073556;33.839990234375;1.6199999809265138
1622190012.8153074;46.59998779296875;-0.04000000953674317
1622190012.8268142;46.59998779296875;-0.04000000953674317
1622190012.8358047;46.59998779296875;-0.04000000953674317
1622190012.844618;46.59998779296875;-0.04000000953674317
1622190012.853594;46.59998779296875;-0.04000000953674317
1622190012.8625638;-32.89996337890625;14.999998092651367
1622190012.8717399;-33.249969482421875;12.94999885559082
1622190012.881636;-34.36663818359375;12.899999618530273
1622190012.8928952;-34.92497253417969;12.59999942779541
1622190012.9034622;-35.719970703125;12.319999313354492
1622190012.912699;-37.419970703125;11.739999771118164
1622190012.9218059;-39.119970703125;12.059999465942383
1622190012.931612;-40.43997802734375;11.879999160766602
1622190012.9405854;-42.33997802734375;12.019999313354493
1622190012.9476483;-43.79998779296875;12.179999160766602
1622190012.9597504;-45.85999755859375;11.89999885559082
1622190012.9698205;-48.3199951171875;11.759999465942382
1622190012.9796214;-51.21998901367188;11.779999160766602
1622190012.9887238;-55.299993896484374;11.479999160766601
1622190012.9977076;-59.119989013671876;11.839999771118164
1622190013.006704;-63.239984130859376;12.279999923706054
1622190013.0178244;-67.45999145507812;12.799999618530274
1622190013.0279224;-72.79999389648438;13.639999771118164
1622190013.0368998;-77.639990234375;15.179999923706054
1622190013.0467322;-84.29998779296875;16.359999465942384
1622190013.054706;-91.71998901367188;18.319999313354494
1622190013.0647094;-99.5599853515625;19.599999618530273
1622190013.0736563;-107.61998291015625;17.35999984741211
1622190013.0816698;-117.13998413085938;13.379999542236328
1622190013.0929642;-120.79998779296875;14.8
1622190013.1029336;-120.79998779296875;14.8
1622190013.1119323;-120.79998779296875;14.8
1622190013.12113;-120.79998779296875;14.8
1622190013.129445;1.300018310546875;7.5
1622190013.138898;0.2500152587890625;4.05000114440918
1622190013.1478739;0.9000142415364584;2.7333348592122397
1622190013.1571965;-2.9999847412109375;1.975001335144043
1622190013.1641796;-1.9599853515625;-1.8199989318847656
1622190013.1763642;-1.9599853515625;-1.8199989318847656
1622190013.1865945;-1.9599853515625;-1.8199989318847656
1622190013.1957815;-1.9599853515625;-1.8199989318847656
1622190013.2045908;-1.9599853515625;-1.8199989318847656
1622190013.2138999;-1.9599853515625;-1.8199989318847656
1622190013.222881;-1.9599853515625;-1.8199989318847656
1622190013.2308862;-1.9599853515625;-1.8199989318847656
1622190013.2388911;-1.9599853515625;-1.8199989318847656
1622190013.2478907;-1.9599853515625;-1.8199989318847656
1622190013.2558875;-1.9599853515625;-1.8199989318847656
1622190013.2639031;-1.9599853515625;-1.8199989318847656
1622190013.27289;-1.9599853515625;-1.8199989318847656
1622190013.2814255;-1.9599853515625;-1.8199989318847656
1622190013.2896607;-1.9599853515625;-1.8199989318847656
1622190013.3019931;-1.9599853515625;-1.8199989318847656
1622190013.310974;-1.9599853515625;-1.8199989318847656
1622190013.3200023;-1.9599853515625;-1.8199989318847656
1622190013.3300085;-1.9599853515625;-1.8199989318847656
1622190013.3399732;-1.9599853515625;-1.8199989318847656
1622190013.351969;-1.9599853515625;-1.8199989318847656
1622190013.3619514;-1.9599853515625;-1.8199989318847656
1622190013.370975;-1.9599853515625;-1.8199989318847656
1622190013.3799484;-1.9599853515625;-1.8199989318847656
1622190013.390884;20.399993896484375;1.4000244140625
1622190013.3988597;20.54998779296875;1.9000244140625
1622190013.4113815;20.700002034505207;2.9000244140625
1622190013.4216714;20.75;3.1500244140625
1622190013.4326425;19.900006103515626;2.54002685546875
1622190013.4427361;18.540008544921875;2.8000244140625
1622190013.4507153;16.30001220703125;2.06002197265625
1622190013.4609137;13.200006103515625;0.6000244140625
1622190013.4699354;8.340008544921876;2.44140625e-05
1622190013.4789307;3.060003662109375;-0.71998291015625
1622190013.4889383;-4.099993896484375;-2.37998046875
1622190013.4976246;-8.539990234375;-5.2999755859375
1622190013.506403;-8.539990234375;-5.2999755859375
1622190013.5159955;-8.539990234375;-5.2999755859375
1622190013.5230012;-8.539990234375;-5.2999755859375
1622190013.530983;-8.539990234375;-5.2999755859375
1622190013.5389614;-8.539990234375;-5.2999755859375
1622190013.5479443;4.5;1.79998779296875
1622190013.5603735;4.5;1.5
1622190013.56987;4.966654459635417;0.6333414713541666
1622190013.5789206;5.5999908447265625;0.6750030517578125
1622190013.5879138;5.9599853515625;0.0
1622190013.5969307;7.5599853515625;-0.85999755859375
1622190013.6077354;10.0599853515625;-1.8
1622190013.6157293;12.539990234375;-2.42000732421875
1622190013.6269264;17.039990234375;-3.460009765625
1622190013.6369457;23.65999755859375;-3.50001220703125
1622190013.6469433;31.8;-3.02000732421875
1622190013.6578503;42.74000244140625;-2.72000732421875
1622190013.665831;56.45999755859375;-2.34000244140625
1622190013.6769185;56.45999755859375;-2.34000244140625
1622190013.6869328;56.45999755859375;-2.34000244140625
1622190013.6961753;56.45999755859375;-2.34000244140625
1622190013.7052293;56.45999755859375;-2.34000244140625
1622190013.7153053;11.60003662109375;-0.39996337890625
1622190013.7265122;10.300018310546875;-2.79998779296875
1622190013.7376635;9.366678873697916;-3.26666259765625
1622190013.7469265;9.400009155273438;-4.1999969482421875
1622190013.756717;9.82000732421875;-5.0
1622190013.768394;11.52000732421875;-6.7
1622190013.777814;15.18001708984375;-7.6
1622190013.7867992;21.16002197265625;-8.75999755859375
1622190013.7967732;28.84002685546875;-9.7
1622190013.8076565;38.84002685546875;-9.2
1622190013.8157415;49.14002685546875;-7.6800048828125
1622190013.8277144;61.06002197265625;-6.1800048828125
1622190013.837721;73.84002685546875;-3.35999755859375
1622190013.8466961;87.12003173828126;-0.17999267578125
1622190013.8556423;102.0400390625;2.08001708984375
1622190013.8657494;113.18004150390625;13.28001708984375
1622190013.8729303;113.18004150390625;13.28001708984375
1622190013.8809135;113.18004150390625;13.28001708984375
1622190013.889766;113.18004150390625;13.28001708984375
1622190013.8974679;113.18004150390625;13.28001708984375
1622190013.9064872;113.18004150390625;13.28001708984375
1622190013.9147182;113.18004150390625;13.28001708984375
1622190013.922753;113.18004150390625;13.28001708984375
1622190013.930877;113.18004150390625;13.28001708984375
1622190013.939642;113.18004150390625;13.28001708984375
1622190013.9475994;113.18004150390625;13.28001708984375
1622190013.9585052;113.18004150390625;13.28001708984375
1622190013.9647794;113.18004150390625;13.28001708984375
1622190013.9767773;113.18004150390625;13.28001708984375
1622190013.9864225;113.18004150390625;13.28001708984375
1622190013.995818;113.18004150390625;13.28001708984375
1622190014.0047984;113.18004150390625;13.28001708984375
1622190014.0139027;113.18004150390625;13.28001708984375
1622190014.0229187;113.18004150390625;13.28001708984375
1622190014.0309093;113.18004150390625;13.28001708984375
1622190014.0397737;113.18004150390625;13.28001708984375
1622190014.0478306;113.18004150390625;13.28001708984375
1622190014.0567286;113.18004150390625;13.28001708984375
1622190014.064707;113.18004150390625;13.28001708984375
1622190014.0768924;113.18004150390625;13.28001708984375
1622190014.0869079;113.18004150390625;13.28001708984375
1622190014.0958836;113.18004150390625;13.28001708984375
1622190014.1048582;113.18004150390625;13.28001708984375
1622190014.1138494;113.18004150390625;13.28001708984375
1622190014.1228461;113.18004150390625;13.28001708984375
1622190014.1328201;4.5999755859375;42.29999923706055
1622190014.1407971;3.29998779296875;40.099998474121094
1622190014.1518092;0.76666259765625;37.699999491373696
1622190014.1613822;-0.4000091552734375;34.97499942779541
1622190014.171359;-1.22000732421875;32.95999984741211
1622190014.1823394;-2.52000732421875;28.440000152587892
1622190014.1935396;-3.1400146484375;24.340000915527344
1622190014.2028918;-1.28001708984375;20.320000457763673
1622190014.2118633;2.17998046875;16.860000610351562
1622190014.2218704;7.63997802734375;13.200000762939453
1622190014.2328472;14.51998291015625;9.920000457763672
1622190014.2408197;24.439990234375;6.180000305175781
1622190014.2518291;39.77999267578125;2.200000762939453
1622190014.2618275;39.77999267578125;2.200000762939453
1622190014.2708933;39.77999267578125;2.200000762939453
1622190014.279966;39.77999267578125;2.200000762939453
1622190014.2891228;39.77999267578125;2.200000762939453
1622190014.2980285;39.77999267578125;2.200000762939453
1622190014.310048;39.77999267578125;2.200000762939453
1622190014.3212774;-13.9000244140625;-8.700000762939453
1622190014.3297985;-14.4000244140625;-9.850000381469727
1622190014.340732;-15.066691080729166;-10.633333841959635
1622190014.3517888;-14.5250244140625;-11.225000381469727
1622190014.361783;-14.0000244140625;-11.760000610351563
1622190014.3707836;-12.7000244140625;-12.860000610351562
1622190014.3807847;-10.54002685546875;-13.480001068115234
1622190014.3906953;-7.5000244140625;-13.820001220703125
1622190014.3992584;-3.82001953125;-14.440001296997071
1622190014.407776;1.27998046875;-14.660000991821288
1622190014.4157462;6.91998291015625;-15.120000839233398
1622190014.4267461;16.37999267578125;-16.58000068664551
1622190014.4376774;26.6199951171875;-18.240000534057618
1622190014.446826;26.6199951171875;-18.240000534057618
1622190014.455804;26.6199951171875;-18.240000534057618
1622190014.4647267;26.6199951171875;-18.240000534057618
1622190014.4727738;26.6199951171875;-18.240000534057618
1622190014.48268;-10.20001220703125;0.7000007629394531
1622190014.4906602;-11.800018310546875;-1.25
1622190014.501846;-11.966695149739584;-1.1333332061767578
1622190014.511848;-12.825027465820312;-1.3499999046325684
1622190014.5218117;-13.42003173828125;-1.139999771118164
1622190014.5327876;-15.30003662109375;-1.8599998474121093
1622190014.5407712;-16.80003662109375;-1.1599998474121094
1622190014.5517912;-18.62003173828125;-0.7399997711181641
1622190014.5617883;-20.72003173828125;-0.15999984741210938
1622190014.5717616;-23.920025634765626;0.2200000762939453
1622190014.5826998;-27.26002197265625;0.9
1622190014.5906453;-30.7000244140625;1.3200000762939452
1622190014.601769;-36.66002197265625;1.6799999237060548
1622190014.611777;-43.140020751953124;2.040000152587891
1622190014.6207855;-50.04002075195312;2.860000228881836
1622190014.6317542;-58.180023193359375;3.3200000762939452
1622190014.6407237;-68.68002319335938;4.180000305175781
1622190014.6493196;-78.46002807617188;5.7
1622190014.6572995;-90.36002807617187;6.7
1622190014.6688342;-104.72003173828125;8.3
1622190014.6788056;-104.72003173828125;8.3
1622190014.6877954;-104.72003173828125;8.3
1622190014.6967998;-104.72003173828125;8.3
1622190014.7063882;-104.72003173828125;8.3
1622190014.7187474;-104.72003173828125;8.3
1622190014.728794;-104.72003173828125;8.3
1622190014.7379062;-104.72003173828125;8.3
1622190014.7469368;-104.72003173828125;8.3
1622190014.755913;-104.72003173828125;8.3
1622190014.7662694;-4.70001220703125;-4.0
1622190014.7742481;-3.20001220703125;-4.399999618530273
1622190014.7847931;-1.8666788736979167;-4.933333079020183
1622190014.7957246;-0.7750091552734375;-5.374999046325684
1622190014.8037415;0.839990234375;-5.859999084472657
1622190014.8137152;4.839990234375;-6.379998779296875
1622190014.8256202;10.07999267578125;-7.359998321533203
1622190014.8336296;17.45999755859375;-8.039997863769532
1622190014.8417966;27.039996337890624;-8.679998016357422
1622190014.851796;39.439996337890626;-9.99999771118164
1622190014.8618352;55.279998779296875;-11.619997787475587
1622190014.870838;66.63999633789062;-11.859997940063476
1622190014.880838;66.63999633789062;-11.859997940063476
1622190014.8914125;66.63999633789062;-11.859997940063476
1622190014.8985093;66.63999633789062;-11.859997940063476
1622190014.910289;66.63999633789062;-11.859997940063476
1622190014.9204764;16.5;-2.5
1622190014.9296067;17.149993896484375;-2.8999996185302734
1622190014.940638;17.066660563151043;-2.9666671752929688
1622190014.9522088;17.24999237060547;-2.950000762939453
1622190014.961417;17.419989013671874;-3.3400009155273436
1622190014.970864;17.49998779296875;-4.420001220703125
1622190014.9808354;17.679986572265626;-4.600001525878906
1622190014.9908445;18.51998291015625;-4.960001373291016
1622190015.0017986;17.67998046875;-5.160001373291015
1622190015.0118444;16.139984130859375;-5.120001220703125
1622190015.02084;14.5599853515625;-4.400000762939453
1622190015.030866;10.979986572265625;-4.480001068115234
1622190015.0408401;6.179986572265625;-4.420001220703125
1622190015.0478413;1.979986572265625;-4.200000762939453
1622190015.0598402;-3.360015869140625;-5.1000007629394535
1622190015.0698175;-9.800018310546875;-4.660001373291015
1622190015.078815;-9.800018310546875;-4.660001373291015
1622190015.087818;-9.800018310546875;-4.660001373291015
1622190015.0967722;-9.800018310546875;-4.660001373291015
1622190015.105748;-9.800018310546875;-4.660001373291015
1622190015.1156535;-11.699981689453125;-2.200000762939453
1622190015.1238322;-13.149993896484375;-2.299999237060547
1622190015.1348047;-14.199991861979166;-2.1666653951009116
1622190015.145805;-15.299995422363281;-2.049999237060547
1622190015.1548471;-15.799993896484375;-2.259999084472656
1622190015.1638432;-17.85999755859375;-2.0199989318847655
1622190015.1757915;-19.939996337890626;-1.9199989318847657
1622190015.183771;-21.6;-1.879999542236328
1622190015.1917536;-23.179998779296874;-1.6399993896484375
1622190015.201787;-27.15999755859375;-0.059999847412109376
1622190015.2117586;-31.839996337890625;0.7200004577636718
1622190015.220735;-37.439996337890626;1.0800003051757812
1622190015.230816;-38.97999267578125;1.9200004577636718
1622190015.2397316;-38.97999267578125;1.9200004577636718
1622190015.249733;-38.97999267578125;1.9200004577636718
1622190015.256709;-38.97999267578125;1.9200004577636718
1622190015.2688198;-6.20001220703125;1.8000030517578125
1622190015.2788563;-7.95001220703125;0.3000030517578125
1622190015.2879024;-8.766672770182291;0.33333587646484375
1622190015.2988758;-9.600006103515625;0.1750020980834961
1622190015.3104663;-10.060003662109375;0.14000167846679687
1622190015.319702;-10.94000244140625;-0.8599983215332031
1622190015.3288035;-12.65999755859375;-0.9999984741210938
1622190015.3397994;-14.7;-1.179998779296875
1622190015.3498015;-17.279998779296875;-0.879998779296875
1622190015.3583605;-19.220001220703125;0.420001220703125
1622190015.3663397;-25.020001220703126;0.8800010681152344
1622190015.37734;-25.020001220703126;0.8800010681152344
1622190015.3865588;-25.020001220703126;0.8800010681152344
1622190015.395535;-25.020001220703126;0.8800010681152344
1622190015.4049635;-25.020001220703126;0.8800010681152344
1622190015.4139662;-25.020001220703126;0.8800010681152344
1622190015.4229422;-25.020001220703126;0.8800010681152344
1622190015.4329169;-5.5;-1.8999977111816406
1622190015.4419315;-6.0;-2.1499977111816406
1622190015.4498732;-5.200002034505208;-2.4333318074544272
1622190015.4578857;-4.5500030517578125;-2.499998092651367
1622190015.4688506;-4.9800048828125;-2.0999984741210938
1622190015.4788282;-5.3800048828125;-2.0999984741210938
1622190015.488834;-6.840008544921875;-1.7199989318847657
1622190015.5008655;-8.400006103515626;-1.9199989318847657
1622190015.5088444;-10.260003662109375;-2.259999084472656
1622190015.5168293;-11.560003662109375;-2.779998779296875
1622190015.5247684;-14.800006103515624;-1.879998779296875
1622190015.5363038;-15.420001220703124;-1.4199981689453125
1622190015.5456288;-15.420001220703124;-1.4199981689453125
1622190015.5547583;-15.420001220703124;-1.4199981689453125
1622190015.5637522;-15.420001220703124;-1.4199981689453125
1622190015.5728;7.20001220703125;1.7000007629394531
1622190015.5857754;7.95001220703125;1.6500015258789062
1622190015.5968409;9.300008138020834;0.7000020345052084
1622190015.606819;11.300010681152344;0.5500020980834961
1622190015.6157696;13.240008544921874;0.3800018310546875
1622190015.6237814;16.680010986328124;-0.6399978637695313
1622190015.6367362;21.30001220703125;-1.959998321533203
1622190015.646707;28.560015869140624;-3.259998321533203
1622190015.6563156;37.72001953125;-5.479998397827148
1622190015.668703;51.82001953125;-8.259998321533203
1622190015.678668;69.36002197265626;-10.779998397827148
1622190015.687644;91.00001831054688;-13.999998092651367
1622190015.698576;114.3400146484375;-17.739998435974123
1622190015.707553;140.6400146484375;-21.81999855041504
1622190015.7162752;153.98001708984376;-23.579998397827147
1622190015.723356;153.98001708984376;-23.579998397827147
1622190015.7347505;153.98001708984376;-23.579998397827147
1622190015.7457175;153.98001708984376;-23.579998397827147
1622190015.755784;-7.10003662109375;-0.5
1622190015.7657244;-10.45001220703125;-3.0
1622190015.7782245;-11.333353678385416;-3.366666793823242
1622190015.7872353;-12.725021362304688;-3.9000000953674316
1622190015.7973053;-13.6000244140625;-4.9
1622190015.8074214;-14.98001708984375;-6.579999923706055
1622190015.8185763;-14.98001708984375;-6.779999923706055
1622190015.8286664;-14.98001708984375;-7.979999923706055
1622190015.8378317;-14.18001708984375;-8.420000076293945
1622190015.8487682;-12.82000732421875;-8.38000030517578
1622190015.8617332;-12.10001220703125;-8.840000534057618
