<?xml version="1.0" encoding="UTF-8" standalone="no"?>
<svg
   xmlns:dc="http://purl.org/dc/elements/1.1/"
   xmlns:cc="http://creativecommons.org/ns#"
   xmlns:rdf="http://www.w3.org/1999/02/22-rdf-syntax-ns#"
   xmlns:svg="http://www.w3.org/2000/svg"
   xmlns="http://www.w3.org/2000/svg"
   xmlns:sodipodi="http://sodipodi.sourceforge.net/DTD/sodipodi-0.dtd"
   xmlns:inkscape="http://www.inkscape.org/namespaces/inkscape"
   width="0.59906375in"
   height="0.59281033in"
   viewBox="0 0 501.41974 496.18605"
   version="1.1"
   id="svg3"
   sodipodi:docname="LR_Bottom.svg"
   inkscape:version="0.92.4 (5da689c313, 2019-01-14)"
   inkscape:export-filename="C:\Users\alexander\Desktop\Unterlagen\Studium\Master\Masterarbeit\Implementierung\SR Research Material\LandoltRinge\LR_TopLeft.png"
   inkscape:export-xdpi="1575"
   inkscape:export-ydpi="1575">
  <metadata
     id="metadata9">
    <rdf:RDF>
      <cc:Work
         rdf:about="">
        <dc:format>image/svg+xml</dc:format>
        <dc:type
           rdf:resource="http://purl.org/dc/dcmitype/StillImage" />
        <dc:title></dc:title>
      </cc:Work>
    </rdf:RDF>
  </metadata>
  <defs
     id="defs7" />
  <sodipodi:namedview
     pagecolor="#ffffff"
     bordercolor="#666666"
     borderopacity="1"
     objecttolerance="10"
     gridtolerance="10"
     guidetolerance="10"
     inkscape:pageopacity="0"
     inkscape:pageshadow="2"
     inkscape:window-width="1366"
     inkscape:window-height="705"
     id="namedview5"
     showgrid="false"
     inkscape:zoom="5.8198869"
     inkscape:cx="36.011337"
     inkscape:cy="38.23642"
     inkscape:window-x="-8"
     inkscape:window-y="-8"
     inkscape:window-maximized="1"
     inkscape:current-layer="svg3" />
  <path
     id="Auswahl"
     d="M 129.59141,469.91036 C 92.401416,449.50038 60.471423,419.68036 38.011406,383.61038 20.281432,355.12037 7.591411,321.90037 2.8714025,288.61036 0.32141561,270.62037 0.38141428,252.75036 0.59142438,234.61037 0.88141868,210.39035 10.831409,171.66038 20.901409,149.61038 54.501416,76.030378 115.49142,24.39038 194.59143,6.2603753 220.9114,0.23036452 240.00142,0.30037022 266.59141,0.61036802 c 27.3,0.3200195 67.59,11.58000798 91.99998,23.75000498 41.58002,20.740006 72.40001,45.680008 98.98001,84.250007 58.60002,85.07 57.54,201.62001 -1.7,286 -19.09,27.19 -43.19999,49.98001 -71.27999,67.67999 -22.88002,14.42 -57.13,29.53 -83.99998,33.32 0,0 -2e-5,-94 -2e-5,-94 -2e-5,-2.22 -0.22,-5.7 1.01999,-7.58999 1.48003,-2.24001 11.85999,-6.11001 14.98,-7.66002 10.4,-5.16998 23.37002,-13.22998 32.00001,-20.91998 24.67,-21.99001 40.80999,-46.71001 48.87,-78.83 2.01,-8 4.08998,-18.81001 4.12998,-27.00001 0,0 1e-5,-16.99998 1e-5,-16.99998 -0.03,-17.57003 -6.29,-40.15001 -13.78,-56 -7.49997,-15.88002 -19.56001,-32.83002 -32.22,-44.96002 -60.35,-57.820001 -155.88,-56.66999 -213.96001,3.96001 -21.21998,22.15 -35.73,50.69 -40.59998,81 -1.809998,11.26 -1.569999,22.62997 -1.440009,33.99999 0.09,7.43999 2.289989,18.68999 4.130009,26 7.98,31.78 24.48002,57.05 48.87001,78.83 8.59998,7.66998 21.62997,15.77001 31.99998,20.92002 3.12001,1.54999 13.49999,5.42 14.97999,7.65997 1.24,1.89003 1.02,5.37001 1.02002,7.59002 0,0 -1e-5,94 -1e-5,94 -22.13998,-3.12 -51.40997,-14.94001 -70.99999,-25.70002 z"
     style="fill:#000000;fill-opacity:1;stroke:#000000;stroke-width:1"
     inkscape:connector-curvature="0" />
</svg>
