Image center coordinates: 
1622281136.8968987;0.0;0.0
1622281136.9062104;0.0;0.0
1622281136.91534;0.0;0.0
1622281136.92481;0.0;0.0
1622281136.9360812;0.0;0.0
1622281136.94475;0.0;0.0
1622281136.9531004;0.0;0.0
1622281136.9613976;0.0;0.0
1622281136.9724422;0.0;0.0
1622281136.9833467;0.0;0.0
1622281136.993794;0.0;0.0
1622281137.0024428;0.0;0.0
1622281137.0104363;0.0;0.0
1622281137.0212193;0.0;0.0
1622281137.0320053;0.0;0.0
1622281137.0437465;0.0;0.0
1622281137.0553372;0.0;0.0
1622281137.0664263;0.0;0.0
1622281137.076807;0.0;0.0
1622281137.0863888;0.0;0.0
1622281137.094361;0.0;0.0
1622281137.1046205;0.0;0.0
1622281137.1134143;0.0;0.0
1622281137.1231356;0.0;0.0
1622281137.1324692;0.0;0.0
1622281137.1419296;0.0;0.0
1622281137.1507084;0.0;0.0
1622281137.159075;0.0;0.0
1622281137.1664467;0.0;0.0
1622281137.1758497;0.0;0.0
1622281137.1854107;0.0;0.0
1622281137.1914752;0.0;0.0
1622281137.2004728;0.0;0.0
1622281137.2090247;0.0;0.0
1622281137.2172556;0.0;0.0
1622281137.2256238;0.0;0.0
1622281137.2341797;0.0;0.0
1622281137.2422543;0.0;0.0
1622281137.2504587;0.0;0.0
1622281137.2585359;0.0;0.0
1622281137.268013;0.0;0.0
1622281137.2760584;0.0;0.0
1622281137.287803;0.0;0.0
1622281137.2976034;0.0;0.0
1622281137.3075254;0.0;0.0
1622281137.3177226;0.0;0.0
1622281137.3300724;0.0;0.0
1622281137.339905;0.0;0.0
1622281137.3495767;0.0;0.0
1622281137.360401;0.0;0.0
1622281137.367827;0.0;0.0
1622281137.3798256;0.0;0.0
1622281137.3898509;0.0;0.0
1622281137.3995118;0.0;0.0
1622281137.4104078;0.0;0.0
1622281137.421538;0.0;0.0
1622281137.4315708;0.0;0.0
1622281137.4405851;0.0;0.0
1622281137.4505196;0.0;0.0
1622281137.4604123;0.0;0.0
1622281137.4689667;0.0;0.0
1622281137.4763503;0.0;0.0
1622281137.4882324;0.0;0.0
1622281137.4979684;0.0;0.0
1622281137.5076027;0.0;0.0
1622281137.5174656;0.0;0.0
1622281137.5295496;0.0;0.0
1622281137.5395782;0.0;0.0
1622281137.549456;0.0;0.0
1622281137.5593534;0.0;0.0
1622281137.571664;0.0;0.0
1622281137.581607;0.0;0.0
1622281137.5904517;0.0;0.0
1622281137.6002393;0.0;0.0
1622281137.6111877;0.0;0.0
1622281137.6193733;0.0;0.0
1622281137.6274781;0.0;0.0
1622281137.638186;0.0;0.0
1622281137.6484137;0.0;0.0
1622281137.6579783;0.0;0.0
1622281137.669001;0.0;0.0
1622281137.6762354;0.0;0.0
1622281137.6879385;0.0;0.0
1622281137.6979454;0.0;0.0
1622281137.7076175;0.0;0.0
1622281137.7174702;0.0;0.0
1622281137.7294905;0.0;0.0
1622281137.7397637;0.0;0.0
1622281137.7504723;0.0;0.0
1622281137.7604687;0.0;0.0
1622281137.7675214;0.0;0.0
1622281137.779905;0.0;0.0
1622281137.7897768;0.0;0.0
1622281137.7987525;0.0;0.0
1622281137.8085139;0.0;0.0
1622281137.819468;0.0;0.0
1622281137.8274765;0.0;0.0
1622281137.838318;0.0;0.0
1622281137.8483067;0.0;0.0
1622281137.8573637;0.0;0.0
1622281137.8674629;0.0;0.0
1622281137.8800395;0.0;0.0
1622281137.8900888;0.0;0.0
1622281137.8995888;0.0;0.0
1622281137.909538;0.0;0.0
1622281137.921335;0.0;0.0
1622281137.9316103;0.0;0.0
1622281137.9405751;0.0;0.0
1622281137.9506023;0.0;0.0
1622281137.9594686;0.0;0.0
1622281137.9674761;0.0;0.0
1622281137.9802303;0.0;0.0
1622281137.9903932;0.0;0.0
1622281138.0003445;0.0;0.0
1622281138.009251;0.0;0.0
1622281138.0193908;0.0;0.0
1622281138.0278394;0.0;0.0
1622281138.0376139;0.0;0.0
1622281138.0483718;0.0;0.0
1622281138.0580075;0.0;0.0
1622281138.0689027;0.0;0.0
1622281138.076318;0.0;0.0
1622281138.0844526;0.0;0.0
1622281138.0966005;0.0;0.0
1622281138.106617;0.0;0.0
1622281138.1164594;0.0;0.0
1622281138.125994;0.0;0.0
1622281138.1382132;0.0;0.0
1622281138.1483595;0.0;0.0
1622281138.1578834;0.0;0.0
1622281138.1689184;0.0;0.0
1622281138.176141;0.0;0.0
1622281138.1882324;0.0;0.0
1622281138.1977186;0.0;0.0
1622281138.207533;0.0;0.0
1622281138.2174826;0.0;0.0
1622281138.2263017;0.0;0.0
1622281138.2359712;0.0;0.0
1622281138.2444267;0.0;0.0
1622281138.252482;0.0;0.0
1622281138.2633665;0.0;0.0
1622281138.2735069;0.0;0.0
1622281138.2833261;0.0;0.0
1622281138.2943306;0.0;0.0
1622281138.3010361;0.0;0.0
1622281138.3133473;0.0;0.0
1622281138.3234026;0.0;0.0
1622281138.3335142;0.0;0.0
1622281138.344462;0.0;0.0
1622281138.3524868;0.0;0.0
1622281138.3633862;0.0;0.0
1622281138.3734293;0.0;0.0
1622281138.3824306;0.0;0.0
1622281138.392445;0.0;0.0
1622281138.4014559;0.0;0.0
1622281138.410991;0.0;0.0
1622281138.419456;0.0;0.0
1622281138.4264908;0.0;0.0
1622281138.4383507;0.0;0.0
1622281138.448576;0.0;0.0
1622281138.4581845;0.0;0.0
1622281138.469322;0.0;0.0
1622281138.4774666;0.0;0.0
1622281138.488151;0.0;0.0
1622281138.4983766;0.0;0.0
1622281138.5080247;0.0;0.0
1622281138.517433;0.0;0.0
1622281138.5274704;0.0;0.0
1622281138.5344944;0.0;0.0
1622281138.5465508;0.0;0.0
1622281138.556627;0.0;0.0
1622281138.5664332;0.0;0.0
1622281138.5775468;0.0;0.0
1622281138.5844924;0.0;0.0
1622281138.5966117;0.0;0.0
1622281138.6064754;0.0;0.0
1622281138.6163597;0.0;0.0
1622281138.6256645;0.0;0.0
1622281138.6334722;0.0;0.0
1622281138.6427276;0.0;0.0
1622281138.6546524;0.0;0.0
1622281138.6646323;0.0;0.0
1622281138.6736128;0.0;0.0
1622281138.6826286;0.0;0.0
1622281138.6916666;0.0;0.0
1622281138.7012434;0.0;0.0
1622281138.7091484;0.0;0.0
1622281138.721593;0.0;0.0
1622281138.7306547;0.0;0.0
1622281138.7396812;0.0;0.0
1622281138.7493687;0.0;0.0
1622281138.758934;0.0;0.0
1622281138.7674372;0.0;0.0
1622281138.7759235;0.0;0.0
1622281138.784246;0.0;0.0
1622281138.7966151;0.0;0.0
1622281138.8056886;0.0;0.0
1622281138.815285;0.0;0.0
1622281138.8246322;0.0;0.0
1622281138.833616;0.0;0.0
1622281138.8431494;0.0;0.0
1622281138.851132;0.0;0.0
1622281138.863367;0.0;0.0
1622281138.873322;0.0;0.0
1622281138.8826602;0.0;0.0
1622281138.8923988;0.0;0.0
1622281138.9012234;0.0;0.0
1622281138.9094162;0.0;0.0
1622281138.9215868;0.0;0.0
1622281138.930594;0.0;0.0
1622281138.9398808;0.0;0.0
1622281138.9498224;0.0;0.0
1622281138.9592562;0.0;0.0
1622281138.9675012;0.0;0.0
1622281138.9762506;0.0;0.0
1622281138.9843938;0.0;0.0
1622281138.996604;0.0;0.0
1622281139.0065296;0.0;0.0
1622281139.0159404;0.0;0.0
1622281139.0258179;0.0;0.0
1622281139.0344162;0.0;0.0
1622281139.0427008;0.0;0.0
1622281139.0510266;0.0;0.0
1622281139.0594285;0.0;0.0
1622281139.0675457;0.0;0.0
1622281139.0763195;0.0;0.0
1622281139.084436;0.0;0.0
1622281139.0966249;0.0;0.0
1622281139.106624;0.0;0.0
1622281139.1161845;0.0;0.0
1622281139.1259828;0.0;0.0
1622281139.138245;0.0;0.0
1622281139.1482322;0.0;0.0
1622281139.1579075;0.0;0.0
1622281139.1675692;0.0;0.0
1622281139.1763434;0.0;0.0
1622281139.1844075;0.0;0.0
1622281139.1966436;0.0;0.0
1622281139.2065606;0.0;0.0
1622281139.2161567;0.0;0.0
1622281139.225912;0.0;0.0
1622281139.2384555;0.0;0.0
1622281139.2481537;0.0;0.0
1622281139.257903;0.0;0.0
1622281139.267584;0.0;0.0
1622281139.276366;0.0;0.0
1622281139.28483;0.0;0.0
1622281139.292895;0.0;0.0
1622281139.3049054;0.0;0.0
1622281139.3146846;0.0;0.0
1622281139.32427;0.0;0.0
1622281139.334131;0.0;0.0
1622281139.3429296;0.0;0.0
1622281139.3512685;0.0;0.0
1622281139.363391;0.0;0.0
1622281139.3734162;0.0;0.0
1622281139.3820941;0.0;0.0
1622281139.3915865;0.0;0.0
1622281139.400604;0.0;0.0
1622281139.4094884;0.0;0.0
1622281139.4175005;0.0;0.0
1622281139.4263418;0.0;0.0
1622281139.4343593;0.0;0.0
1622281139.4466424;0.0;0.0
1622281139.4565878;0.0;0.0
1622281139.4664612;0.0;0.0
1622281139.4762647;0.0;0.0
1622281139.488242;0.0;0.0
1622281139.4983716;0.0;0.0
1622281139.5076547;0.0;0.0
1622281139.5174994;0.0;0.0
1622281139.5264149;0.0;0.0
1622281139.5346606;0.0;0.0
1622281139.546644;0.0;0.0
1622281139.5565596;0.0;0.0
1622281139.566482;0.0;0.0
1622281139.5762122;0.0;0.0
1622281139.588394;0.0;0.0
1622281139.597631;0.0;0.0
1622281139.6072407;0.0;0.0
1622281139.6166432;0.0;0.0
1622281139.6264656;0.0;0.0
1622281139.6344182;0.0;0.0
1622281139.6466608;0.0;0.0
1622281139.6565716;0.0;0.0
1622281139.6662087;0.0;0.0
1622281139.6756752;0.0;0.0
1622281139.684505;0.0;0.0
1622281139.6930444;0.0;0.0
1622281139.701382;0.0;0.0
1622281139.709199;0.0;0.0
1622281139.717884;0.0;0.0
1622281139.7264504;0.0;0.0
1622281139.7342029;0.0;0.0
1622281139.7429028;0.0;0.0
1622281139.7511;0.0;0.0
1622281139.7634852;0.0;0.0
1622281139.7736664;0.0;0.0
1622281139.7828991;0.0;0.0
1622281139.7928216;0.0;0.0
1622281139.804935;0.0;0.0
1622281139.8149064;0.0;0.0
1622281139.8245096;0.0;0.0
1622281139.8343134;0.0;0.0
1622281139.8430076;0.0;0.0
1622281139.8513763;0.0;0.0
1622281139.8595273;0.0;0.0
1622281139.8718092;0.0;0.0
1622281139.880773;0.0;0.0
1622281139.8902428;0.0;0.0
1622281139.8996758;0.0;0.0
1622281139.909289;0.0;0.0
1622281139.9212646;0.0;0.0
1622281139.93168;0.0;0.0
1622281139.940626;0.0;0.0
1622281139.950102;0.0;0.0
1622281139.9598708;0.0;0.0
1622281139.9679537;0.0;0.0
1622281139.9765503;0.0;0.0
1622281139.984124;0.0;0.0
1622281139.9929793;0.0;0.0
1622281140.001323;0.0;0.0
1622281140.0095232;0.0;0.0
1622281140.0213583;0.0;0.0
1622281140.0315318;0.0;0.0
1622281140.040707;0.0;0.0
1622281140.0497055;0.0;0.0
1622281140.0592678;0.0;0.0
1622281140.0676112;0.0;0.0
1622281140.0779886;0.0;0.0
1622281140.084579;0.0;0.0
1622281140.0967124;0.0;0.0
1622281140.1055083;0.0;0.0
1622281140.114901;0.0;0.0
1622281140.1243439;0.0;0.0
1622281140.133682;0.0;0.0
1622281140.1424701;0.0;0.0
1622281140.1511016;0.0;0.0
1622281140.159328;0.0;0.0
1622281140.169827;0.0;0.0
1622281140.1764927;0.0;0.0
1622281140.1885266;0.0;0.0
1622281140.1982896;0.0;0.0
1622281140.2076566;0.0;0.0
1622281140.2173176;0.0;0.0
1622281140.2278411;0.0;0.0
1622281140.2342122;0.0;0.0
1622281140.2426214;0.0;0.0
1622281140.2512877;0.0;0.0
1622281140.2593591;0.0;0.0
1622281140.2699556;0.0;0.0
1622281140.2764974;0.0;0.0
1622281140.288529;0.0;0.0
1622281140.2983093;0.0;0.0
1622281140.3076258;0.0;0.0
1622281140.3173225;0.0;0.0
1622281140.3279412;0.0;0.0
1622281140.3348877;0.0;0.0
1622281140.3468223;0.0;0.0
1622281140.3565953;0.0;0.0
1622281140.3658733;0.0;0.0
1622281140.375465;0.0;0.0
1622281140.3859909;0.0;0.0
1622281140.3932111;0.0;0.0
1622281140.4050999;0.0;0.0
1622281140.4149294;0.0;0.0
1622281140.4243925;0.0;0.0
1622281140.4336658;0.0;0.0
1622281140.4427326;0.0;0.0
1622281140.4505;0.0;0.0
1622281140.4597244;0.0;0.0
1622281140.4682505;0.0;0.0
1622281140.4762998;0.0;0.0
1622281140.4883847;0.0;0.0
1622281140.498425;0.0;0.0
1622281140.5076873;0.0;0.0
1622281140.5173707;0.0;0.0
1622281140.5279858;0.0;0.0
1622281140.5349255;0.0;0.0
1622281140.5466294;0.0;0.0
1622281140.556635;0.0;0.0
1622281140.5662966;0.0;0.0
1622281140.575559;0.0;0.0
1622281140.5848927;0.0;0.0
1622281140.5926952;0.0;0.0
1622281140.6005125;0.0;0.0
1622281140.6095893;0.0;0.0
1622281140.6218038;0.0;0.0
1622281140.630706;0.0;0.0
1622281140.6402836;0.0;0.0
1622281140.6485653;0.0;0.0
1622281140.6575036;0.0;0.0
1622281140.666654;0.0;0.0
1622281140.6757348;0.0;0.0
1622281140.686193;0.0;0.0
1622281140.6931875;0.0;0.0
1622281140.7049189;0.0;0.0
1622281140.7149131;0.0;0.0
1622281140.7242944;0.0;0.0
1622281140.7339377;0.0;0.0
1622281140.7445195;0.0;0.0
1622281140.7515128;0.0;0.0
1622281140.7636516;0.0;0.0
1622281140.7737148;0.0;0.0
1622281140.7833154;0.0;0.0
1622281140.7932796;0.0;0.0
1622281140.805406;0.0;0.0
1622281140.8146122;0.0;0.0
1622281140.8243892;0.0;0.0
1622281140.8336275;0.0;0.0
1622281140.8426251;0.0;0.0
1622281140.851527;0.0;0.0
1622281140.8593497;0.0;0.0
1622281140.8735075;0.0;0.0
1622281140.8843765;0.0;0.0
1622281140.8945105;0.0;0.0
1622281140.903299;0.0;0.0
1622281140.9114044;0.0;0.0
1622281140.9236422;0.0;0.0
1622281140.937412;0.0;0.0
1622281140.9500976;0.0;0.0
1622281140.9605074;0.0;0.0
1622281140.9734716;0.0;0.0
1622281141.0399208;0.0;0.0
1622281141.0476742;0.0;0.0
1622281141.056688;0.0;0.0
1622281141.0656774;0.0;0.0
1622281141.0741258;0.0;0.0
1622281141.083169;0.0;0.0
1622281141.091528;0.0;0.0
1622281141.1004102;0.0;0.0
1622281141.1094003;0.0;0.0
1622281141.1182709;0.0;0.0
1622281141.1261947;0.0;0.0
1622281141.1345263;0.0;0.0
1622281141.1448796;0.0;0.0
1622281141.152776;0.0;0.0
1622281141.163652;0.0;0.0
1622281141.1734738;0.0;0.0
1622281141.1824949;0.0;0.0
1622281141.1916492;0.0;0.0
1622281141.2005537;0.0;0.0
1622281141.209463;0.0;0.0
1622281141.2178888;0.0;0.0
1622281141.226321;0.0;0.0
1622281141.2345538;0.0;0.0
1622281141.2446227;0.0;0.0
1622281141.2515998;0.0;0.0
1622281141.2636836;0.0;0.0
1622281141.2736351;0.0;0.0
1622281141.2826548;0.0;0.0
1622281141.292267;0.0;0.0
1622281141.3030038;0.0;0.0
1622281141.3100233;0.0;0.0
1622281141.3219063;0.0;0.0
1622281141.3312;0.0;0.0
1622281141.3403687;0.0;0.0
1622281141.3501716;0.0;0.0
1622281141.359143;0.0;0.0
1622281141.3699245;0.0;0.0
1622281141.3767343;0.0;0.0
1622281141.3885562;0.0;0.0
1622281141.3983934;0.0;0.0
1622281141.407714;0.0;0.0
1622281141.416647;0.0;0.0
1622281141.4264746;0.0;0.0
1622281141.4384692;0.0;0.0
1622281141.4483998;0.0;0.0
1622281141.4577003;0.0;0.0
1622281141.4674993;0.0;0.0
1622281141.4765666;0.0;0.0
1622281141.4848416;0.0;0.0
1622281141.496924;0.0;0.0
1622281141.5067046;0.0;0.0
1622281141.5155828;0.0;0.0
1622281141.5249732;0.0;0.0
1622281141.5345478;0.0;0.0
1622281141.543297;0.0;0.0
1622281141.551554;0.0;0.0
1622281141.5598357;0.0;0.0
1622281141.571738;0.0;0.0
1622281141.581644;0.0;0.0
1622281141.5906844;0.0;0.0
1622281141.599693;0.0;0.0
1622281141.6085532;0.0;0.0
1622281141.6176908;0.0;0.0
1622281141.626454;0.0;0.0
1622281141.6348886;0.0;0.0
1622281141.6432238;0.0;0.0
1622281141.6554403;0.0;0.0
1622281141.6653192;0.0;0.0
1622281141.6746993;0.0;0.0
1622281141.6844134;0.0;0.0
1622281141.6926568;0.0;0.0
1622281141.7014227;0.0;0.0
1622281141.709569;0.0;0.0
1622281141.7176995;0.0;0.0
1622281141.7265167;0.0;0.0
1622281141.7345486;0.0;0.0
1622281141.745305;0.0;0.0
1622281141.7530975;0.0;0.0
1622281141.7636967;0.0;0.0
1622281141.773644;0.0;0.0
1622281141.7829597;0.0;0.0
1622281141.7925987;0.0;0.0
1622281141.8007774;0.0;0.0
1622281141.8112195;0.0;0.0
1622281141.818314;0.0;0.0
1622281141.8304393;0.0;0.0
1622281141.8403366;0.0;0.0
1622281141.8497586;0.0;0.0
1622281141.8596408;0.0;0.0
1622281141.868299;0.0;0.0
1622281141.8764145;0.0;0.0
1622281141.888567;0.0;0.0
1622281141.898464;0.0;0.0
1622281141.9078648;0.0;0.0
1622281141.9176817;0.0;0.0
1622281141.9264479;0.0;0.0
1622281141.9349284;0.0;0.0
1622281141.9435532;0.0;0.0
1622281141.95157;0.0;0.0
1622281141.9636774;0.0;0.0
1622281141.973639;0.0;0.0
1622281141.9825242;0.0;0.0
1622281141.9919019;0.0;0.0
1622281142.0014994;0.0;0.0
1622281142.0136864;0.0;0.0
1622281142.0236905;0.0;0.0
1622281142.0334587;0.0;0.0
1622281142.0433183;0.0;0.0
1622281142.0556977;0.0;0.0
1622281142.0656915;0.0;0.0
1622281142.0753589;0.0;0.0
1622281142.0852044;0.0;0.0
1622281142.0945413;0.0;0.0
1622281142.1015332;0.0;0.0
1622281142.1136885;0.0;0.0
1622281142.1236122;0.0;0.0
1622281142.1332989;0.0;0.0
1622281142.1432672;0.0;0.0
1622281142.1556265;0.0;0.0
1622281142.1657305;0.0;0.0
1622281142.1754048;0.0;0.0
1622281142.184508;0.0;0.0
1622281142.1934645;0.0;0.0
1622281142.201441;0.0;0.0
1622281142.2137024;0.0;0.0
1622281142.22365;0.0;0.0
1622281142.2333162;0.0;0.0
1622281142.2432706;0.0;0.0
1622281142.2556443;0.0;0.0
1622281142.2655838;0.0;0.0
1622281142.2754831;0.0;0.0
1622281142.285276;0.0;0.0
1622281142.2945814;0.0;0.0
1622281142.303096;0.0;0.0
1622281142.3103936;0.0;0.0
1622281142.3215;0.0;0.0
1622281142.3322663;0.0;0.0
1622281142.341155;0.0;0.0
1622281142.350366;0.0;0.0
1622281142.3593934;0.0;0.0
1622281142.370386;0.0;0.0
1622281142.3784742;0.0;0.0
1622281142.389049;0.0;0.0
1622281142.398578;0.0;0.0
1622281142.4077039;0.0;0.0
1622281142.4173396;0.0;0.0
1622281142.4281366;0.0;0.0
1622281142.4363823;0.0;0.0
1622281142.4472377;0.0;0.0
1622281142.4572365;0.0;0.0
1622281142.466613;0.0;0.0
1622281142.4762712;0.0;0.0
1622281142.485135;0.0;0.0
1622281142.4934626;0.0;0.0
1622281142.50148;0.0;0.0
1622281142.5137084;0.0;0.0
1622281142.5237308;0.0;0.0
1622281142.5333629;0.0;0.0
1622281142.5433254;0.0;0.0
1622281142.5556288;0.0;0.0
1622281142.565676;0.0;0.0
1622281142.575436;0.0;0.0
1622281142.5852592;0.0;0.0
1622281142.5969818;0.0;0.0
1622281142.6069858;0.0;0.0
1622281142.61668;0.0;0.0
1622281142.6265461;0.0;0.0
1622281142.6387565;0.0;0.0
1622281142.6485362;0.0;0.0
1622281142.658251;0.0;0.0
1622281142.6673577;0.0;0.0
1622281142.6770992;0.0;0.0
1622281142.6864343;0.0;0.0
1622281142.6932092;0.0;0.0
1622281142.7056608;0.0;0.0
1622281142.7156851;0.0;0.0
1622281142.725177;0.0;0.0
1622281142.7351131;0.0;0.0
1622281142.7472665;0.0;0.0
1622281142.7572663;0.0;0.0
1622281142.76672;0.0;0.0
1622281142.776575;0.0;0.0
1622281142.7884376;0.0;0.0
1622281142.7992454;0.0;0.0
1622281142.8085535;0.0;0.0
1622281142.8183603;0.0;0.0
1622281142.830547;0.0;0.0
1622281142.8404117;0.0;0.0
1622281142.8497071;0.0;0.0
1622281142.8596463;0.0;0.0
1622281142.870514;0.0;0.0
1622281142.8785062;0.0;0.0
1622281142.8891351;0.0;0.0
1622281142.8985264;0.0;0.0
1622281142.9085143;0.0;0.0
1622281142.9184046;0.0;0.0
1622281142.9306364;0.0;0.0
1622281142.94055;0.0;0.0
1622281142.9497142;0.0;0.0
1622281142.9596672;0.0;0.0
1622281142.9680088;0.0;0.0
1622281142.976576;0.0;0.0
1622281142.9850993;0.0;0.0
1622281142.993462;0.0;0.0
1622281143.0056467;0.0;0.0
1622281143.0153198;0.0;0.0
1622281143.0246134;0.0;0.0
1622281143.0346155;0.0;0.0
1622281143.045362;0.0;0.0
1622281143.0534213;0.0;0.0
1622281143.0637176;0.0;0.0
1622281143.0737252;0.0;0.0
1622281143.0834057;0.0;0.0
1622281143.0933323;0.0;0.0
1622281143.105646;0.0;0.0
1622281143.1159122;0.0;0.0
1622281143.1246605;0.0;0.0
1622281143.133816;0.0;0.0
1622281143.1435552;0.0;0.0
1622281143.1556349;0.0;0.0
1622281143.1656396;0.0;0.0
1622281143.1750255;0.0;0.0
1622281143.1847644;0.0;0.0
1622281143.1935167;0.0;0.0
1622281143.2015173;0.0;0.0
1622281143.2102273;0.0;0.0
1622281143.2185915;0.0;0.0
1622281143.2266011;0.0;0.0
1622281143.2389426;0.0;0.0
1622281143.2485852;0.0;0.0
1622281143.2582793;0.0;0.0
1622281143.2677102;0.0;0.0
1622281143.2784126;0.0;0.0
1622281143.2865777;0.0;0.0
1622281143.2973669;0.0;0.0
1622281143.3074272;0.0;0.0
1622281143.317442;0.0;0.0
1622281143.3282504;0.0;0.0
1622281143.336597;0.0;0.0
1622281143.3465233;0.0;0.0
1622281143.357409;0.0;0.0
1622281143.3667326;0.0;0.0
1622281143.376546;0.0;0.0
1622281143.3890169;0.0;0.0
1622281143.3987203;0.0;0.0
1622281143.4081888;0.0;0.0
1622281143.4181077;0.0;0.0
1622281143.4289815;0.0;0.0
1622281143.436598;0.0;0.0
1622281143.4473922;0.0;0.0
1622281143.4574556;0.0;0.0
1622281143.4667342;0.0;0.0
1622281143.4765706;0.0;0.0
1622281143.4891834;0.0;0.0
1622281143.4988816;0.0;0.0
1622281143.5083635;0.0;0.0
1622281143.518262;0.0;0.0
1622281143.5307283;0.0;0.0
1622281143.5406773;0.0;0.0
1622281143.5502803;0.0;0.0
1622281143.5595543;0.0;0.0
1622281143.5684595;0.0;0.0
1622281143.5765543;0.0;0.0
1622281143.5853038;0.0;0.0
1622281143.5934973;0.0;0.0
1622281143.6056995;0.0;0.0
1622281143.6156511;0.0;0.0
1622281143.6250176;0.0;0.0
1622281143.6347387;0.0;0.0
1622281143.6434278;0.0;0.0
1622281143.651541;0.0;0.0
1622281143.6597261;0.0;0.0
1622281143.668517;0.0;0.0
1622281143.6766;0.0;0.0
1622281143.6892722;0.0;0.0
1622281143.6987727;0.0;0.0
1622281143.7083607;0.0;0.0
1622281143.7182043;0.0;0.0
1622281143.7306154;0.0;0.0
1622281143.740688;0.0;0.0
1622281143.7496827;0.0;0.0
1622281143.7586236;0.0;0.0
1622281143.7685664;0.0;0.0
1622281143.7807333;0.0;0.0
1622281143.790576;0.0;0.0
1622281143.7995338;0.0;0.0
1622281143.8090968;0.0;0.0
1622281143.819834;0.0;0.0
1622281143.827103;0.0;0.0
1622281143.8391843;0.0;0.0
1622281143.8494198;0.0;0.0
1622281143.8583434;0.0;0.0
1622281143.8691702;0.0;0.0
1622281143.881135;0.0;0.0
1622281143.8931031;0.0;0.0
1622281143.906069;0.0;0.0
1622281143.9210398;0.0;0.0
1622281143.928491;0.0;0.0
1622281143.940384;0.0;0.0
1622281143.9496195;0.0;0.0
1622281143.9589248;0.0;0.0
1622281143.9681315;0.0;0.0
1622281143.9766428;0.0;0.0
1622281143.9883356;0.0;0.0
1622281143.9987202;0.0;0.0
1622281144.0077925;0.0;0.0
1622281144.0167913;0.0;0.0
1622281144.026426;0.0;0.0
1622281144.0347934;0.0;0.0
1622281144.043375;0.0;0.0
1622281144.0515807;0.0;0.0
1622281144.0615282;0.0;0.0
1622281144.068515;0.0;0.0
1622281144.080608;0.0;0.0
1622281144.0905342;0.0;0.0
1622281144.0999134;0.0;0.0
1622281144.1093175;0.0;0.0
1622281144.1200576;0.0;0.0
1622281144.1282582;0.0;0.0
1622281144.138832;0.0;0.0
1622281144.1486177;0.0;0.0
1622281144.1580186;0.0;0.0
1622281144.1676295;0.0;0.0
1622281144.1783152;0.0;0.0
1622281144.1853662;0.0;0.0
1622281144.1974888;0.0;0.0
1622281144.2072806;0.0;0.0
1622281144.216746;0.0;0.0
1622281144.2261581;0.0;0.0
1622281144.2365935;0.0;0.0
1622281144.2436047;0.0;0.0
1622281144.25575;0.0;0.0
1622281144.2657568;0.0;0.0
1622281144.2748067;0.0;0.0
1622281144.284594;0.0;0.0
1622281144.2935083;0.0;0.0
1622281144.3018534;0.0;0.0
1622281144.3139381;0.0;0.0
1622281144.3239768;0.0;0.0
1622281144.3335822;0.0;0.0
1622281144.343298;0.0;0.0
1622281144.3520477;0.0;0.0
1622281144.3603246;0.0;0.0
1622281144.37262;0.0;0.0
1622281144.3825731;0.0;0.0
1622281144.3919923;0.0;0.0
1622281144.401671;0.0;0.0
1622281144.4102387;0.0;0.0
1622281144.4186058;0.0;0.0
1622281144.4302175;0.0;0.0
1622281144.4406369;0.0;0.0
1622281144.4503179;0.0;0.0
1622281144.4602337;0.0;0.0
1622281144.4724991;0.0;0.0
1622281144.4826941;0.0;0.0
1622281144.4922187;0.0;0.0
1622281144.5019832;0.0;0.0
1622281144.5140257;0.0;0.0
1622281144.524108;0.0;0.0
1622281144.5336974;0.0;0.0
1622281144.5434651;0.0;0.0
1622281144.5557578;0.0;0.0
1622281144.565682;0.0;0.0
1622281144.5756876;0.0;0.0
1622281144.5847795;0.0;0.0
1622281144.5936277;0.0;0.0
1622281144.602088;0.0;0.0
1622281144.6100428;0.0;0.0
1622281144.6226957;0.0;0.0
1622281144.6326518;0.0;0.0
1622281144.6420228;0.0;0.0
1622281144.6516287;0.0;0.0
1622281144.660242;0.0;0.0
1622281144.6686196;0.0;0.0
1622281144.68098;0.0;0.0
1622281144.6906586;0.0;0.0
1622281144.69974;0.0;0.0
1622281144.7093468;0.0;0.0
1622281144.720109;0.0;0.0
1622281144.728473;0.0;0.0
1622281144.7366319;0.0;0.0
1622281144.747677;0.0;0.0
1622281144.757674;0.0;0.0
1622281144.7672234;0.0;0.0
1622281144.777027;0.0;0.0
1622281144.789273;0.0;0.0
1622281144.7995143;0.0;0.0
1622281144.8087394;0.0;0.0
1622281144.8186133;0.0;0.0
1622281144.8307726;0.0;0.0
1622281144.8406062;0.0;0.0
1622281144.850028;0.0;0.0
1622281144.8591375;0.0;0.0
1622281144.8682637;0.0;0.0
1622281144.8770566;0.0;0.0
1622281144.885486;0.0;0.0
1622281144.8977275;0.0;0.0
1622281144.9077091;0.0;0.0
1622281144.916971;0.0;0.0
1622281144.9269457;0.0;0.0
1622281144.9386845;0.0;0.0
1622281144.9492583;0.0;0.0
1622281144.9586368;0.0;0.0
1622281144.968188;0.0;0.0
1622281144.9770055;0.0;0.0
1622281144.9855683;0.0;0.0
1622281144.9940467;0.0;0.0
1622281145.0059857;0.0;0.0
1622281145.015886;0.0;0.0
1622281145.025577;0.0;0.0
1622281145.0352447;0.0;0.0
1622281145.0476847;0.0;0.0
1622281145.0576837;0.0;0.0
1622281145.0670571;0.0;0.0
1622281145.0766559;0.0;0.0
1622281145.0866237;0.0;0.0
1622281145.0936031;0.0;0.0
1622281145.1060066;0.0;0.0
1622281145.1160116;0.0;0.0
1622281145.1255264;0.0;0.0
1622281145.135365;0.0;0.0
1622281145.1477036;0.0;0.0
1622281145.1577077;0.0;0.0
1622281145.1669962;0.0;0.0
1622281145.176671;0.0;0.0
1622281145.1855478;0.0;0.0
1622281145.1936326;0.0;0.0
1622281145.2059903;0.0;0.0
1622281145.2162373;0.0;0.0
1622281145.2257593;0.0;0.0
1622281145.2354846;0.0;0.0
1622281145.2477314;0.0;0.0
1622281145.257741;0.0;0.0
1622281145.2672842;0.0;0.0
1622281145.2771876;0.0;0.0
1622281145.2892644;0.0;0.0
1622281145.2986434;0.0;0.0
1622281145.3083022;0.0;0.0
1622281145.3183503;0.0;0.0
1622281145.3291485;0.0;0.0
1622281145.337157;0.0;0.0
1622281145.347714;0.0;0.0
1622281145.3577535;0.0;0.0
1622281145.3670907;0.0;0.0
1622281145.377009;0.0;0.0
1622281145.3893251;0.0;0.0
1622281145.3992884;0.0;0.0
1622281145.4087265;0.0;0.0
1622281145.4185545;0.0;0.0
1622281145.4312544;0.0;0.0
1622281145.4413414;0.0;0.0
1622281145.4505825;0.0;0.0
1622281145.460209;0.0;0.0
1622281145.4726784;0.0;0.0
1622281145.4827533;0.0;0.0
1622281145.4923725;0.0;0.0
1622281145.5022452;0.0;0.0
1622281145.5143437;0.0;0.0
1622281145.5237534;0.0;0.0
1622281145.5335534;0.0;0.0
1622281145.5432959;0.0;0.0
1622281145.5520651;0.0;0.0
1622281145.5605223;0.0;0.0
1622281145.5686386;0.0;0.0
1622281145.580675;0.0;0.0
1622281145.590733;0.0;0.0
1622281145.5995157;0.0;0.0
1622281145.608894;0.0;0.0
1622281145.6186447;0.0;0.0
1622281145.6305082;0.0;0.0
1622281145.6401794;0.0;0.0
1622281145.64983;0.0;0.0
1622281145.6594946;0.0;0.0
1622281145.6703331;0.0;0.0
1622281145.6775615;0.0;0.0
1622281145.6893632;0.0;0.0
1622281145.699389;0.0;0.0
1622281145.7087073;0.0;0.0
1622281145.7185147;0.0;0.0
1622281145.730506;0.0;0.0
1622281145.7401917;0.0;0.0
1622281145.749776;0.0;0.0
1622281145.7597742;0.0;0.0
1622281145.7686045;0.0;0.0
1622281145.7773402;0.0;0.0
1622281145.7856534;0.0;0.0
1622281145.7976937;0.0;0.0
1622281145.8077629;0.0;0.0
1622281145.8170671;0.0;0.0
1622281145.826921;0.0;0.0
1622281145.8355973;0.0;0.0
1622281145.8436556;0.0;0.0
1622281145.8536165;0.0;0.0
1622281145.860648;0.0;0.0
1622281145.8727226;0.0;0.0
1622281145.8825452;0.0;0.0
1622281145.8920279;0.0;0.0
1622281145.9011493;0.0;0.0
1622281145.9121485;0.0;0.0
1622281145.9202635;0.0;0.0
1622281145.9304535;0.0;0.0
1622281145.9407275;0.0;0.0
1622281145.9505394;0.0;0.0
1622281145.959768;0.0;0.0
1622281145.968023;0.0;0.0
1622281145.9786649;0.0;0.0
1622281145.9856622;0.0;0.0
1622281145.9976914;0.0;0.0
1622281146.0077667;0.0;0.0
1622281146.0173485;0.0;0.0
1622281146.0270312;0.0;0.0
1622281146.0394473;0.0;0.0
1622281146.049491;0.0;0.0
1622281146.0593905;0.0;0.0
1622281146.070254;0.0;0.0
1622281146.0785487;0.0;0.0
1622281146.0894742;0.0;0.0
1622281146.0995302;0.0;0.0
1622281146.1086702;0.0;0.0
1622281146.118628;0.0;0.0
1622281146.1313064;0.0;0.0
1622281146.140405;0.0;0.0
1622281146.1499445;0.0;0.0
1622281146.1596549;0.0;0.0
1622281146.1706398;0.0;0.0
1622281146.178598;0.0;0.0
1622281146.1886342;0.0;0.0
1622281146.1995318;0.0;0.0
1622281146.2089374;0.0;0.0
1622281146.2186525;0.0;0.0
1622281146.2313156;0.0;0.0
1622281146.2407215;0.0;0.0
1622281146.250414;0.0;0.0
1622281146.2602198;0.0;0.0
1622281146.2727382;0.0;0.0
1622281146.2828748;0.0;0.0
1622281146.292709;0.0;0.0
1622281146.302539;0.0;0.0
1622281146.3102438;0.0;0.0
1622281146.3186648;0.0;0.0
1622281146.3267665;0.0;0.0
1622281146.335655;0.0;0.0
1622281146.3436654;0.0;0.0
1622281146.352405;0.0;0.0
1622281146.3605504;0.0;0.0
1622281146.3727064;0.0;0.0
1622281146.3829668;0.0;0.0
1622281146.3916674;0.0;0.0
1622281146.401276;0.0;0.0
1622281146.4104698;0.0;0.0
1622281146.4191103;0.0;0.0
1622281146.427307;0.0;0.0
1622281146.4394686;0.0;0.0
1622281146.4494357;0.0;0.0
1622281146.4586546;0.0;0.0
1622281146.4685097;0.0;0.0
1622281146.4785776;0.0;0.0
1622281146.4856658;0.0;0.0
1622281146.4977825;0.0;0.0
1622281146.507721;0.0;0.0
1622281146.5174177;0.0;0.0
1622281146.5267553;0.0;0.0
1622281146.5356503;0.0;0.0
1622281146.5440087;0.0;0.0
1622281146.5562477;0.0;0.0
1622281146.5660527;0.0;0.0
1622281146.5756743;0.0;0.0
1622281146.5847712;0.0;0.0
1622281146.5955412;0.0;0.0
1622281146.6036649;0.0;0.0
1622281146.6137474;0.0;0.0
1622281146.6245892;0.0;0.0
1622281146.6339467;0.0;0.0
1622281146.6432784;0.0;0.0
1622281146.6540267;0.0;0.0
1622281146.6621284;0.0;0.0
1622281146.672682;0.0;0.0
1622281146.6826904;0.0;0.0
1622281146.6926014;0.0;0.0
1622281146.7017791;0.0;0.0
1622281146.7106314;0.0;0.0
1622281146.7189505;0.0;0.0
1622281146.7273479;0.0;0.0
1622281146.7353444;0.0;0.0
1622281146.7436647;0.0;0.0
1622281146.7524276;0.0;0.0
1622281146.7602994;0.0;0.0
1622281146.7686853;0.0;0.0
1622281146.7786496;0.0;0.0
1622281146.7856266;0.0;0.0
1622281146.7978063;0.0;0.0
1622281146.8077385;0.0;0.0
1622281146.818251;0.0;0.0
1622281146.828855;0.0;0.0
1622281146.8371441;0.0;0.0
1622281146.8477988;0.0;0.0
1622281146.8577156;0.0;0.0
1622281146.8673549;0.0;0.0
1622281146.877078;0.0;0.0
1622281146.8875659;0.0;0.0
1622281146.8955414;0.0;0.0
1622281146.9062865;0.0;0.0
1622281146.9163382;0.0;0.0
1622281146.9258065;0.0;0.0
1622281146.93963;0.0;0.0
1622281146.9486053;0.0;0.0
1622281146.957531;0.0;0.0
1622281146.9668522;0.0;0.0
1622281146.9754186;0.0;0.0
1622281146.9848645;0.0;0.0
1622281146.9952998;0.0;0.0
1622281147.0015733;0.0;0.0
1622281147.0102777;0.0;0.0
1622281147.018632;0.0;0.0
1622281147.0309405;0.0;0.0
1622281147.0409021;0.0;0.0
1622281147.049765;0.0;0.0
1622281147.058718;0.0;0.0
1622281147.0678208;0.0;0.0
1622281147.0774345;0.0;0.0
1622281147.0895295;0.0;0.0
1622281147.0993216;0.0;0.0
1622281147.1084034;0.0;0.0
1622281147.1176167;0.0;0.0
1622281147.1271403;0.0;0.0
1622281147.139504;0.0;0.0
1622281147.149391;0.0;0.0
1622281147.1578078;0.0;0.0
1622281147.1668622;0.0;0.0
1622281147.1759768;0.0;0.0
1622281147.1854172;0.0;0.0
1622281147.1949713;0.0;0.0
1622281147.2035522;0.0;0.0
1622281147.2145329;0.0;0.0
1622281147.2243593;0.0;0.0
1622281147.233451;0.0;0.0
1622281147.2426612;0.0;0.0
1622281147.2518737;0.0;0.0
1622281147.2597563;0.0;0.0
1622281147.2691584;0.0;0.0
1622281147.2768636;0.0;0.0
1622281147.2855136;0.0;0.0
1622281147.2940772;0.0;0.0
1622281147.301816;0.0;0.0
1622281147.3103278;0.0;0.0
1622281147.318704;0.0;0.0
1622281147.3270388;0.0;0.0
1622281147.3355193;0.0;0.0
1622281147.34389;0.0;0.0
1622281147.3515265;0.0;0.0
1622281147.362063;0.0;0.0
1622281147.3689651;0.0;0.0
1622281147.3807251;0.0;0.0
1622281147.391042;0.0;0.0
1622281147.3998237;0.0;0.0
1622281147.4091969;0.0;0.0
1622281147.4190683;0.0;0.0
1622281147.4308174;0.0;0.0
1622281147.4410193;0.0;0.0
1622281147.4500873;0.0;0.0
1622281147.4594285;0.0;0.0
1622281147.4691937;0.0;0.0
1622281147.47738;0.0;0.0
1622281147.489707;0.0;0.0
1622281147.4997308;0.0;0.0
1622281147.5089972;0.0;0.0
1622281147.5186856;0.0;0.0
1622281147.5275333;0.0;0.0
1622281147.535637;0.0;0.0
1622281147.5478141;0.0;0.0
1622281147.557959;0.0;0.0
1622281147.5676274;0.0;0.0
1622281147.5774543;0.0;0.0
1622281147.5897658;0.0;0.0
1622281147.5996282;0.0;0.0
1622281147.609352;0.0;0.0
1622281147.6191726;0.0;0.0
1622281147.631375;0.0;0.0
1622281147.6413593;0.0;0.0
1622281147.650319;0.0;0.0
1622281147.6603594;0.0;0.0
1622281147.6692908;0.0;0.0
1622281147.6775699;0.0;0.0
1622281147.6897948;0.0;0.0
1622281147.6999962;0.0;0.0
1622281147.709729;0.0;0.0
1622281147.7205741;0.0;0.0
1622281147.7286928;0.0;0.0
1622281147.7397916;0.0;0.0
1622281147.749741;0.0;0.0
1622281147.7593973;0.0;0.0
1622281147.7692485;0.0;0.0
1622281147.7807314;0.0;0.0
1622281147.7906406;0.0;0.0
1622281147.8000405;0.0;0.0
1622281147.8098066;0.0;0.0
1622281147.8206456;0.0;0.0
1622281147.8286948;0.0;0.0
1622281147.839779;0.0;0.0
1622281147.8497014;0.0;0.0
1622281147.8594868;0.0;0.0
1622281147.8693538;0.0;0.0
1622281147.8775923;0.0;0.0
1622281147.8897998;0.0;0.0
1622281147.8997872;0.0;0.0
1622281147.9094827;0.0;0.0
1622281147.9186854;0.0;0.0
1622281147.92678;0.0;0.0
1622281147.935692;0.0;0.0
1622281147.9455996;0.0;0.0
1622281147.9526873;0.0;0.0
1622281147.9648073;0.0;0.0
1622281147.9747806;0.0;0.0
1622281147.9838083;0.0;0.0
1622281147.9937696;0.0;0.0
1622281148.0026333;0.0;0.0
1622281148.01055;0.0;0.0
1622281148.0228262;0.0;0.0
1622281148.0330098;0.0;0.0
